FAIL WARN PASS SKIP TIMEOUT NOT RUN INCOMPLETE ABORT CRASH
 
xe-2198-9bcce25c88a853967702ceae9f9ef35d2c0e7ee8
igt@kms_pipe_crc_basic@compare-crc-sanitycheck-nv12
igt@kms_pipe_crc_basic@compare-crc-sanitycheck-nv12
xe-2198-9bcce25c88a853967702ceae9f9ef35d2c0e7ee8

Starting subtest: compare-crc-sanitycheck-nv12
Starting dynamic subtest: pipe-A-DP-1
Dynamic subtest pipe-A-DP-1: SUCCESS (0.825s)
Starting dynamic subtest: pipe-B-DP-6
Dynamic subtest pipe-B-DP-6: SUCCESS (4.701s)
Starting dynamic subtest: pipe-C-DP-1
(kms_pipe_crc_basic:4408) igt_kms-CRITICAL: Test assertion failure function ig...
(kms_pipe_crc_basic:4408) igt_kms-CRITICAL: Failed assertion: ret == 0
(kms_pipe_crc_basic:4408) igt_kms-CRITICAL: Last errno: 2, No such file or dir...
(kms_pipe_crc_basic:4408) igt_kms-CRITICAL: error: -2 != 0
Dynamic subtest pipe-C-DP-1 failed.
**** DEBUG ****
(kms_pipe_crc_basic:4408) igt_kms-DEBUG: display:     SetProp plane B.1 "COLOR...
(kms_pipe_crc_basic:4408) igt_kms-DEBUG: display:     SetProp plane B.1 "COLOR...
(kms_pipe_crc_basic:4408) igt_kms-DEBUG: display:     SetProp plane B.1 "pixel...
(kms_pipe_crc_basic:4408) igt_kms-DEBUG: display:     SetProp plane B.1 "alpha...
(kms_pipe_crc_basic:4408) igt_kms-DEBUG: display:     SetProp plane B.1 "FB_DA...
...
igt@kms_pipe_crc_basic@read-crc
igt@kms_pipe_crc_basic@read-crc
xe-2198-9bcce25c88a853967702ceae9f9ef35d2c0e7ee8

Starting subtest: read-crc
Starting dynamic subtest: pipe-A-DP-1
Dynamic subtest pipe-A-DP-1: SUCCESS (0.858s)
Starting dynamic subtest: pipe-B-DP-6
(kms_pipe_crc_basic:4608) igt_kms-CRITICAL: Test assertion failure function ig...
(kms_pipe_crc_basic:4608) igt_kms-CRITICAL: Failed assertion: ret == 0
(kms_pipe_crc_basic:4608) igt_kms-CRITICAL: Last errno: 2, No such file or dir...
(kms_pipe_crc_basic:4608) igt_kms-CRITICAL: error: -2 != 0
Dynamic subtest pipe-B-DP-6 failed.
**** DEBUG ****
(kms_pipe_crc_basic:4608) igt_kms-DEBUG: display:     SetProp plane B.1 "COLOR...
(kms_pipe_crc_basic:4608) igt_kms-DEBUG: display:     SetProp plane B.1 "COLOR...
(kms_pipe_crc_basic:4608) igt_kms-DEBUG: display:     SetProp plane B.1 "pixel...
(kms_pipe_crc_basic:4608) igt_kms-DEBUG: display:     SetProp plane B.1 "alpha...
(kms_pipe_crc_basic:4608) igt_kms-DEBUG: display:     SetProp plane B.1 "FB_DA...
(kms_pipe_crc_basic:4608) igt_kms-DEBUG: display:     SetProp plane B.1 "SCALI...
(kms_pipe_crc_basic:4608) igt_kms-DEBUG: Test requirement passed: plane_idx >=...
...
igt@xe_ccs@suspend-resume
D igt@xe_ccs@suspend-resume
xe-2198-9bcce25c88a853967702ceae9f9ef35d2c0e7ee8

<4> [296.338059] xe 0000:00:02.0: [drm] drm_WARN_ON(!mgr->mst_state || !mgr->m...
<4> [296.338115] WARNING: CPU: 5 PID: 73 at drivers/gpu/drm/display/drm_dp_mst...
<4> [296.338131] Modules linked in: snd_hda_codec_hdmi snd_hda_intel xe drm_gp...
<4> [296.338353] RIP: 0010:drm_dp_mst_topology_queue_probe+0xce/0xe0 [drm_disp...
<4> [296.338415]  ? drm_dp_mst_topology_queue_probe+0xce/0xe0 [drm_display_hel...
<4> [296.338452]  ? drm_dp_mst_topology_queue_probe+0xce/0xe0 [drm_display_hel...
<4> [296.338461]  ? drm_dp_mst_topology_queue_probe+0xce/0xe0 [drm_display_hel...
<4> [296.338469]  intel_mst_pre_enable_dp+0x237/0x2c0 [xe]
<4> [296.338558]  intel_encoders_pre_enable+0x82/0xa0 [xe]
<4> [296.338737]  intel_enable_crtc+0xeb/0x110 [xe]
<4> [296.338910]  intel_atomic_commit_tail+0x9b3/0x1770 [xe]
<4> [296.339002]  intel_atomic_commit+0x2b9/0x300 [xe]
<4> [296.339084]  ? intel_atomic_commit+0x2b9/0x300 [xe]
<4> [296.339169]  drm_atomic_commit+0xad/0xe0 [drm]
<4> [296.339209]  ? __pfx___drm_printfn_info+0x10/0x10 [drm]
<4> [296.339240]  drm_atomic_helper_commit_duplicated_state+0xc3/0xe0 [drm_kms...
<4> [296.339258]  __intel_display_driver_resume+0x8d/0xf0 [xe]
...
igt@xe_exec_fault_mode@many-execqueues-bindexecqueue-userptr-invalidate-race-prefetch
igt@xe_exec_fault_mode@many-execqueues-bindexecqueue-userptr-invalidate-race-prefetch
xe-2198-9bcce25c88a853967702ceae9f9ef35d2c0e7ee8

Starting subtest: many-execqueues-bindexecqueue-userptr-invalidate-race-prefetch
(xe_exec_fault_mode:29317) CRITICAL: Test assertion failure function test_exec...
(xe_exec_fault_mode:29317) CRITICAL: Failed assertion: __xe_wait_ufence(fd, &d...
(xe_exec_fault_mode:29317) CRITICAL: Last errno: 62, Timer expired
(xe_exec_fault_mode:29317) CRITICAL: error: -62 != 0
Subtest many-execqueues-bindexecqueue-userptr-invalidate-race-prefetch failed.
**** DEBUG ****
(xe_exec_fault_mode:29317) DEBUG: test_exec running on: DRM_XE_ENGINE_CLASS_RE...
(xe_exec_fault_mode:29317) DEBUG: test_exec running on: DRM_XE_ENGINE_CLASS_COPY
(xe_exec_fault_mode:29317) DEBUG: test_exec running on: DRM_XE_ENGINE_CLASS_CO...
(xe_exec_fault_mode:29317) DEBUG: test_exec running on: DRM_XE_ENGINE_CLASS_VI...
(xe_exec_fault_mode:29317) CRITICAL: Test assertion failure function test_exec...
(xe_exec_fault_mode:29317) CRITICAL: Failed assertion: __xe_wait_ufence(fd, &d...
(xe_exec_fault_mode:29317) CRITICAL: Last errno: 62, Timer expired
(xe_exec_fault_mode:29317) CRITICAL: error: -62 != 0
(xe_exec_fault_mode:29317) igt_core-INFO: Stack trace:
(xe_exec_fault_mode:29317) igt_core-INFO:   #0 ../lib/igt_core.c:2051 __igt_fa...
...
igt@kms_big_fb@4-tiled-max-hw-stride-64bpp-rotate-0-hflip-async-flip
igt@kms_big_fb@4-tiled-max-hw-stride-64bpp-rotate-0-hflip-async-flip
xe-2198-9bcce25c88a853967702ceae9f9ef35d2c0e7ee8

Starting subtest: 4-tiled-max-hw-stride-64bpp-rotate-0-hflip-async-flip
(kms_big_fb:3771) igt_kms-CRITICAL: Test assertion failure function igt_displa...
(kms_big_fb:3771) igt_kms-CRITICAL: Failed assertion: ret == 0
(kms_big_fb:3771) igt_kms-CRITICAL: Last errno: 22, Invalid argument
(kms_big_fb:3771) igt_kms-CRITICAL: error: -22 != 0
Subtest 4-tiled-max-hw-stride-64bpp-rotate-0-hflip-async-flip failed.
**** DEBUG ****
(kms_big_fb:3771) intel_batchbuffer-DEBUG:   [2]: handle: 6, offset: ffffde1a6...
(kms_big_fb:3771) intel_batchbuffer-DEBUG: bind_ops: UNMAP
(kms_big_fb:3771) intel_batchbuffer-DEBUG:   [0]: handle: 0, offset: ffffffffe...
(kms_big_fb:3771) intel_batchbuffer-DEBUG:   [1]: handle: 0, offset: ffffde3fe...
(kms_big_fb:3771) intel_batchbuffer-DEBUG:   [2]: handle: 0, offset: ffffde1a6...
(kms_big_fb:3771) intel_batchbuffer-DEBUG: bind_ops: MAP
(kms_big_fb:3771) intel_batchbuffer-DEBUG:   [0]: handle: 1, offset: ffffffffe...
(kms_big_fb:3771) intel_batchbuffer-DEBUG:   [1]: handle: 7, offset: ffffde3fe...
(kms_big_fb:3771) intel_batchbuffer-DEBUG:   [2]: handle: 6, offset: ffffde1a6...
(kms_big_fb:3771) intel_batchbuffer-DEBUG: bind_ops: UNMAP
...
igt@kms_plane_cursor@primary
igt@kms_plane_cursor@primary
xe-2198-9bcce25c88a853967702ceae9f9ef35d2c0e7ee8

Starting subtest: primary
Starting dynamic subtest: pipe-A-DP-1-size-64
(kms_plane_cursor:5335) igt_pipe_crc-CRITICAL: Test assertion failure function...
(kms_plane_cursor:5335) igt_pipe_crc-CRITICAL: Failed assertion: !mismatch || ...
Dynamic subtest pipe-A-DP-1-size-64 failed.
**** DEBUG ****
(kms_plane_cursor:5335) igt_kms-DEBUG: plane B.4: Setting property "COLOR_RANG...
(kms_plane_cursor:5335) igt_kms-DEBUG: plane B.4: Setting property "pixel blen...
(kms_plane_cursor:5335) igt_kms-DEBUG: plane B.4: Setting property "alpha" to ...
(kms_plane_cursor:5335) igt_kms-DEBUG: plane B.4: Setting property "FB_DAMAGE_...
(kms_plane_cursor:5335) igt_kms-DEBUG: plane B.4: Setting property "SCALING_FI...
(kms_plane_cursor:5335) igt_kms-DEBUG: display:     populating plane data: B.5...
(kms_plane_cursor:5335) igt_kms-DEBUG: plane B.5: Setting property "SRC_X" to ...
(kms_plane_cursor:5335) igt_kms-DEBUG: plane B.5: Setting property "SRC_Y" to ...
(kms_plane_cursor:5335) igt_kms-DEBUG: plane B.5: Setting property "SRC_W" to ...
(kms_plane_cursor:5335) igt_kms-DEBUG: plane B.5: Setting property "SRC_H" to ...
(kms_plane_cursor:5335) igt_kms-DEBUG: plane B.5: Setting property "CRTC_X" to...
...
igt@kms_flip@2x-absolute-wf_vblank
igt@kms_flip@2x-absolute-wf_vblank
xe-2198-9bcce25c88a853967702ceae9f9ef35d2c0e7ee8

Starting subtest: 2x-absolute-wf_vblank
Starting dynamic subtest: AB-DP1-DP6
Dynamic subtest AB-DP1-DP6: SUCCESS (11.008s)
Starting dynamic subtest: AC-DP1-DP6
Dynamic subtest AC-DP1-DP6: SUCCESS (10.913s)
Starting dynamic subtest: BC-DP1-DP6
(kms_flip:3543) CRITICAL: Test assertion failure function check_state, file .....
(kms_flip:3543) CRITICAL: Failed assertion: timercmp(&es->last_received_ts, &e...
(kms_flip:3543) CRITICAL: vblank ts before the vblank was issued!
timerdiff -0.003766
Dynamic subtest BC-DP1-DP6 failed.
**** DEBUG ****
(kms_flip:3543) igt_fb-DEBUG: igt_create_fb_with_bo_size(width=3840, height=21...
(kms_flip:3543) igt_fb-DEBUG: igt_create_fb_with_bo_size(handle=1, pitch=15360)
(kms_flip:3543) ioctl_wrappers-DEBUG: Test requirement passed: igt_has_fb_modi...
(kms_flip:3543) igt_fb-DEBUG: igt_create_fb_with_bo_size(width=3840, height=21...
(kms_flip:3543) igt_fb-DEBUG: igt_create_fb_with_bo_size(handle=2, pitch=15360)
...
igt@kms_properties@connector-properties-legacy
igt@kms_properties@connector-properties-legacy
xe-2198-9bcce25c88a853967702ceae9f9ef35d2c0e7ee8

Starting subtest: connector-properties-legacy
Starting dynamic subtest: pipe-A-DP-1
Dynamic subtest pipe-A-DP-1: SUCCESS (1.983s)
Starting dynamic subtest: pipe-A-DP-7
(kms_properties:1936) CRITICAL: Test assertion failure function max_bpc_prop_t...
(kms_properties:1936) CRITICAL: Failed assertion: ret == 0
(kms_properties:1936) CRITICAL: Last errno: 22, Invalid argument
(kms_properties:1936) CRITICAL: error: -22 != 0
Dynamic subtest pipe-A-DP-7 failed.
**** DEBUG ****
(kms_properties:1936) igt_kms-DEBUG: plane B.2: Setting property "CRTC_Y" to 0...
(kms_properties:1936) igt_kms-DEBUG: plane B.2: Setting property "CRTC_W" to 0...
(kms_properties:1936) igt_kms-DEBUG: plane B.2: Setting property "CRTC_H" to 0...
(kms_properties:1936) igt_kms-DEBUG: plane B.2: Setting property "FB_ID" to 0x...
(kms_properties:1936) igt_kms-DEBUG: plane B.2: Setting property "CRTC_ID" to ...
(kms_properties:1936) igt_kms-DEBUG: plane B.2: Setting property "rotation" to...
(kms_properties:1936) igt_kms-DEBUG: plane B.2: Setting property "COLOR_ENCODI...
...
igt@kms_pm_rpm@universal-planes-dpms
igt@kms_pm_rpm@universal-planes-dpms
xe-2198-9bcce25c88a853967702ceae9f9ef35d2c0e7ee8

Starting subtest: universal-planes-dpms
Starting dynamic subtest: plane-32
(kms_pm_rpm:1894) igt_kms-CRITICAL: Test assertion failure function kmstest_se...
(kms_pm_rpm:1894) igt_kms-CRITICAL: Failed assertion: drmModeConnectorSetPrope...
(kms_pm_rpm:1894) igt_kms-CRITICAL: Last errno: 2, No such file or directory
Dynamic subtest plane-32 failed.
**** DEBUG ****
(kms_pm_rpm:1894) igt_pm-DEBUG: (status = __igt_get_runtime_pm_status(fd)) == ...
(kms_pm_rpm:1894) igt_fb-DEBUG: igt_create_fb_with_bo_size(width=3840, height=...
(kms_pm_rpm:1894) igt_fb-DEBUG: igt_create_fb_with_bo_size(handle=2, pitch=153...
(kms_pm_rpm:1894) ioctl_wrappers-DEBUG: Test requirement passed: igt_has_fb_mo...
(kms_pm_rpm:1894) igt_fb-DEBUG: igt_create_fb_with_bo_size(width=3840, height=...
(kms_pm_rpm:1894) igt_fb-DEBUG: igt_create_fb_with_bo_size(handle=3, pitch=153...
(kms_pm_rpm:1894) ioctl_wrappers-DEBUG: Test requirement passed: igt_has_fb_mo...
(kms_pm_rpm:1894) igt_pm-DEBUG: (status = __igt_get_runtime_pm_status(fd)) == ...
(kms_pm_rpm:1894) igt_kms-CRITICAL: Test assertion failure function kmstest_se...
(kms_pm_rpm:1894) igt_kms-CRITICAL: Failed assertion: drmModeConnectorSetPrope...
...
igt@kms_pm_rpm@universal-planes-dpms@plane-32
igt@kms_pm_rpm@universal-planes-dpms@plane-32
xe-2198-9bcce25c88a853967702ceae9f9ef35d2c0e7ee8

Starting subtest: universal-planes-dpms
Starting dynamic subtest: plane-32
(kms_pm_rpm:1894) igt_kms-CRITICAL: Test assertion failure function kmstest_se...
(kms_pm_rpm:1894) igt_kms-CRITICAL: Failed assertion: drmModeConnectorSetPrope...
(kms_pm_rpm:1894) igt_kms-CRITICAL: Last errno: 2, No such file or directory
Dynamic subtest plane-32 failed.
**** DEBUG ****
(kms_pm_rpm:1894) igt_pm-DEBUG: (status = __igt_get_runtime_pm_status(fd)) == ...
(kms_pm_rpm:1894) igt_fb-DEBUG: igt_create_fb_with_bo_size(width=3840, height=...
(kms_pm_rpm:1894) igt_fb-DEBUG: igt_create_fb_with_bo_size(handle=2, pitch=153...
(kms_pm_rpm:1894) ioctl_wrappers-DEBUG: Test requirement passed: igt_has_fb_mo...
(kms_pm_rpm:1894) igt_fb-DEBUG: igt_create_fb_with_bo_size(width=3840, height=...
(kms_pm_rpm:1894) igt_fb-DEBUG: igt_create_fb_with_bo_size(handle=3, pitch=153...
(kms_pm_rpm:1894) ioctl_wrappers-DEBUG: Test requirement passed: igt_has_fb_mo...
(kms_pm_rpm:1894) igt_pm-DEBUG: (status = __igt_get_runtime_pm_status(fd)) == ...
(kms_pm_rpm:1894) igt_kms-CRITICAL: Test assertion failure function kmstest_se...
(kms_pm_rpm:1894) igt_kms-CRITICAL: Failed assertion: drmModeConnectorSetPrope...
...
igt@kms_pm_rpm@universal-planes-dpms@plane-41
igt@kms_pm_rpm@universal-planes-dpms@plane-41
xe-2198-9bcce25c88a853967702ceae9f9ef35d2c0e7ee8

Starting dynamic subtest: plane-41
(kms_pm_rpm:1894) igt_kms-CRITICAL: Test assertion failure function kmstest_se...
(kms_pm_rpm:1894) igt_kms-CRITICAL: Failed assertion: drmModeConnectorSetPrope...
(kms_pm_rpm:1894) igt_kms-CRITICAL: Last errno: 2, No such file or directory
Dynamic subtest plane-41 failed.
**** DEBUG ****
(kms_pm_rpm:1894) igt_pm-DEBUG: (status = __igt_get_runtime_pm_status(fd)) == ...
(kms_pm_rpm:1894) igt_fb-DEBUG: igt_create_fb_with_bo_size(width=64, height=64...
(kms_pm_rpm:1894) igt_fb-DEBUG: igt_create_fb_with_bo_size(handle=4, pitch=256)
(kms_pm_rpm:1894) ioctl_wrappers-DEBUG: Test requirement passed: igt_has_fb_mo...
(kms_pm_rpm:1894) igt_fb-DEBUG: igt_create_fb_with_bo_size(width=64, height=64...
(kms_pm_rpm:1894) igt_fb-DEBUG: igt_create_fb_with_bo_size(handle=5, pitch=256)
(kms_pm_rpm:1894) ioctl_wrappers-DEBUG: Test requirement passed: igt_has_fb_mo...
(kms_pm_rpm:1894) igt_pm-DEBUG: (status = __igt_get_runtime_pm_status(fd)) == ...
(kms_pm_rpm:1894) igt_kms-CRITICAL: Test assertion failure function kmstest_se...
(kms_pm_rpm:1894) igt_kms-CRITICAL: Failed assertion: drmModeConnectorSetPrope...
(kms_pm_rpm:1894) igt_kms-CRITICAL: Last errno: 2, No such file or directory
...
igt@kms_pm_rpm@universal-planes-dpms@plane-50
igt@kms_pm_rpm@universal-planes-dpms@plane-50
xe-2198-9bcce25c88a853967702ceae9f9ef35d2c0e7ee8

Starting dynamic subtest: plane-50
(kms_pm_rpm:1894) igt_kms-CRITICAL: Test assertion failure function kmstest_se...
(kms_pm_rpm:1894) igt_kms-CRITICAL: Failed assertion: drmModeConnectorSetPrope...
(kms_pm_rpm:1894) igt_kms-CRITICAL: Last errno: 2, No such file or directory
Dynamic subtest plane-50 failed.
**** DEBUG ****
(kms_pm_rpm:1894) igt_pm-DEBUG: (status = __igt_get_runtime_pm_status(fd)) == ...
(kms_pm_rpm:1894) igt_fb-DEBUG: igt_create_fb_with_bo_size(width=64, height=64...
(kms_pm_rpm:1894) igt_fb-DEBUG: igt_create_fb_with_bo_size(handle=6, pitch=256)
(kms_pm_rpm:1894) ioctl_wrappers-DEBUG: Test requirement passed: igt_has_fb_mo...
(kms_pm_rpm:1894) igt_fb-DEBUG: igt_create_fb_with_bo_size(width=64, height=64...
(kms_pm_rpm:1894) igt_fb-DEBUG: igt_create_fb_with_bo_size(handle=7, pitch=256)
(kms_pm_rpm:1894) ioctl_wrappers-DEBUG: Test requirement passed: igt_has_fb_mo...
(kms_pm_rpm:1894) igt_pm-DEBUG: (status = __igt_get_runtime_pm_status(fd)) == ...
(kms_pm_rpm:1894) igt_kms-CRITICAL: Test assertion failure function kmstest_se...
(kms_pm_rpm:1894) igt_kms-CRITICAL: Failed assertion: drmModeConnectorSetPrope...
(kms_pm_rpm:1894) igt_kms-CRITICAL: Last errno: 2, No such file or directory
...
igt@kms_pm_rpm@universal-planes-dpms@plane-59
igt@kms_pm_rpm@universal-planes-dpms@plane-59
xe-2198-9bcce25c88a853967702ceae9f9ef35d2c0e7ee8

Starting dynamic subtest: plane-59
(kms_pm_rpm:1894) igt_kms-CRITICAL: Test assertion failure function kmstest_se...
(kms_pm_rpm:1894) igt_kms-CRITICAL: Failed assertion: drmModeConnectorSetPrope...
(kms_pm_rpm:1894) igt_kms-CRITICAL: Last errno: 2, No such file or directory
Dynamic subtest plane-59 failed.
**** DEBUG ****
(kms_pm_rpm:1894) igt_pm-DEBUG: (status = __igt_get_runtime_pm_status(fd)) == ...
(kms_pm_rpm:1894) igt_fb-DEBUG: igt_create_fb_with_bo_size(width=64, height=64...
(kms_pm_rpm:1894) igt_fb-DEBUG: igt_create_fb_with_bo_size(handle=8, pitch=256)
(kms_pm_rpm:1894) ioctl_wrappers-DEBUG: Test requirement passed: igt_has_fb_mo...
(kms_pm_rpm:1894) igt_fb-DEBUG: igt_create_fb_with_bo_size(width=64, height=64...
(kms_pm_rpm:1894) igt_fb-DEBUG: igt_create_fb_with_bo_size(handle=9, pitch=256)
(kms_pm_rpm:1894) ioctl_wrappers-DEBUG: Test requirement passed: igt_has_fb_mo...
(kms_pm_rpm:1894) igt_pm-DEBUG: (status = __igt_get_runtime_pm_status(fd)) == ...
(kms_pm_rpm:1894) igt_kms-CRITICAL: Test assertion failure function kmstest_se...
(kms_pm_rpm:1894) igt_kms-CRITICAL: Failed assertion: drmModeConnectorSetPrope...
(kms_pm_rpm:1894) igt_kms-CRITICAL: Last errno: 2, No such file or directory
...
igt@kms_pm_rpm@universal-planes-dpms@plane-68
igt@kms_pm_rpm@universal-planes-dpms@plane-68
xe-2198-9bcce25c88a853967702ceae9f9ef35d2c0e7ee8

Starting dynamic subtest: plane-68
(kms_pm_rpm:1894) igt_kms-CRITICAL: Test assertion failure function kmstest_se...
(kms_pm_rpm:1894) igt_kms-CRITICAL: Failed assertion: drmModeConnectorSetPrope...
(kms_pm_rpm:1894) igt_kms-CRITICAL: Last errno: 2, No such file or directory
Dynamic subtest plane-68 failed.
**** DEBUG ****
(kms_pm_rpm:1894) igt_pm-DEBUG: (status = __igt_get_runtime_pm_status(fd)) == ...
(kms_pm_rpm:1894) igt_fb-DEBUG: igt_create_fb_with_bo_size(width=64, height=64...
(kms_pm_rpm:1894) igt_fb-DEBUG: igt_create_fb_with_bo_size(handle=10, pitch=256)
(kms_pm_rpm:1894) ioctl_wrappers-DEBUG: Test requirement passed: igt_has_fb_mo...
(kms_pm_rpm:1894) igt_fb-DEBUG: igt_create_fb_with_bo_size(width=64, height=64...
(kms_pm_rpm:1894) igt_fb-DEBUG: igt_create_fb_with_bo_size(handle=11, pitch=256)
(kms_pm_rpm:1894) ioctl_wrappers-DEBUG: Test requirement passed: igt_has_fb_mo...
(kms_pm_rpm:1894) igt_pm-DEBUG: (status = __igt_get_runtime_pm_status(fd)) == ...
(kms_pm_rpm:1894) igt_kms-CRITICAL: Test assertion failure function kmstest_se...
(kms_pm_rpm:1894) igt_kms-CRITICAL: Failed assertion: drmModeConnectorSetPrope...
(kms_pm_rpm:1894) igt_kms-CRITICAL: Last errno: 2, No such file or directory
...
igt@kms_pm_rpm@universal-planes-dpms@plane-77
igt@kms_pm_rpm@universal-planes-dpms@plane-77
xe-2198-9bcce25c88a853967702ceae9f9ef35d2c0e7ee8

Starting dynamic subtest: plane-77
(kms_pm_rpm:1894) igt_kms-CRITICAL: Test assertion failure function kmstest_se...
(kms_pm_rpm:1894) igt_kms-CRITICAL: Failed assertion: drmModeConnectorSetPrope...
(kms_pm_rpm:1894) igt_kms-CRITICAL: Last errno: 2, No such file or directory
Dynamic subtest plane-77 failed.
**** DEBUG ****
(kms_pm_rpm:1894) igt_pm-DEBUG: (status = __igt_get_runtime_pm_status(fd)) == ...
(kms_pm_rpm:1894) igt_fb-DEBUG: igt_create_fb_with_bo_size(width=64, height=64...
(kms_pm_rpm:1894) igt_fb-DEBUG: igt_create_fb_with_bo_size(handle=12, pitch=256)
(kms_pm_rpm:1894) ioctl_wrappers-DEBUG: Test requirement passed: igt_has_fb_mo...
(kms_pm_rpm:1894) igt_fb-DEBUG: igt_create_fb_with_bo_size(width=64, height=64...
(kms_pm_rpm:1894) igt_fb-DEBUG: igt_create_fb_with_bo_size(handle=13, pitch=256)
(kms_pm_rpm:1894) ioctl_wrappers-DEBUG: Test requirement passed: igt_has_fb_mo...
(kms_pm_rpm:1894) igt_pm-DEBUG: (status = __igt_get_runtime_pm_status(fd)) == ...
(kms_pm_rpm:1894) igt_kms-CRITICAL: Test assertion failure function kmstest_se...
(kms_pm_rpm:1894) igt_kms-CRITICAL: Failed assertion: drmModeConnectorSetPrope...
(kms_pm_rpm:1894) igt_kms-CRITICAL: Last errno: 2, No such file or directory
...
igt@xe_exec_fault_mode@many-userptr-invalidate-race
igt@xe_exec_fault_mode@many-userptr-invalidate-race
xe-2198-9bcce25c88a853967702ceae9f9ef35d2c0e7ee8

Starting subtest: many-userptr-invalidate-race
(xe_exec_fault_mode:31662) CRITICAL: Test assertion failure function test_exec...
(xe_exec_fault_mode:31662) CRITICAL: Failed assertion: __xe_wait_ufence(fd, &d...
(xe_exec_fault_mode:31662) CRITICAL: Last errno: 62, Timer expired
(xe_exec_fault_mode:31662) CRITICAL: error: -62 != 0
Subtest many-userptr-invalidate-race failed.
**** DEBUG ****
(xe_exec_fault_mode:31662) DEBUG: test_exec running on: DRM_XE_ENGINE_CLASS_RE...
(xe_exec_fault_mode:31662) DEBUG: test_exec running on: DRM_XE_ENGINE_CLASS_COPY
(xe_exec_fault_mode:31662) DEBUG: test_exec running on: DRM_XE_ENGINE_CLASS_CO...
(xe_exec_fault_mode:31662) DEBUG: test_exec running on: DRM_XE_ENGINE_CLASS_VI...
(xe_exec_fault_mode:31662) CRITICAL: Test assertion failure function test_exec...
(xe_exec_fault_mode:31662) CRITICAL: Failed assertion: __xe_wait_ufence(fd, &d...
(xe_exec_fault_mode:31662) CRITICAL: Last errno: 62, Timer expired
(xe_exec_fault_mode:31662) CRITICAL: error: -62 != 0
(xe_exec_fault_mode:31662) igt_core-INFO: Stack trace:
(xe_exec_fault_mode:31662) igt_core-INFO:   #0 ../lib/igt_core.c:2051 __igt_fa...
...
igt@kms_dp_linktrain_fallback@dp-fallback
D igt@kms_dp_linktrain_fallback@dp-fallback
xe-2198-9bcce25c88a853967702ceae9f9ef35d2c0e7ee8

<3> [710.207406] xe 0000:00:02.0: [drm] *ERROR* Failed to read source OUI
igt@xe_exec_fault_mode@many-bindexecqueue-userptr-invalidate-race
igt@xe_exec_fault_mode@many-bindexecqueue-userptr-invalidate-race
xe-2198-9bcce25c88a853967702ceae9f9ef35d2c0e7ee8

Starting subtest: many-bindexecqueue-userptr-invalidate-race
(xe_exec_fault_mode:26842) CRITICAL: Test assertion failure function test_exec...
(xe_exec_fault_mode:26842) CRITICAL: Failed assertion: __xe_wait_ufence(fd, &d...
(xe_exec_fault_mode:26842) CRITICAL: Last errno: 62, Timer expired
(xe_exec_fault_mode:26842) CRITICAL: error: -62 != 0
Subtest many-bindexecqueue-userptr-invalidate-race failed.
**** DEBUG ****
(xe_exec_fault_mode:26842) DEBUG: test_exec running on: DRM_XE_ENGINE_CLASS_RE...
(xe_exec_fault_mode:26842) DEBUG: test_exec running on: DRM_XE_ENGINE_CLASS_COPY
(xe_exec_fault_mode:26842) DEBUG: test_exec running on: DRM_XE_ENGINE_CLASS_CO...
(xe_exec_fault_mode:26842) CRITICAL: Test assertion failure function test_exec...
(xe_exec_fault_mode:26842) CRITICAL: Failed assertion: __xe_wait_ufence(fd, &d...
(xe_exec_fault_mode:26842) CRITICAL: Last errno: 62, Timer expired
(xe_exec_fault_mode:26842) CRITICAL: error: -62 != 0
(xe_exec_fault_mode:26842) igt_core-INFO: Stack trace:
(xe_exec_fault_mode:26842) igt_core-INFO:   #0 ../lib/igt_core.c:2051 __igt_fa...
(xe_exec_fault_mode:26842) igt_core-INFO:   #1 ../tests/intel/xe_exec_fault_mo...
...
igt@kms_cursor_legacy@flip-vs-cursor-varying-size
igt@kms_cursor_legacy@flip-vs-cursor-varying-size
xe-2198-9bcce25c88a853967702ceae9f9ef35d2c0e7ee8

Starting subtest: flip-vs-cursor-varying-size
(kms_cursor_legacy:2563) CRITICAL: Test assertion failure function flip_vs_cur...
(kms_cursor_legacy:2563) CRITICAL: Failed assertion: kmstest_get_vblank(displa...
(kms_cursor_legacy:2563) CRITICAL: error: 23666 != 23547
Subtest flip-vs-cursor-varying-size failed.
**** DEBUG ****
(kms_cursor_legacy:2563) igt_kms-DEBUG: plane B.5: Setting property "SRC_W" to...
(kms_cursor_legacy:2563) igt_kms-DEBUG: plane B.5: Setting property "SRC_H" to...
(kms_cursor_legacy:2563) igt_kms-DEBUG: plane B.5: Setting property "CRTC_X" t...
(kms_cursor_legacy:2563) igt_kms-DEBUG: plane B.5: Setting property "CRTC_Y" t...
(kms_cursor_legacy:2563) igt_kms-DEBUG: plane B.5: Setting property "CRTC_W" t...
(kms_cursor_legacy:2563) igt_kms-DEBUG: plane B.5: Setting property "CRTC_H" t...
(kms_cursor_legacy:2563) igt_kms-DEBUG: plane B.5: Setting property "FB_ID" to...
(kms_cursor_legacy:2563) igt_kms-DEBUG: plane B.5: Setting property "CRTC_ID" ...
(kms_cursor_legacy:2563) igt_kms-DEBUG: plane B.5: Setting property "rotation"...
(kms_cursor_legacy:2563) igt_kms-DEBUG: plane B.5: Setting property "FB_DAMAGE...
(kms_cursor_legacy:2563) igt_kms-DEBUG: Pipe C: Setting property "CTM" to 0x0/0
...
igt@xe_pm@s2idle-mocs
D igt@xe_pm@s2idle-mocs
xe-2198-9bcce25c88a853967702ceae9f9ef35d2c0e7ee8

<4> [878.778794] xe 0000:00:02.0: [drm] drm_WARN_ON(!mgr->mst_state || !mgr->m...
<4> [878.778836] WARNING: CPU: 1 PID: 48874 at drivers/gpu/drm/display/drm_dp_...
<4> [878.778849] Modules linked in: vgem drm_shmem_helper xe snd_hda_codec_hdm...
<4> [878.779035] RIP: 0010:drm_dp_mst_topology_queue_probe+0xce/0xe0 [drm_disp...
<4> [878.779086]  ? drm_dp_mst_topology_queue_probe+0xce/0xe0 [drm_display_hel...
<4> [878.779114]  ? drm_dp_mst_topology_queue_probe+0xce/0xe0 [drm_display_hel...
<4> [878.779121]  ? drm_dp_mst_topology_queue_probe+0xce/0xe0 [drm_display_hel...
<4> [878.779128]  intel_mst_pre_enable_dp+0x237/0x2c0 [xe]
<4> [878.779204]  intel_encoders_pre_enable+0x82/0xa0 [xe]
<4> [878.779340]  intel_enable_crtc+0xeb/0x110 [xe]
<4> [878.779471]  intel_atomic_commit_tail+0x9b3/0x1770 [xe]
<4> [878.779544]  intel_atomic_commit+0x2b9/0x300 [xe]
<4> [878.779615]  ? intel_atomic_commit+0x2b9/0x300 [xe]
<4> [878.779687]  drm_atomic_commit+0xad/0xe0 [drm]
<4> [878.779716]  ? __pfx___drm_printfn_info+0x10/0x10 [drm]
<4> [878.779740]  drm_atomic_helper_commit_duplicated_state+0xc3/0xe0 [drm_kms...
<4> [878.779754]  __intel_display_driver_resume+0x8d/0xf0 [xe]
...
igt@xe_fault_injection@inject-fault-probe
D igt@xe_fault_injection@inject-fault-probe
xe-2198-9bcce25c88a853967702ceae9f9ef35d2c0e7ee8

<3> [449.165700] xe 0000:00:02.0: [drm] *ERROR* GT0: GuC init failed with -ENO...
<3> [449.165720] xe 0000:00:02.0: [drm] *ERROR* GT0: Failed to initialize uC (...
<3> [449.211574] xe 0000:00:02.0: [drm] *ERROR* GT0: GuC init failed with -ENO...
<3> [449.211591] xe 0000:00:02.0: [drm] *ERROR* GT0: Failed to initialize uC (...
<3> [449.246880] xe 0000:00:02.0: [drm] *ERROR* GT0: GuC init failed with -ENO...
<3> [449.246899] xe 0000:00:02.0: [drm] *ERROR* GT0: Failed to initialize uC (...
<3> [449.397139] xe 0000:00:02.0: [drm] *ERROR* GT0: GuC init failed with -ENO...
<3> [449.397176] xe 0000:00:02.0: [drm] *ERROR* GT0: Failed to initialize uC (...
<3> [449.504449] xe 0000:00:02.0: [drm] *ERROR* GT0: Failed to initialize uC (...
<3> [449.537546] xe 0000:00:02.0: [drm] *ERROR* GT0: GuC init failed with -ENO...
<3> [449.537559] xe 0000:00:02.0: [drm] *ERROR* GT0: Failed to initialize uC (...
igt@xe_fault_injection@inject-fault-probe@function-xe_guc_ads_init
D igt@xe_fault_injection@inject-fault-probe@function-xe_guc_ads_init
xe-2198-9bcce25c88a853967702ceae9f9ef35d2c0e7ee8

<3> [449.165700] xe 0000:00:02.0: [drm] *ERROR* GT0: GuC init failed with -ENO...
<3> [449.165720] xe 0000:00:02.0: [drm] *ERROR* GT0: Failed to initialize uC (...
igt@xe_fault_injection@inject-fault-probe@function-xe_guc_ct_init
D igt@xe_fault_injection@inject-fault-probe@function-xe_guc_ct_init
xe-2198-9bcce25c88a853967702ceae9f9ef35d2c0e7ee8

<3> [449.211574] xe 0000:00:02.0: [drm] *ERROR* GT0: GuC init failed with -ENO...
<3> [449.211591] xe 0000:00:02.0: [drm] *ERROR* GT0: Failed to initialize uC (...
igt@xe_fault_injection@inject-fault-probe@function-xe_guc_log_init
D igt@xe_fault_injection@inject-fault-probe@function-xe_guc_log_init
xe-2198-9bcce25c88a853967702ceae9f9ef35d2c0e7ee8

<3> [449.246880] xe 0000:00:02.0: [drm] *ERROR* GT0: GuC init failed with -ENO...
<3> [449.246899] xe 0000:00:02.0: [drm] *ERROR* GT0: Failed to initialize uC (...
igt@xe_fault_injection@inject-fault-probe@function-xe_uc_fw_init
D igt@xe_fault_injection@inject-fault-probe@function-xe_uc_fw_init
xe-2198-9bcce25c88a853967702ceae9f9ef35d2c0e7ee8

<3> [449.397139] xe 0000:00:02.0: [drm] *ERROR* GT0: GuC init failed with -ENO...
<3> [449.397176] xe 0000:00:02.0: [drm] *ERROR* GT0: Failed to initialize uC (...
igt@xe_fault_injection@inject-fault-probe@function-xe_wopcm_init
D igt@xe_fault_injection@inject-fault-probe@function-xe_wopcm_init
xe-2198-9bcce25c88a853967702ceae9f9ef35d2c0e7ee8

<3> [449.504449] xe 0000:00:02.0: [drm] *ERROR* GT0: Failed to initialize uC (...
igt@xe_fault_injection@inject-fault-probe@function-xe_guc_relay_init
D igt@xe_fault_injection@inject-fault-probe@function-xe_guc_relay_init
xe-2198-9bcce25c88a853967702ceae9f9ef35d2c0e7ee8

<3> [449.537546] xe 0000:00:02.0: [drm] *ERROR* GT0: GuC init failed with -ENO...
<3> [449.537559] xe 0000:00:02.0: [drm] *ERROR* GT0: Failed to initialize uC (...
igt@xe_drm_fdinfo@utilization-single-full-load-destroy-queue
igt@xe_drm_fdinfo@utilization-single-full-load-destroy-queue
xe-2198-9bcce25c88a853967702ceae9f9ef35d2c0e7ee8

Starting subtest: utilization-single-full-load-destroy-queue
(xe_drm_fdinfo:17668) CRITICAL: Test assertion failure function check_results,...
(xe_drm_fdinfo:17668) CRITICAL: Failed assertion: 95.0 < percent
(xe_drm_fdinfo:17668) CRITICAL: error: 95.000000 >= 0.000000
Subtest utilization-single-full-load-destroy-queue failed.
**** DEBUG ****
(xe_drm_fdinfo:17668) DEBUG: rcs: spinner started
(xe_drm_fdinfo:17668) DEBUG: rcs: spinner ended (timestamp=4797585)
(xe_drm_fdinfo:17668) DEBUG: rcs: sample 1: cycles 0, total_cycles 2472333456
(xe_drm_fdinfo:17668) DEBUG: rcs: sample 2: cycles 4797814, total_cycles 24771...
(xe_drm_fdinfo:17668) DEBUG: rcs: percent: 99.295221
(xe_drm_fdinfo:17668) DEBUG: bcs: spinner started
(xe_drm_fdinfo:17668) DEBUG: bcs: spinner ended (timestamp=4802163)
(xe_drm_fdinfo:17668) DEBUG: bcs: sample 1: cycles 0, total_cycles 2477228717
(xe_drm_fdinfo:17668) DEBUG: bcs: sample 2: cycles 0, total_cycles 2482054381
(xe_drm_fdinfo:17668) DEBUG: bcs: percent: 0.000000
(xe_drm_fdinfo:17668) CRITICAL: Test assertion failure function check_results,...
...
igt@kms_flip@dpms-vs-vblank-race-interruptible
D igt@kms_flip@dpms-vs-vblank-race-interruptible
xe-2198-9bcce25c88a853967702ceae9f9ef35d2c0e7ee8

<3> [413.510487] xe 0000:00:02.0: [drm] *ERROR* Failed to read source OUI
<3> [413.957849] xe 0000:00:02.0: [drm] *ERROR* Failed to read source OUI
igt@kms_pm_dc@dc6-dpms
igt@kms_pm_dc@dc6-dpms
xe-2198-9bcce25c88a853967702ceae9f9ef35d2c0e7ee8

Starting subtest: dc6-dpms
(kms_pm_dc:1453) CRITICAL: Test assertion failure function test_pkgc_state_dpm...
(kms_pm_dc:1453) CRITICAL: Failed assertion: cur_value > prev_value
(kms_pm_dc:1453) CRITICAL: PKGC10 is not achieved.
Subtest dc6-dpms failed.
**** DEBUG ****
(kms_pm_dc:1453) DEBUG: Test requirement passed: igt_pm_pc8_plus_residencies_e...
(kms_pm_dc:1453) DEBUG: Test requirement passed: !(len < 0)
(kms_pm_dc:1453) DEBUG: Test requirement passed: !(!str)
(kms_pm_dc:1453) DEBUG: Test requirement passed: !(len < 0)
(kms_pm_dc:1453) DEBUG: Test requirement passed: !(!str)
(kms_pm_dc:1453) DEBUG: Test requirement passed: !(len < 0)
(kms_pm_dc:1453) DEBUG: Test requirement passed: !(!str)
(kms_pm_dc:1453) DEBUG: Test requirement passed: !(len < 0)
(kms_pm_dc:1453) DEBUG: Test requirement passed: !(!str)
(kms_pm_dc:1453) DEBUG: Test requirement passed: !(len < 0)
(kms_pm_dc:1453) DEBUG: Test requirement passed: !(!str)
...
igt@xe_exec_fault_mode@many-execqueues-userptr-invalidate-race-prefetch
igt@xe_exec_fault_mode@many-execqueues-userptr-invalidate-race-prefetch
xe-2198-9bcce25c88a853967702ceae9f9ef35d2c0e7ee8

Starting subtest: many-execqueues-userptr-invalidate-race-prefetch
(xe_exec_fault_mode:31118) CRITICAL: Test assertion failure function test_exec...
(xe_exec_fault_mode:31118) CRITICAL: Failed assertion: __xe_wait_ufence(fd, &d...
(xe_exec_fault_mode:31118) CRITICAL: Last errno: 62, Timer expired
(xe_exec_fault_mode:31118) CRITICAL: error: -62 != 0
Subtest many-execqueues-userptr-invalidate-race-prefetch failed.
**** DEBUG ****
(xe_exec_fault_mode:31118) DEBUG: test_exec running on: DRM_XE_ENGINE_CLASS_RE...
(xe_exec_fault_mode:31118) DEBUG: test_exec running on: DRM_XE_ENGINE_CLASS_COPY
(xe_exec_fault_mode:31118) DEBUG: test_exec running on: DRM_XE_ENGINE_CLASS_CO...
(xe_exec_fault_mode:31118) DEBUG: test_exec running on: DRM_XE_ENGINE_CLASS_VI...
(xe_exec_fault_mode:31118) CRITICAL: Test assertion failure function test_exec...
(xe_exec_fault_mode:31118) CRITICAL: Failed assertion: __xe_wait_ufence(fd, &d...
(xe_exec_fault_mode:31118) CRITICAL: Last errno: 62, Timer expired
(xe_exec_fault_mode:31118) CRITICAL: error: -62 != 0
(xe_exec_fault_mode:31118) igt_core-INFO: Stack trace:
(xe_exec_fault_mode:31118) igt_core-INFO:   #0 ../lib/igt_core.c:2051 __igt_fa...
...
igt@kms_plane_cursor@overlay
igt@kms_plane_cursor@overlay
xe-2198-9bcce25c88a853967702ceae9f9ef35d2c0e7ee8

Starting subtest: overlay
Starting dynamic subtest: pipe-A-DP-1-size-64
(kms_plane_cursor:5150) igt_pipe_crc-CRITICAL: Test assertion failure function...
(kms_plane_cursor:5150) igt_pipe_crc-CRITICAL: Failed assertion: !mismatch || ...
Dynamic subtest pipe-A-DP-1-size-64 failed.
**** DEBUG ****
(kms_plane_cursor:5150) igt_kms-DEBUG: plane C.1: Setting property "SRC_Y" to ...
(kms_plane_cursor:5150) igt_kms-DEBUG: plane C.1: Setting property "SRC_W" to ...
(kms_plane_cursor:5150) igt_kms-DEBUG: plane C.1: Setting property "SRC_H" to ...
(kms_plane_cursor:5150) igt_kms-DEBUG: plane C.1: Setting property "CRTC_X" to...
(kms_plane_cursor:5150) igt_kms-DEBUG: plane C.1: Setting property "CRTC_Y" to...
(kms_plane_cursor:5150) igt_kms-DEBUG: plane C.1: Setting property "CRTC_W" to...
(kms_plane_cursor:5150) igt_kms-DEBUG: plane C.1: Setting property "CRTC_H" to...
(kms_plane_cursor:5150) igt_kms-DEBUG: plane C.1: Setting property "FB_ID" to ...
(kms_plane_cursor:5150) igt_kms-DEBUG: plane C.1: Setting property "CRTC_ID" t...
(kms_plane_cursor:5150) igt_kms-DEBUG: plane C.1: Setting property "rotation" ...
(kms_plane_cursor:5150) igt_kms-DEBUG: plane C.1: Setting property "COLOR_ENCO...
...
igt@xe_exec_fault_mode@many-bindexecqueue-userptr-invalidate-race-imm
igt@xe_exec_fault_mode@many-bindexecqueue-userptr-invalidate-race-imm
xe-2198-9bcce25c88a853967702ceae9f9ef35d2c0e7ee8

Starting subtest: many-bindexecqueue-userptr-invalidate-race-imm
(xe_exec_fault_mode:26853) CRITICAL: Test assertion failure function test_exec...
(xe_exec_fault_mode:26853) CRITICAL: Failed assertion: __xe_wait_ufence(fd, &d...
(xe_exec_fault_mode:26853) CRITICAL: Last errno: 62, Timer expired
(xe_exec_fault_mode:26853) CRITICAL: error: -62 != 0
Subtest many-bindexecqueue-userptr-invalidate-race-imm failed.
**** DEBUG ****
(xe_exec_fault_mode:26853) DEBUG: test_exec running on: DRM_XE_ENGINE_CLASS_RE...
(xe_exec_fault_mode:26853) CRITICAL: Test assertion failure function test_exec...
(xe_exec_fault_mode:26853) CRITICAL: Failed assertion: __xe_wait_ufence(fd, &d...
(xe_exec_fault_mode:26853) CRITICAL: Last errno: 62, Timer expired
(xe_exec_fault_mode:26853) CRITICAL: error: -62 != 0
(xe_exec_fault_mode:26853) igt_core-INFO: Stack trace:
(xe_exec_fault_mode:26853) igt_core-INFO:   #0 ../lib/igt_core.c:2051 __igt_fa...
(xe_exec_fault_mode:26853) igt_core-INFO:   #1 ../tests/intel/xe_exec_fault_mo...
(xe_exec_fault_mode:26853) igt_core-INFO:   #2 ../tests/intel/xe_exec_fault_mo...
(xe_exec_fault_mode:26853) igt_core-INFO:   #3 ../tests/intel/xe_exec_fault_mo...
...
igt@kms_cursor_legacy@flip-vs-cursor-toggle
igt@kms_cursor_legacy@flip-vs-cursor-toggle
xe-2198-9bcce25c88a853967702ceae9f9ef35d2c0e7ee8

Starting subtest: flip-vs-cursor-toggle
(kms_cursor_legacy:2547) CRITICAL: Test assertion failure function flip_vs_cur...
(kms_cursor_legacy:2547) CRITICAL: Failed assertion: kmstest_get_vblank(displa...
(kms_cursor_legacy:2547) CRITICAL: error: 22850 != 22828
Subtest flip-vs-cursor-toggle failed.
**** DEBUG ****
(kms_cursor_legacy:2547) igt_kms-DEBUG: plane B.1: Setting property "alpha" to...
(kms_cursor_legacy:2547) igt_kms-DEBUG: plane B.1: Setting property "FB_DAMAGE...
(kms_cursor_legacy:2547) igt_kms-DEBUG: plane B.1: Setting property "SCALING_F...
(kms_cursor_legacy:2547) igt_kms-DEBUG: display:     populating plane data: B....
(kms_cursor_legacy:2547) igt_kms-DEBUG: plane B.2: Setting property "SRC_X" to...
(kms_cursor_legacy:2547) igt_kms-DEBUG: plane B.2: Setting property "SRC_Y" to...
(kms_cursor_legacy:2547) igt_kms-DEBUG: plane B.2: Setting property "SRC_W" to...
(kms_cursor_legacy:2547) igt_kms-DEBUG: plane B.2: Setting property "SRC_H" to...
(kms_cursor_legacy:2547) igt_kms-DEBUG: plane B.2: Setting property "CRTC_X" t...
(kms_cursor_legacy:2547) igt_kms-DEBUG: plane B.2: Setting property "CRTC_Y" t...
(kms_cursor_legacy:2547) igt_kms-DEBUG: plane B.2: Setting property "CRTC_W" t...
...
igt@kms_big_fb@4-tiled-max-hw-stride-64bpp-rotate-180-hflip-async-flip
igt@kms_big_fb@4-tiled-max-hw-stride-64bpp-rotate-180-hflip-async-flip
xe-2198-9bcce25c88a853967702ceae9f9ef35d2c0e7ee8

Starting subtest: 4-tiled-max-hw-stride-64bpp-rotate-180-hflip-async-flip
(kms_big_fb:3822) igt_kms-CRITICAL: Test assertion failure function igt_displa...
(kms_big_fb:3822) igt_kms-CRITICAL: Failed assertion: ret == 0
(kms_big_fb:3822) igt_kms-CRITICAL: Last errno: 22, Invalid argument
(kms_big_fb:3822) igt_kms-CRITICAL: error: -22 != 0
Subtest 4-tiled-max-hw-stride-64bpp-rotate-180-hflip-async-flip failed.
**** DEBUG ****
(kms_big_fb:3822) intel_batchbuffer-DEBUG:   [2]: handle: 6, offset: ffffde1a6...
(kms_big_fb:3822) intel_batchbuffer-DEBUG: bind_ops: UNMAP
(kms_big_fb:3822) intel_batchbuffer-DEBUG:   [0]: handle: 0, offset: ffffffffe...
(kms_big_fb:3822) intel_batchbuffer-DEBUG:   [1]: handle: 0, offset: ffffde3fe...
(kms_big_fb:3822) intel_batchbuffer-DEBUG:   [2]: handle: 0, offset: ffffde1a6...
(kms_big_fb:3822) intel_batchbuffer-DEBUG: bind_ops: MAP
(kms_big_fb:3822) intel_batchbuffer-DEBUG:   [0]: handle: 1, offset: ffffffffe...
(kms_big_fb:3822) intel_batchbuffer-DEBUG:   [1]: handle: 7, offset: ffffde3fe...
(kms_big_fb:3822) intel_batchbuffer-DEBUG:   [2]: handle: 6, offset: ffffde1a6...
(kms_big_fb:3822) intel_batchbuffer-DEBUG: bind_ops: UNMAP
...
igt@kms_flip@bo-too-big-interruptible
T igt@kms_flip@bo-too-big-interruptible
xe-2198-9bcce25c88a853967702ceae9f9ef35d2c0e7ee8

<7> [234.993176] xe 0000:00:02.0: [drm:intel_power_well_disable [xe]] disablin...
<6> [235.009830] Console: switching to colour dummy device 80x25
<6> [235.009996] [IGT] kms_flip: executing
<7> [235.015950] xe 0000:00:02.0: [drm:drm_helper_probe_single_connector_modes...
<7> [235.015966] xe 0000:00:02.0: [drm:intel_dp_detect [xe]] [CONNECTOR:202:DP...
<7> [235.016085] xe 0000:00:02.0: [drm:intel_tc_port_update_mode [xe]] Port E/...
<7> [235.016160] xe 0000:00:02.0: [drm:drm_helper_probe_single_connector_modes...
<7> [235.016385] xe 0000:00:02.0: [drm:drm_helper_probe_single_connector_modes...
<7> [235.016393] xe 0000:00:02.0: [drm:intel_dp_detect [xe]] [CONNECTOR:210:DP...
<7> [235.016496] xe 0000:00:02.0: [drm:intel_tc_port_update_mode [xe]] Port F/...
<7> [235.016565] xe 0000:00:02.0: [drm:drm_helper_probe_single_connector_modes...
<7> [235.016807] xe 0000:00:02.0: [drm:drm_helper_probe_single_connector_modes...
<7> [235.016814] xe 0000:00:02.0: [drm:intel_dp_detect [xe]] [CONNECTOR:189:DP...
<7> [235.016920] xe 0000:00:02.0: [drm:intel_power_well_enable [xe]] enabling ...
<7> [235.020782] xe 0000:00:02.0: [drm:drm_dp_read_dpcd_caps [drm_display_help...
<7> [235.020801] xe 0000:00:02.0: [drm:drm_dp_read_dpcd_caps [drm_display_help...
<7> [235.021932] xe 0000:00:02.0: [drm:intel_dp_init_lttpr_and_dprx_caps [xe]]...
...
igt@kms_vblank@accuracy-idle
igt@kms_vblank@accuracy-idle
xe-2198-9bcce25c88a853967702ceae9f9ef35d2c0e7ee8

Starting subtest: accuracy-idle
Starting dynamic subtest: pipe-A-DP-1
Dynamic subtest pipe-A-DP-1: SUCCESS (2.491s)
Starting dynamic subtest: pipe-A-DP-7
Dynamic subtest pipe-A-DP-7: SUCCESS (2.432s)
Starting dynamic subtest: pipe-C-DP-1
Dynamic subtest pipe-C-DP-1: SUCCESS (2.319s)
Starting dynamic subtest: pipe-C-DP-7
(kms_vblank:9633) igt_kms-CRITICAL: Test assertion failure function igt_primar...
(kms_vblank:9633) igt_kms-CRITICAL: Failed assertion: ret == 0
(kms_vblank:9633) igt_kms-CRITICAL: Last errno: 22, Invalid argument
(kms_vblank:9633) igt_kms-CRITICAL: error: -22 != 0
Dynamic subtest pipe-C-DP-7 failed.
**** DEBUG ****
(kms_vblank:9633) igt_kms-DEBUG: display:     SetProp plane A.1 "alpha" to 0xf...
(kms_vblank:9633) igt_kms-DEBUG: display:     SetProp plane A.1 "FB_DAMAGE_CLI...
(kms_vblank:9633) igt_kms-DEBUG: display:     SetProp plane A.1 "SCALING_FILTE...
...
igt@kms_async_flips@async-flip-with-page-flip-events
igt@kms_async_flips@async-flip-with-page-flip-events
xe-2198-9bcce25c88a853967702ceae9f9ef35d2c0e7ee8

Starting subtest: async-flip-with-page-flip-events
Starting dynamic subtest: pipe-A-DP-1-4-rc-ccs
Dynamic subtest pipe-A-DP-1-4-rc-ccs: SUCCESS (2.328s)
Starting dynamic subtest: pipe-A-DP-1-4
Dynamic subtest pipe-A-DP-1-4: SUCCESS (2.189s)
Starting dynamic subtest: pipe-A-DP-1-x
Dynamic subtest pipe-A-DP-1-x: SUCCESS (2.192s)
Starting dynamic subtest: pipe-A-DP-1-linear
(kms_async_flips:2254) CRITICAL: Test assertion failure function test_async_fl...
(kms_async_flips:2254) CRITICAL: Failed assertion: (fps / 1000) > (data->refre...
(kms_async_flips:2254) CRITICAL: FPS should be significantly higher than the r...
Dynamic subtest pipe-A-DP-1-linear failed.
**** DEBUG ****
(kms_async_flips:2254) igt_fb-DEBUG: igt_create_fb_with_bo_size(width=3840, he...
(kms_async_flips:2254) igt_fb-DEBUG: igt_create_fb_with_bo_size(handle=1, pitc...
(kms_async_flips:2254) ioctl_wrappers-DEBUG: Test requirement passed: igt_has_...
(kms_async_flips:2254) intel_allocator_simple-DEBUG: Using simple allocator
...
igt@kms_atomic_transition@plane-all-modeset-transition-fencing
D igt@kms_atomic_transition@plane-all-modeset-transition-fencing
xe-2198-9bcce25c88a853967702ceae9f9ef35d2c0e7ee8

<3> [56.348490] xe 0000:00:02.0: [drm] *ERROR* Failed to read source OUI
<3> [56.724166] xe 0000:00:02.0: [drm] *ERROR* Failed to read source OUI
<3> [57.092823] xe 0000:00:02.0: [drm] *ERROR* Failed to read source OUI
<3> [57.448656] xe 0000:00:02.0: [drm] *ERROR* Failed to read source OUI
<3> [57.802696] xe 0000:00:02.0: [drm] *ERROR* Failed to read source OUI
<3> [66.358584] xe 0000:00:02.0: [drm] *ERROR* Failed to read source OUI
<3> [66.708993] xe 0000:00:02.0: [drm] *ERROR* Failed to read source OUI
<3> [67.062996] xe 0000:00:02.0: [drm] *ERROR* Failed to read source OUI
<3> [67.418625] xe 0000:00:02.0: [drm] *ERROR* Failed to read source OUI
<3> [67.782084] xe 0000:00:02.0: [drm] *ERROR* Failed to read source OUI
<3> [76.408513] xe 0000:00:02.0: [drm] *ERROR* Failed to read source OUI
<3> [76.765230] xe 0000:00:02.0: [drm] *ERROR* Failed to read source OUI
<3> [77.138095] xe 0000:00:02.0: [drm] *ERROR* Failed to read source OUI
<3> [77.501030] xe 0000:00:02.0: [drm] *ERROR* Failed to read source OUI
<3> [77.879538] xe 0000:00:02.0: [drm] *ERROR* Failed to read source OUI
<3> [86.450293] xe 0000:00:02.0: [drm] *ERROR* Failed to read source OUI
<3> [86.816804] xe 0000:00:02.0: [drm] *ERROR* Failed to read source OUI
...
igt@kms_flip@plain-flip-ts-check
igt@kms_flip@plain-flip-ts-check
xe-2198-9bcce25c88a853967702ceae9f9ef35d2c0e7ee8

Starting subtest: plain-flip-ts-check
Starting dynamic subtest: A-DP1
Dynamic subtest A-DP1: SUCCESS (5.821s)
Starting dynamic subtest: B-DP1
Dynamic subtest B-DP1: SUCCESS (5.645s)
Starting dynamic subtest: C-DP1
Dynamic subtest C-DP1: SUCCESS (5.659s)
Starting dynamic subtest: A-DP6
(kms_flip:3259) CRITICAL: Test assertion failure function __run_test_on_crtc_s...
(kms_flip:3259) CRITICAL: Failed assertion: !ret
(kms_flip:3259) CRITICAL: Last errno: 22, Invalid argument
Dynamic subtest A-DP6 failed.
**** DEBUG ****
(kms_flip:3259) DEBUG: name = flip
last_ts = 913.979553
last_received_ts = 913.979126
last_seq = 16326
...
igt@xe_exec_fault_mode@many-execqueues-bindexecqueue-userptr-invalidate-race
igt@xe_exec_fault_mode@many-execqueues-bindexecqueue-userptr-invalidate-race
xe-2198-9bcce25c88a853967702ceae9f9ef35d2c0e7ee8

Starting subtest: many-execqueues-bindexecqueue-userptr-invalidate-race
(xe_exec_fault_mode:29047) CRITICAL: Test assertion failure function test_exec...
(xe_exec_fault_mode:29047) CRITICAL: Failed assertion: __xe_wait_ufence(fd, &d...
(xe_exec_fault_mode:29047) CRITICAL: Last errno: 62, Timer expired
(xe_exec_fault_mode:29047) CRITICAL: error: -62 != 0
Subtest many-execqueues-bindexecqueue-userptr-invalidate-race failed.
**** DEBUG ****
(xe_exec_fault_mode:29047) DEBUG: test_exec running on: DRM_XE_ENGINE_CLASS_RE...
(xe_exec_fault_mode:29047) DEBUG: test_exec running on: DRM_XE_ENGINE_CLASS_COPY
(xe_exec_fault_mode:29047) DEBUG: test_exec running on: DRM_XE_ENGINE_CLASS_CO...
(xe_exec_fault_mode:29047) CRITICAL: Test assertion failure function test_exec...
(xe_exec_fault_mode:29047) CRITICAL: Failed assertion: __xe_wait_ufence(fd, &d...
(xe_exec_fault_mode:29047) CRITICAL: Last errno: 62, Timer expired
(xe_exec_fault_mode:29047) CRITICAL: error: -62 != 0
(xe_exec_fault_mode:29047) igt_core-INFO: Stack trace:
(xe_exec_fault_mode:29047) igt_core-INFO:   #0 ../lib/igt_core.c:2051 __igt_fa...
(xe_exec_fault_mode:29047) igt_core-INFO:   #1 ../tests/intel/xe_exec_fault_mo...
...
igt@kms_big_fb@4-tiled-max-hw-stride-32bpp-rotate-0-hflip-async-flip
igt@kms_big_fb@4-tiled-max-hw-stride-32bpp-rotate-0-hflip-async-flip
xe-2198-9bcce25c88a853967702ceae9f9ef35d2c0e7ee8

Starting subtest: 4-tiled-max-hw-stride-32bpp-rotate-0-hflip-async-flip
(kms_big_fb:3671) igt_kms-CRITICAL: Test assertion failure function igt_displa...
(kms_big_fb:3671) igt_kms-CRITICAL: Failed assertion: ret == 0
(kms_big_fb:3671) igt_kms-CRITICAL: Last errno: 22, Invalid argument
(kms_big_fb:3671) igt_kms-CRITICAL: error: -22 != 0
Subtest 4-tiled-max-hw-stride-32bpp-rotate-0-hflip-async-flip failed.
**** DEBUG ****
(kms_big_fb:3671) intel_batchbuffer-DEBUG:   [2]: handle: 6, offset: ffffef0d2...
(kms_big_fb:3671) intel_batchbuffer-DEBUG: bind_ops: UNMAP
(kms_big_fb:3671) intel_batchbuffer-DEBUG:   [0]: handle: 0, offset: ffffffffe...
(kms_big_fb:3671) intel_batchbuffer-DEBUG:   [1]: handle: 0, offset: ffffef1fe...
(kms_big_fb:3671) intel_batchbuffer-DEBUG:   [2]: handle: 0, offset: ffffef0d2...
(kms_big_fb:3671) intel_batchbuffer-DEBUG: bind_ops: MAP
(kms_big_fb:3671) intel_batchbuffer-DEBUG:   [0]: handle: 1, offset: ffffffffe...
(kms_big_fb:3671) intel_batchbuffer-DEBUG:   [1]: handle: 7, offset: ffffef1fe...
(kms_big_fb:3671) intel_batchbuffer-DEBUG:   [2]: handle: 6, offset: ffffef0d2...
(kms_big_fb:3671) intel_batchbuffer-DEBUG: bind_ops: UNMAP
...
igt@kms_flip@2x-flip-vs-absolute-wf_vblank
igt@kms_flip@2x-flip-vs-absolute-wf_vblank
xe-2198-9bcce25c88a853967702ceae9f9ef35d2c0e7ee8

Starting subtest: 2x-flip-vs-absolute-wf_vblank
Starting dynamic subtest: AB-DP1-DP6
(kms_flip:3929) CRITICAL: Test assertion failure function __run_test_on_crtc_s...
(kms_flip:3929) CRITICAL: Failed assertion: !ret
(kms_flip:3929) CRITICAL: Last errno: 22, Invalid argument
Dynamic subtest AB-DP1-DP6 failed.
**** DEBUG ****
(kms_flip:3929) igt_fb-DEBUG: igt_create_fb_with_bo_size(width=3840, height=21...
(kms_flip:3929) igt_fb-DEBUG: igt_create_fb_with_bo_size(handle=1, pitch=15360)
(kms_flip:3929) ioctl_wrappers-DEBUG: Test requirement passed: igt_has_fb_modi...
(kms_flip:3929) igt_fb-DEBUG: igt_create_fb_with_bo_size(width=3840, height=21...
(kms_flip:3929) igt_fb-DEBUG: igt_create_fb_with_bo_size(handle=2, pitch=15360)
(kms_flip:3929) ioctl_wrappers-DEBUG: Test requirement passed: igt_has_fb_modi...
(kms_flip:3929) intel_allocator_simple-DEBUG: Using simple allocator
(kms_flip:3929) intel_allocator_simple-DEBUG: <ial: 0x5625c364fae0, fd: 5> obj...
(kms_flip:3929) intel_allocator_simple-DEBUG: <ial: 0x5625c364fae0, fd: 5> obj...
(kms_flip:3929) intel_allocator_simple-DEBUG: Using simple allocator
...
igt@kms_atomic_transition@plane-all-modeset-transition
D igt@kms_atomic_transition@plane-all-modeset-transition
xe-2198-9bcce25c88a853967702ceae9f9ef35d2c0e7ee8

<3> [368.636146] xe 0000:00:02.0: [drm] *ERROR* Failed to read source OUI
<3> [369.032687] xe 0000:00:02.0: [drm] *ERROR* Failed to read source OUI
<3> [369.405583] xe 0000:00:02.0: [drm] *ERROR* Failed to read source OUI
<3> [370.049061] xe 0000:00:02.0: [drm] *ERROR* Failed to read source OUI
<4> [378.616205] WARNING: CPU: 1 PID: 3538 at drivers/gpu/drm/i915/display/int...
<4> [378.616475] Modules linked in: snd_hda_intel snd_hda_codec_hdmi xe drm_gp...
<4> [378.616896] RIP: 0010:intel_tc_port_max_lane_count+0x28f/0x2f0 [xe]
<4> [378.617247]  ? intel_tc_port_max_lane_count+0x28f/0x2f0 [xe]
<4> [378.617516]  ? intel_tc_port_max_lane_count+0x28f/0x2f0 [xe]
<4> [378.617725]  intel_cx0_get_owned_lane_mask+0x31/0x70 [xe]
<4> [378.617986]  intel_cx0_phy_set_signal_levels+0xaf/0x460 [xe]
<4> [378.618798]  ? intel_dp_init_lttpr_and_dprx_caps+0x396/0x3c0 [xe]
<4> [378.619050]  intel_dp_start_link_train+0x84/0x1a70 [xe]
<4> [378.619351]  intel_ddi_pre_enable+0x862/0xb00 [xe]
<4> [378.619602]  intel_encoders_pre_enable+0x82/0xa0 [xe]
<4> [378.620090]  intel_enable_crtc+0xeb/0x110 [xe]
<4> [378.620641]  ? intel_set_cdclk_pre_plane_update+0x70/0x310 [xe]
...
igt@xe_exec_fault_mode@many-execqueues-userptr-invalidate-race
igt@xe_exec_fault_mode@many-execqueues-userptr-invalidate-race
xe-2198-9bcce25c88a853967702ceae9f9ef35d2c0e7ee8

Starting subtest: many-execqueues-userptr-invalidate-race
(xe_exec_fault_mode:30995) CRITICAL: Test assertion failure function test_exec...
(xe_exec_fault_mode:30995) CRITICAL: Failed assertion: __xe_wait_ufence(fd, &d...
(xe_exec_fault_mode:30995) CRITICAL: Last errno: 62, Timer expired
(xe_exec_fault_mode:30995) CRITICAL: error: -62 != 0
Subtest many-execqueues-userptr-invalidate-race failed.
**** DEBUG ****
(xe_exec_fault_mode:30995) DEBUG: test_exec running on: DRM_XE_ENGINE_CLASS_RE...
(xe_exec_fault_mode:30995) DEBUG: test_exec running on: DRM_XE_ENGINE_CLASS_COPY
(xe_exec_fault_mode:30995) CRITICAL: Test assertion failure function test_exec...
(xe_exec_fault_mode:30995) CRITICAL: Failed assertion: __xe_wait_ufence(fd, &d...
(xe_exec_fault_mode:30995) CRITICAL: Last errno: 62, Timer expired
(xe_exec_fault_mode:30995) CRITICAL: error: -62 != 0
(xe_exec_fault_mode:30995) igt_core-INFO: Stack trace:
(xe_exec_fault_mode:30995) igt_core-INFO:   #0 ../lib/igt_core.c:2051 __igt_fa...
(xe_exec_fault_mode:30995) igt_core-INFO:   #1 ../tests/intel/xe_exec_fault_mo...
(xe_exec_fault_mode:30995) igt_core-INFO:   #2 ../tests/intel/xe_exec_fault_mo...
...
igt@kms_flip@plain-flip-fb-recreate
igt@kms_flip@plain-flip-fb-recreate
xe-2198-9bcce25c88a853967702ceae9f9ef35d2c0e7ee8

Starting subtest: plain-flip-fb-recreate
Starting dynamic subtest: A-DP1
Dynamic subtest A-DP1: SUCCESS (5.804s)
Starting dynamic subtest: B-DP1
Dynamic subtest B-DP1: SUCCESS (5.620s)
Starting dynamic subtest: C-DP1
Dynamic subtest C-DP1: SUCCESS (5.652s)
Starting dynamic subtest: A-DP6
(kms_flip:3075) CRITICAL: Test assertion failure function __run_test_on_crtc_s...
(kms_flip:3075) CRITICAL: Failed assertion: !ret
(kms_flip:3075) CRITICAL: Last errno: 22, Invalid argument
Dynamic subtest A-DP6 failed.
**** DEBUG ****
(kms_flip:3075) DEBUG: name = flip
last_ts = 849.216309
last_received_ts = 849.216003
last_seq = 14737
...
igt@kms_atomic_transition@modeset-transition-nonblocking-fencing
igt@kms_atomic_transition@modeset-transition-nonblocking-fencing
xe-2198-9bcce25c88a853967702ceae9f9ef35d2c0e7ee8

Starting subtest: modeset-transition-nonblocking-fencing
Starting dynamic subtest: 1x-outputs
Dynamic subtest 1x-outputs: SUCCESS (4.141s)
Starting dynamic subtest: 2x-outputs
(kms_atomic_transition:3511) CRITICAL: Test assertion failure function commit_...
(kms_atomic_transition:3511) CRITICAL: Failed assertion: ret == 0
(kms_atomic_transition:3511) CRITICAL: Last errno: 22, Invalid argument
(kms_atomic_transition:3511) CRITICAL: error: -22 != 0
Dynamic subtest 2x-outputs failed.
**** DEBUG ****
    DP-2: preparing atomic, pipe: None
(kms_atomic_transition:3511) igt_kms-DEBUG: DP-2: Setting property "CRTC_ID" t...
(kms_atomic_transition:3511) igt_kms-DEBUG: display:     DP-3: preparing atomi...
(kms_atomic_transition:3511) igt_kms-DEBUG: DP-3: Setting property "CRTC_ID" t...
(kms_atomic_transition:3511) igt_kms-DEBUG: display:     DP-6: preparing atomi...
(kms_atomic_transition:3511) igt_kms-DEBUG: DP-6: Setting property "CRTC_ID" t...
(kms_atomic_transition:3511) igt_kms-DEBUG: display: }
...
igt@kms_atomic_transition@modeset-transition-nonblocking-fencing@2x-outputs
igt@kms_atomic_transition@modeset-transition-nonblocking-fencing@2x-outputs
xe-2198-9bcce25c88a853967702ceae9f9ef35d2c0e7ee8

Starting dynamic subtest: 2x-outputs
(kms_atomic_transition:3511) CRITICAL: Test assertion failure function commit_...
(kms_atomic_transition:3511) CRITICAL: Failed assertion: ret == 0
(kms_atomic_transition:3511) CRITICAL: Last errno: 22, Invalid argument
(kms_atomic_transition:3511) CRITICAL: error: -22 != 0
Dynamic subtest 2x-outputs failed.
**** DEBUG ****
    DP-2: preparing atomic, pipe: None
(kms_atomic_transition:3511) igt_kms-DEBUG: DP-2: Setting property "CRTC_ID" t...
(kms_atomic_transition:3511) igt_kms-DEBUG: display:     DP-3: preparing atomi...
(kms_atomic_transition:3511) igt_kms-DEBUG: DP-3: Setting property "CRTC_ID" t...
(kms_atomic_transition:3511) igt_kms-DEBUG: display:     DP-6: preparing atomi...
(kms_atomic_transition:3511) igt_kms-DEBUG: DP-6: Setting property "CRTC_ID" t...
(kms_atomic_transition:3511) igt_kms-DEBUG: display: }
(kms_atomic_transition:3511) DEBUG: Event mask: 3, waiting for 2 events
(kms_atomic_transition:3511) DEBUG: Retrieved vblank seq: 7123 on unk/unk
(kms_atomic_transition:3511) DEBUG: Retrieved vblank seq: 3029 on unk/unk
...
igt@kms_flip@2x-flip-vs-blocking-wf-vblank
igt@kms_flip@2x-flip-vs-blocking-wf-vblank
xe-2198-9bcce25c88a853967702ceae9f9ef35d2c0e7ee8

Starting subtest: 2x-flip-vs-blocking-wf-vblank
Starting dynamic subtest: AB-DP1-DP7
Dynamic subtest AB-DP1-DP7: SUCCESS (11.076s)
Starting dynamic subtest: AC-DP1-DP7
(kms_flip:4014) CRITICAL: Test assertion failure function __run_test_on_crtc_s...
(kms_flip:4014) CRITICAL: Failed assertion: !retried && needs_retry_after_link...
Dynamic subtest AC-DP1-DP7 failed.
**** DEBUG ****
(kms_flip:4014) igt_fb-DEBUG: igt_create_fb_with_bo_size(width=3840, height=21...
(kms_flip:4014) igt_fb-DEBUG: igt_create_fb_with_bo_size(handle=1, pitch=15360)
(kms_flip:4014) ioctl_wrappers-DEBUG: Test requirement passed: igt_has_fb_modi...
(kms_flip:4014) igt_fb-DEBUG: igt_create_fb_with_bo_size(width=3840, height=21...
(kms_flip:4014) igt_fb-DEBUG: igt_create_fb_with_bo_size(handle=2, pitch=15360)
(kms_flip:4014) ioctl_wrappers-DEBUG: Test requirement passed: igt_has_fb_modi...
(kms_flip:4014) intel_allocator_simple-DEBUG: Using simple allocator
(kms_flip:4014) intel_allocator_simple-DEBUG: <ial: 0x557e26391770, fd: 5> obj...
(kms_flip:4014) intel_allocator_simple-DEBUG: <ial: 0x557e26391770, fd: 5> obj...
...
igt@kms_big_fb@4-tiled-max-hw-stride-32bpp-rotate-180-hflip-async-flip
igt@kms_big_fb@4-tiled-max-hw-stride-32bpp-rotate-180-hflip-async-flip
xe-2198-9bcce25c88a853967702ceae9f9ef35d2c0e7ee8

Starting subtest: 4-tiled-max-hw-stride-32bpp-rotate-180-hflip-async-flip
(kms_big_fb:3719) igt_kms-CRITICAL: Test assertion failure function igt_displa...
(kms_big_fb:3719) igt_kms-CRITICAL: Failed assertion: ret == 0
(kms_big_fb:3719) igt_kms-CRITICAL: Last errno: 22, Invalid argument
(kms_big_fb:3719) igt_kms-CRITICAL: error: -22 != 0
Subtest 4-tiled-max-hw-stride-32bpp-rotate-180-hflip-async-flip failed.
**** DEBUG ****
(kms_big_fb:3719) intel_batchbuffer-DEBUG:   [2]: handle: 6, offset: ffffef0d2...
(kms_big_fb:3719) intel_batchbuffer-DEBUG: bind_ops: UNMAP
(kms_big_fb:3719) intel_batchbuffer-DEBUG:   [0]: handle: 0, offset: ffffffffe...
(kms_big_fb:3719) intel_batchbuffer-DEBUG:   [1]: handle: 0, offset: ffffef1fe...
(kms_big_fb:3719) intel_batchbuffer-DEBUG:   [2]: handle: 0, offset: ffffef0d2...
(kms_big_fb:3719) intel_batchbuffer-DEBUG: bind_ops: MAP
(kms_big_fb:3719) intel_batchbuffer-DEBUG:   [0]: handle: 1, offset: ffffffffe...
(kms_big_fb:3719) intel_batchbuffer-DEBUG:   [1]: handle: 7, offset: ffffef1fe...
(kms_big_fb:3719) intel_batchbuffer-DEBUG:   [2]: handle: 6, offset: ffffef0d2...
(kms_big_fb:3719) intel_batchbuffer-DEBUG: bind_ops: UNMAP
...
igt@xe_wedged@basic-wedged
D igt@xe_wedged@basic-wedged
xe-2198-9bcce25c88a853967702ceae9f9ef35d2c0e7ee8

<4> [507.783515]  ? __pfx___drm_printfn_seq_file+0x10/0x10 [drm]
<4> [507.783546]  ? __pfx___drm_puts_seq_file+0x10/0x10 [drm]
<3> [507.784500] xe 0000:00:02.0: [drm] *ERROR* GT0: reset failed (-ECANCELED)
igt@kms_atomic_transition@modeset-transition
igt@kms_atomic_transition@modeset-transition
xe-2198-9bcce25c88a853967702ceae9f9ef35d2c0e7ee8

Starting subtest: modeset-transition
Starting dynamic subtest: 1x-outputs
Dynamic subtest 1x-outputs: SUCCESS (3.313s)
Starting dynamic subtest: 2x-outputs
(kms_atomic_transition:3423) CRITICAL: Test assertion failure function commit_...
(kms_atomic_transition:3423) CRITICAL: Failed assertion: ret == 0
(kms_atomic_transition:3423) CRITICAL: Last errno: 22, Invalid argument
(kms_atomic_transition:3423) CRITICAL: error: -22 != 0
Dynamic subtest 2x-outputs failed.
**** DEBUG ****
A.0: plane_set_size (0x0)
(kms_atomic_transition:3423) igt_kms-DEBUG: display: A.0: fb_set_position(0,0)
(kms_atomic_transition:3423) igt_kms-DEBUG: display: A.0: fb_set_size(0x0)
(kms_atomic_transition:3423) igt_kms-DEBUG: Test requirement passed: plane_idx...
(kms_atomic_transition:3423) igt_kms-DEBUG: display: B.0: plane_set_fb(0)
(kms_atomic_transition:3423) igt_kms-DEBUG: display: B.0: plane_set_size (0x0)
(kms_atomic_transition:3423) igt_kms-DEBUG: display: B.0: fb_set_position(0,0)
...
igt@kms_atomic_transition@modeset-transition@2x-outputs
igt@kms_atomic_transition@modeset-transition@2x-outputs
xe-2198-9bcce25c88a853967702ceae9f9ef35d2c0e7ee8

Starting dynamic subtest: 2x-outputs
(kms_atomic_transition:3423) CRITICAL: Test assertion failure function commit_...
(kms_atomic_transition:3423) CRITICAL: Failed assertion: ret == 0
(kms_atomic_transition:3423) CRITICAL: Last errno: 22, Invalid argument
(kms_atomic_transition:3423) CRITICAL: error: -22 != 0
Dynamic subtest 2x-outputs failed.
**** DEBUG ****
A.0: plane_set_size (0x0)
(kms_atomic_transition:3423) igt_kms-DEBUG: display: A.0: fb_set_position(0,0)
(kms_atomic_transition:3423) igt_kms-DEBUG: display: A.0: fb_set_size(0x0)
(kms_atomic_transition:3423) igt_kms-DEBUG: Test requirement passed: plane_idx...
(kms_atomic_transition:3423) igt_kms-DEBUG: display: B.0: plane_set_fb(0)
(kms_atomic_transition:3423) igt_kms-DEBUG: display: B.0: plane_set_size (0x0)
(kms_atomic_transition:3423) igt_kms-DEBUG: display: B.0: fb_set_position(0,0)
(kms_atomic_transition:3423) igt_kms-DEBUG: display: B.0: fb_set_size(0x0)
(kms_atomic_transition:3423) igt_kms-DEBUG: Test requirement passed: plane_idx...
(kms_atomic_transition:3423) igt_kms-DEBUG: display: DP-1: set_pipe(C)
...
igt@kms_async_flips@crc
igt@kms_async_flips@crc
xe-2198-9bcce25c88a853967702ceae9f9ef35d2c0e7ee8

<6> [199.485107] Console: switching to colour dummy device 80x25
<6> [199.485372] [IGT] kms_async_flips: executing
<7> [199.490894] xe 0000:00:02.0: [drm:drm_helper_probe_single_connector_modes...
<7> [199.490909] xe 0000:00:02.0: [drm:intel_dp_detect [xe]] [CONNECTOR:202:DP...
<7> [199.491034] xe 0000:00:02.0: [drm:intel_power_well_enable [xe]] enabling ...
<7> [199.497101] xe 0000:00:02.0: [drm:drm_dp_read_dpcd_caps [drm_display_help...
<7> [199.497121] xe 0000:00:02.0: [drm:drm_dp_read_dpcd_caps [drm_display_help...
<7> [199.497900] xe 0000:00:02.0: [drm:intel_dp_init_lttpr_and_dprx_caps [xe]]...
<7> [199.502327] xe 0000:00:02.0: [drm:drm_dp_read_dpcd_caps [drm_display_help...
<7> [199.502343] xe 0000:00:02.0: [drm:drm_dp_read_dpcd_caps [drm_display_help...
<7> [199.503458] xe 0000:00:02.0: [drm:drm_dp_dump_desc [drm_display_helper]] ...
<7> [199.506098] xe 0000:00:02.0: [drm:drm_dp_read_downstream_info [drm_displa...
<7> [199.506884] xe 0000:00:02.0: [drm:intel_dp_detect [xe]] [ENCODER:201:DDI ...
<7> [199.510447] xe 0000:00:02.0: [drm:intel_dp_read_dsc_dpcd [xe]] DSC DPCD: ...
<7> [199.511310] xe 0000:00:02.0: [drm:intel_dp_get_dsc_sink_cap [xe]] FEC CAP...
<7> [199.512171] xe 0000:00:02.0: [drm:intel_dp_print_rates [xe]] source rates...
<7> [199.512261] xe 0000:00:02.0: [drm:intel_dp_print_rates [xe]] sink rates: ...
...
igt@xe_exec_fault_mode@many-userptr-invalidate-race-prefetch
igt@xe_exec_fault_mode@many-userptr-invalidate-race-prefetch
xe-2198-9bcce25c88a853967702ceae9f9ef35d2c0e7ee8

Starting subtest: many-userptr-invalidate-race-prefetch
(xe_exec_fault_mode:31684) CRITICAL: Test assertion failure function test_exec...
(xe_exec_fault_mode:31684) CRITICAL: Failed assertion: __xe_wait_ufence(fd, &d...
(xe_exec_fault_mode:31684) CRITICAL: Last errno: 62, Timer expired
(xe_exec_fault_mode:31684) CRITICAL: error: -62 != 0
Subtest many-userptr-invalidate-race-prefetch failed.
**** DEBUG ****
(xe_exec_fault_mode:31684) DEBUG: test_exec running on: DRM_XE_ENGINE_CLASS_RE...
(xe_exec_fault_mode:31684) DEBUG: test_exec running on: DRM_XE_ENGINE_CLASS_COPY
(xe_exec_fault_mode:31684) DEBUG: test_exec running on: DRM_XE_ENGINE_CLASS_CO...
(xe_exec_fault_mode:31684) CRITICAL: Test assertion failure function test_exec...
(xe_exec_fault_mode:31684) CRITICAL: Failed assertion: __xe_wait_ufence(fd, &d...
(xe_exec_fault_mode:31684) CRITICAL: Last errno: 62, Timer expired
(xe_exec_fault_mode:31684) CRITICAL: error: -62 != 0
(xe_exec_fault_mode:31684) igt_core-INFO: Stack trace:
(xe_exec_fault_mode:31684) igt_core-INFO:   #0 ../lib/igt_core.c:2051 __igt_fa...
(xe_exec_fault_mode:31684) igt_core-INFO:   #1 ../tests/intel/xe_exec_fault_mo...
...
igt@kms_cursor_legacy@flip-vs-cursor-atomic-transitions-varying-size
igt@kms_cursor_legacy@flip-vs-cursor-atomic-transitions-varying-size
xe-2198-9bcce25c88a853967702ceae9f9ef35d2c0e7ee8

Starting subtest: flip-vs-cursor-atomic-transitions-varying-size
(kms_cursor_legacy:2445) CRITICAL: Test assertion failure function flip_vs_cur...
(kms_cursor_legacy:2445) CRITICAL: Failed assertion: kmstest_get_vblank(displa...
(kms_cursor_legacy:2445) CRITICAL: error: 21407 != 21387
Subtest flip-vs-cursor-atomic-transitions-varying-size failed.
**** DEBUG ****
(kms_cursor_legacy:2445) igt_kms-DEBUG: display:     populating plane data: A....
(kms_cursor_legacy:2445) igt_kms-DEBUG: plane A.4: Setting property "SRC_X" to...
(kms_cursor_legacy:2445) igt_kms-DEBUG: plane A.4: Setting property "SRC_Y" to...
(kms_cursor_legacy:2445) igt_kms-DEBUG: plane A.4: Setting property "SRC_W" to...
(kms_cursor_legacy:2445) igt_kms-DEBUG: plane A.4: Setting property "SRC_H" to...
(kms_cursor_legacy:2445) igt_kms-DEBUG: plane A.4: Setting property "CRTC_W" t...
(kms_cursor_legacy:2445) igt_kms-DEBUG: plane A.4: Setting property "CRTC_H" t...
(kms_cursor_legacy:2445) igt_kms-DEBUG: plane A.4: Setting property "FB_ID" to...
(kms_cursor_legacy:2445) igt_kms-DEBUG: plane A.4: Setting property "CRTC_ID" ...
(kms_cursor_legacy:2445) igt_kms-DEBUG: plane A.4: Setting property "COLOR_ENC...
(kms_cursor_legacy:2445) igt_kms-DEBUG: plane A.4: Setting property "COLOR_RAN...
...
igt@kms_hdr@brightness-with-hdr
igt@kms_hdr@brightness-with-hdr
xe-2198-9bcce25c88a853967702ceae9f9ef35d2c0e7ee8

Starting subtest: brightness-with-hdr
Starting dynamic subtest: pipe-A-DP-1
(kms_hdr:3971) CRITICAL: Test assertion failure function adjust_brightness, fi...
(kms_hdr:3971) CRITICAL: Failed assertion: igt_backlight_read(&context.max, "m...
(kms_hdr:3971) CRITICAL: Last errno: 2, No such file or directory
Dynamic subtest pipe-A-DP-1 failed.
**** DEBUG ****
(kms_hdr:3971) igt_fb-DEBUG: igt_create_fb_with_bo_size(width=512, height=512,...
(kms_hdr:3971) igt_fb-DEBUG: igt_create_fb_with_bo_size(handle=1, pitch=2048)
(kms_hdr:3971) ioctl_wrappers-DEBUG: Test requirement passed: igt_has_fb_modif...
(kms_hdr:3971) intel_allocator_simple-DEBUG: Using simple allocator
(kms_hdr:3971) intel_allocator_simple-DEBUG: <ial: 0x55da85ac3450, fd: 5> obje...
(kms_hdr:3971) intel_allocator_simple-DEBUG: <ial: 0x55da85ac3450, fd: 5> obje...
(kms_hdr:3971) intel_allocator_simple-DEBUG: Using simple allocator
(kms_hdr:3971) intel_allocator_simple-DEBUG: <ial: 0x55da85acf890, fd: 5> obje...
(kms_hdr:3971) intel_allocator_simple-DEBUG: <ial: 0x55da85acf890, fd: 5> obje...
(kms_hdr:3971) igt_kms-DEBUG: display: A.0: plane_set_fb(217)
...
igt@kms_plane_cursor@viewport
igt@kms_plane_cursor@viewport
xe-2198-9bcce25c88a853967702ceae9f9ef35d2c0e7ee8

Starting subtest: viewport
Starting dynamic subtest: pipe-A-DP-1-size-64
(kms_plane_cursor:5485) igt_pipe_crc-CRITICAL: Test assertion failure function...
(kms_plane_cursor:5485) igt_pipe_crc-CRITICAL: Failed assertion: !mismatch || ...
Dynamic subtest pipe-A-DP-1-size-64 failed.
**** DEBUG ****
(kms_plane_cursor:5485) igt_kms-DEBUG: plane C.1: Setting property "SRC_Y" to ...
(kms_plane_cursor:5485) igt_kms-DEBUG: plane C.1: Setting property "SRC_W" to ...
(kms_plane_cursor:5485) igt_kms-DEBUG: plane C.1: Setting property "SRC_H" to ...
(kms_plane_cursor:5485) igt_kms-DEBUG: plane C.1: Setting property "CRTC_X" to...
(kms_plane_cursor:5485) igt_kms-DEBUG: plane C.1: Setting property "CRTC_Y" to...
(kms_plane_cursor:5485) igt_kms-DEBUG: plane C.1: Setting property "CRTC_W" to...
(kms_plane_cursor:5485) igt_kms-DEBUG: plane C.1: Setting property "CRTC_H" to...
(kms_plane_cursor:5485) igt_kms-DEBUG: plane C.1: Setting property "FB_ID" to ...
(kms_plane_cursor:5485) igt_kms-DEBUG: plane C.1: Setting property "CRTC_ID" t...
(kms_plane_cursor:5485) igt_kms-DEBUG: plane C.1: Setting property "rotation" ...
(kms_plane_cursor:5485) igt_kms-DEBUG: plane C.1: Setting property "COLOR_ENCO...
...
igt@kms_universal_plane@cursor-fb-leak
igt@kms_universal_plane@cursor-fb-leak
xe-2198-9bcce25c88a853967702ceae9f9ef35d2c0e7ee8

Starting subtest: cursor-fb-leak
Starting dynamic subtest: pipe-A-DP-1
(kms_universal_plane:9334) CRITICAL: Test assertion failure function cursor_le...
(kms_universal_plane:9334) CRITICAL: Failed assertion: count1 == count2
(kms_universal_plane:9334) CRITICAL: Last errno: 9, Bad file descriptor
(kms_universal_plane:9334) CRITICAL: error: 1 != 3
Dynamic subtest pipe-A-DP-1 failed.
**** DEBUG ****
(kms_universal_plane:9334) igt_kms-DEBUG: display: A.5: plane_set_size (64x64)
(kms_universal_plane:9334) igt_kms-DEBUG: display: A.5: fb_set_position(0,0)
(kms_universal_plane:9334) igt_kms-DEBUG: display: A.5: fb_set_size(64x64)
(kms_universal_plane:9334) igt_kms-DEBUG: display: commit {
(kms_universal_plane:9334) igt_kms-DEBUG: Test requirement passed: plane_idx >...
(kms_universal_plane:9334) igt_kms-DEBUG: Test requirement passed: plane_idx >...
(kms_universal_plane:9334) igt_kms-DEBUG: Test requirement passed: plane_idx >...
(kms_universal_plane:9334) igt_kms-DEBUG: Test requirement passed: plane_idx >...
(kms_universal_plane:9334) igt_kms-DEBUG: Test requirement passed: plane_idx >...
...
igt@kms_properties@connector-properties-atomic
igt@kms_properties@connector-properties-atomic
xe-2198-9bcce25c88a853967702ceae9f9ef35d2c0e7ee8

Starting subtest: connector-properties-atomic
Starting dynamic subtest: pipe-A-DP-1
Dynamic subtest pipe-A-DP-1: SUCCESS (1.940s)
Starting dynamic subtest: pipe-A-DP-7
(kms_properties:1925) CRITICAL: Test assertion failure function max_bpc_prop_t...
(kms_properties:1925) CRITICAL: Failed assertion: ret == 0
(kms_properties:1925) CRITICAL: Last errno: 22, Invalid argument
(kms_properties:1925) CRITICAL: error: -22 != 0
Dynamic subtest pipe-A-DP-7 failed.
**** DEBUG ****
(kms_properties:1925) igt_kms-DEBUG: plane B.2: Setting property "CRTC_Y" to 0...
(kms_properties:1925) igt_kms-DEBUG: plane B.2: Setting property "CRTC_W" to 0...
(kms_properties:1925) igt_kms-DEBUG: plane B.2: Setting property "CRTC_H" to 0...
(kms_properties:1925) igt_kms-DEBUG: plane B.2: Setting property "FB_ID" to 0x...
(kms_properties:1925) igt_kms-DEBUG: plane B.2: Setting property "CRTC_ID" to ...
(kms_properties:1925) igt_kms-DEBUG: plane B.2: Setting property "rotation" to...
(kms_properties:1925) igt_kms-DEBUG: plane B.2: Setting property "COLOR_ENCODI...
...
igt@kms_flip@plain-flip-ts-check-interruptible
igt@kms_flip@plain-flip-ts-check-interruptible
xe-2198-9bcce25c88a853967702ceae9f9ef35d2c0e7ee8

Starting subtest: plain-flip-ts-check-interruptible
Starting dynamic subtest: A-DP1
Dynamic subtest A-DP1: SUCCESS (5.797s)
Starting dynamic subtest: B-DP1
Dynamic subtest B-DP1: SUCCESS (5.653s)
Starting dynamic subtest: C-DP1
Dynamic subtest C-DP1: SUCCESS (5.619s)
Starting dynamic subtest: A-DP7
Dynamic subtest A-DP7: SUCCESS (5.687s)
Starting dynamic subtest: B-DP7
(kms_flip:3333) CRITICAL: Test assertion failure function __run_test_on_crtc_s...
(kms_flip:3333) CRITICAL: Failed assertion: !ret
(kms_flip:3333) CRITICAL: Last errno: 22, Invalid argument
Dynamic subtest B-DP7 failed.
**** DEBUG ****
(kms_flip:3333) igt_fb-DEBUG: igt_create_fb_with_bo_size(width=3840, height=21...
(kms_flip:3333) igt_fb-DEBUG: igt_create_fb_with_bo_size(handle=1, pitch=15360)
...
igt@kms_pm_rpm@universal-planes
D igt@kms_pm_rpm@universal-planes
xe-2198-9bcce25c88a853967702ceae9f9ef35d2c0e7ee8

<4> [446.802683] xe 0000:00:02.0: [drm] GT1: G2H fence 3198, action 3003, done
igt@kms_pm_rpm@universal-planes@plane-41
D igt@kms_pm_rpm@universal-planes@plane-41
xe-2198-9bcce25c88a853967702ceae9f9ef35d2c0e7ee8

<4> [446.802683] xe 0000:00:02.0: [drm] GT1: G2H fence 3198, action 3003, done
igt@kms_flip@dpms-vs-vblank-race
D igt@kms_flip@dpms-vs-vblank-race
xe-2198-9bcce25c88a853967702ceae9f9ef35d2c0e7ee8

<3> [403.540798] xe 0000:00:02.0: [drm] *ERROR* Failed to read source OUI
<3> [403.953454] xe 0000:00:02.0: [drm] *ERROR* Failed to read source OUI
<3> [404.384427] xe 0000:00:02.0: [drm] *ERROR* Failed to read source OUI
<3> [404.818501] xe 0000:00:02.0: [drm] *ERROR* Failed to read source OUI
igt@xe_ccs@suspend-resume@xmajor-compressed-compfmt0-system-system
D igt@xe_ccs@suspend-resume@xmajor-compressed-compfmt0-system-system
xe-2198-9bcce25c88a853967702ceae9f9ef35d2c0e7ee8

<4> [296.338059] xe 0000:00:02.0: [drm] drm_WARN_ON(!mgr->mst_state || !mgr->m...
<4> [296.338115] WARNING: CPU: 5 PID: 73 at drivers/gpu/drm/display/drm_dp_mst...
<4> [296.338131] Modules linked in: snd_hda_codec_hdmi snd_hda_intel xe drm_gp...
<4> [296.338353] RIP: 0010:drm_dp_mst_topology_queue_probe+0xce/0xe0 [drm_disp...
<4> [296.338415]  ? drm_dp_mst_topology_queue_probe+0xce/0xe0 [drm_display_hel...
<4> [296.338452]  ? drm_dp_mst_topology_queue_probe+0xce/0xe0 [drm_display_hel...
<4> [296.338461]  ? drm_dp_mst_topology_queue_probe+0xce/0xe0 [drm_display_hel...
<4> [296.338469]  intel_mst_pre_enable_dp+0x237/0x2c0 [xe]
<4> [296.338558]  intel_encoders_pre_enable+0x82/0xa0 [xe]
<4> [296.338737]  intel_enable_crtc+0xeb/0x110 [xe]
<4> [296.338910]  intel_atomic_commit_tail+0x9b3/0x1770 [xe]
<4> [296.339002]  intel_atomic_commit+0x2b9/0x300 [xe]
<4> [296.339084]  ? intel_atomic_commit+0x2b9/0x300 [xe]
<4> [296.339169]  drm_atomic_commit+0xad/0xe0 [drm]
<4> [296.339209]  ? __pfx___drm_printfn_info+0x10/0x10 [drm]
<4> [296.339240]  drm_atomic_helper_commit_duplicated_state+0xc3/0xe0 [drm_kms...
<4> [296.339258]  __intel_display_driver_resume+0x8d/0xf0 [xe]
...
igt@xe_ccs@suspend-resume@tile4-compressed-compfmt0-system-system
D igt@xe_ccs@suspend-resume@tile4-compressed-compfmt0-system-system
xe-2198-9bcce25c88a853967702ceae9f9ef35d2c0e7ee8

<3> [303.185497] xe 0000:00:02.0: [drm] *ERROR* Failed to get ACT after 3000ms...
igt@kms_async_flips@async-flip-with-page-flip-events@pipe-a-dp-1-linear
igt@kms_async_flips@async-flip-with-page-flip-events@pipe-a-dp-1-linear
xe-2198-9bcce25c88a853967702ceae9f9ef35d2c0e7ee8

Starting dynamic subtest: pipe-A-DP-1-linear
(kms_async_flips:2254) CRITICAL: Test assertion failure function test_async_fl...
(kms_async_flips:2254) CRITICAL: Failed assertion: (fps / 1000) > (data->refre...
(kms_async_flips:2254) CRITICAL: FPS should be significantly higher than the r...
Dynamic subtest pipe-A-DP-1-linear failed.
**** DEBUG ****
(kms_async_flips:2254) igt_fb-DEBUG: igt_create_fb_with_bo_size(width=3840, he...
(kms_async_flips:2254) igt_fb-DEBUG: igt_create_fb_with_bo_size(handle=1, pitc...
(kms_async_flips:2254) ioctl_wrappers-DEBUG: Test requirement passed: igt_has_...
(kms_async_flips:2254) intel_allocator_simple-DEBUG: Using simple allocator
(kms_async_flips:2254) intel_allocator_simple-DEBUG: <ial: 0x564e6658ed90, fd:...
(kms_async_flips:2254) intel_allocator_simple-DEBUG: <ial: 0x564e6658ed90, fd:...
(kms_async_flips:2254) intel_allocator_simple-DEBUG: Using simple allocator
(kms_async_flips:2254) intel_allocator_simple-DEBUG: <ial: 0x564e6658ed90, fd:...
(kms_async_flips:2254) intel_allocator_simple-DEBUG: <ial: 0x564e6658ed90, fd:...
(kms_async_flips:2254) intel_allocator_simple-DEBUG: Using simple allocator
(kms_async_flips:2254) intel_allocator_simple-DEBUG: <ial: 0x564e6658f050, fd:...
...
igt@kms_async_flips@async-flip-with-page-flip-events@pipe-b-dp-1-linear
igt@kms_async_flips@async-flip-with-page-flip-events@pipe-b-dp-1-linear
xe-2198-9bcce25c88a853967702ceae9f9ef35d2c0e7ee8

Starting dynamic subtest: pipe-B-DP-1-linear
(kms_async_flips:2254) CRITICAL: Test assertion failure function test_async_fl...
(kms_async_flips:2254) CRITICAL: Failed assertion: (fps / 1000) > (data->refre...
(kms_async_flips:2254) CRITICAL: FPS should be significantly higher than the r...
Dynamic subtest pipe-B-DP-1-linear failed.
**** DEBUG ****
(kms_async_flips:2254) igt_fb-DEBUG: igt_create_fb_with_bo_size(width=3840, he...
(kms_async_flips:2254) igt_fb-DEBUG: igt_create_fb_with_bo_size(handle=1, pitc...
(kms_async_flips:2254) ioctl_wrappers-DEBUG: Test requirement passed: igt_has_...
(kms_async_flips:2254) intel_allocator_simple-DEBUG: Using simple allocator
(kms_async_flips:2254) intel_allocator_simple-DEBUG: <ial: 0x564e665aa890, fd:...
(kms_async_flips:2254) intel_allocator_simple-DEBUG: <ial: 0x564e665aa890, fd:...
(kms_async_flips:2254) intel_allocator_simple-DEBUG: Using simple allocator
(kms_async_flips:2254) intel_allocator_simple-DEBUG: <ial: 0x564e665aa9e0, fd:...
(kms_async_flips:2254) intel_allocator_simple-DEBUG: <ial: 0x564e665aa9e0, fd:...
(kms_async_flips:2254) intel_allocator_simple-DEBUG: Using simple allocator
(kms_async_flips:2254) intel_allocator_simple-DEBUG: <ial: 0x564e665aabb0, fd:...
...
igt@kms_async_flips@async-flip-with-page-flip-events@pipe-c-dp-1-linear
igt@kms_async_flips@async-flip-with-page-flip-events@pipe-c-dp-1-linear
xe-2198-9bcce25c88a853967702ceae9f9ef35d2c0e7ee8

Starting dynamic subtest: pipe-C-DP-1-linear
(kms_async_flips:2254) CRITICAL: Test assertion failure function test_async_fl...
(kms_async_flips:2254) CRITICAL: Failed assertion: (fps / 1000) > (data->refre...
(kms_async_flips:2254) CRITICAL: FPS should be significantly higher than the r...
Dynamic subtest pipe-C-DP-1-linear failed.
**** DEBUG ****
(kms_async_flips:2254) igt_fb-DEBUG: igt_create_fb_with_bo_size(width=3840, he...
(kms_async_flips:2254) igt_fb-DEBUG: igt_create_fb_with_bo_size(handle=1, pitc...
(kms_async_flips:2254) ioctl_wrappers-DEBUG: Test requirement passed: igt_has_...
(kms_async_flips:2254) intel_allocator_simple-DEBUG: Using simple allocator
(kms_async_flips:2254) intel_allocator_simple-DEBUG: <ial: 0x564e6659a730, fd:...
(kms_async_flips:2254) intel_allocator_simple-DEBUG: <ial: 0x564e6659a730, fd:...
(kms_async_flips:2254) intel_allocator_simple-DEBUG: Using simple allocator
(kms_async_flips:2254) intel_allocator_simple-DEBUG: <ial: 0x564e6659a8e0, fd:...
(kms_async_flips:2254) intel_allocator_simple-DEBUG: <ial: 0x564e6659a8e0, fd:...
(kms_async_flips:2254) intel_allocator_simple-DEBUG: Using simple allocator
(kms_async_flips:2254) intel_allocator_simple-DEBUG: <ial: 0x564e6659a8e0, fd:...
...
igt@kms_atomic_transition@plane-all-modeset-transition@pipe-a-dp-1
D igt@kms_atomic_transition@plane-all-modeset-transition@pipe-a-dp-1
xe-2198-9bcce25c88a853967702ceae9f9ef35d2c0e7ee8

<3> [368.636146] xe 0000:00:02.0: [drm] *ERROR* Failed to read source OUI
<3> [369.032687] xe 0000:00:02.0: [drm] *ERROR* Failed to read source OUI
<3> [369.405583] xe 0000:00:02.0: [drm] *ERROR* Failed to read source OUI
<3> [370.049061] xe 0000:00:02.0: [drm] *ERROR* Failed to read source OUI
<4> [378.616205] WARNING: CPU: 1 PID: 3538 at drivers/gpu/drm/i915/display/int...
<4> [378.616475] Modules linked in: snd_hda_intel snd_hda_codec_hdmi xe drm_gp...
<4> [378.616896] RIP: 0010:intel_tc_port_max_lane_count+0x28f/0x2f0 [xe]
<4> [378.617247]  ? intel_tc_port_max_lane_count+0x28f/0x2f0 [xe]
<4> [378.617516]  ? intel_tc_port_max_lane_count+0x28f/0x2f0 [xe]
<4> [378.617725]  intel_cx0_get_owned_lane_mask+0x31/0x70 [xe]
<4> [378.617986]  intel_cx0_phy_set_signal_levels+0xaf/0x460 [xe]
<4> [378.618798]  ? intel_dp_init_lttpr_and_dprx_caps+0x396/0x3c0 [xe]
<4> [378.619050]  intel_dp_start_link_train+0x84/0x1a70 [xe]
<4> [378.619351]  intel_ddi_pre_enable+0x862/0xb00 [xe]
<4> [378.619602]  intel_encoders_pre_enable+0x82/0xa0 [xe]
<4> [378.620090]  intel_enable_crtc+0xeb/0x110 [xe]
<4> [378.620641]  ? intel_set_cdclk_pre_plane_update+0x70/0x310 [xe]
...
igt@kms_atomic_transition@plane-all-modeset-transition-fencing@pipe-a-dp-1
D igt@kms_atomic_transition@plane-all-modeset-transition-fencing@pipe-a-dp-1
xe-2198-9bcce25c88a853967702ceae9f9ef35d2c0e7ee8

<3> [56.348490] xe 0000:00:02.0: [drm] *ERROR* Failed to read source OUI
<3> [56.724166] xe 0000:00:02.0: [drm] *ERROR* Failed to read source OUI
<3> [57.092823] xe 0000:00:02.0: [drm] *ERROR* Failed to read source OUI
<3> [57.448656] xe 0000:00:02.0: [drm] *ERROR* Failed to read source OUI
<3> [57.802696] xe 0000:00:02.0: [drm] *ERROR* Failed to read source OUI
<3> [66.358584] xe 0000:00:02.0: [drm] *ERROR* Failed to read source OUI
<3> [66.708993] xe 0000:00:02.0: [drm] *ERROR* Failed to read source OUI
<3> [67.062996] xe 0000:00:02.0: [drm] *ERROR* Failed to read source OUI
<3> [67.418625] xe 0000:00:02.0: [drm] *ERROR* Failed to read source OUI
<3> [67.782084] xe 0000:00:02.0: [drm] *ERROR* Failed to read source OUI
<3> [76.408513] xe 0000:00:02.0: [drm] *ERROR* Failed to read source OUI
<3> [76.765230] xe 0000:00:02.0: [drm] *ERROR* Failed to read source OUI
<3> [77.138095] xe 0000:00:02.0: [drm] *ERROR* Failed to read source OUI
<3> [77.501030] xe 0000:00:02.0: [drm] *ERROR* Failed to read source OUI
<3> [77.879538] xe 0000:00:02.0: [drm] *ERROR* Failed to read source OUI
<3> [86.450293] xe 0000:00:02.0: [drm] *ERROR* Failed to read source OUI
<3> [86.816804] xe 0000:00:02.0: [drm] *ERROR* Failed to read source OUI
...
igt@kms_atomic_transition@plane-all-modeset-transition-fencing@pipe-b-dp-1
D igt@kms_atomic_transition@plane-all-modeset-transition-fencing@pipe-b-dp-1
xe-2198-9bcce25c88a853967702ceae9f9ef35d2c0e7ee8

<3> [96.400423] xe 0000:00:02.0: [drm] *ERROR* Failed to read source OUI
<3> [96.749581] xe 0000:00:02.0: [drm] *ERROR* Failed to read source OUI
<3> [97.130847] xe 0000:00:02.0: [drm] *ERROR* Failed to read source OUI
<3> [97.485587] xe 0000:00:02.0: [drm] *ERROR* Failed to read source OUI
<3> [97.862051] xe 0000:00:02.0: [drm] *ERROR* Failed to read source OUI
<3> [106.505267] xe 0000:00:02.0: [drm] *ERROR* Failed to read source OUI
<3> [106.881260] xe 0000:00:02.0: [drm] *ERROR* Failed to read source OUI
<3> [107.231257] xe 0000:00:02.0: [drm] *ERROR* Failed to read source OUI
<3> [107.579361] xe 0000:00:02.0: [drm] *ERROR* Failed to read source OUI
<3> [107.929362] xe 0000:00:02.0: [drm] *ERROR* Failed to read source OUI
<3> [116.545974] xe 0000:00:02.0: [drm] *ERROR* Failed to read source OUI
<3> [116.897446] xe 0000:00:02.0: [drm] *ERROR* Failed to read source OUI
<3> [117.254429] xe 0000:00:02.0: [drm] *ERROR* Failed to read source OUI
<3> [117.603054] xe 0000:00:02.0: [drm] *ERROR* Failed to read source OUI
<3> [117.969863] xe 0000:00:02.0: [drm] *ERROR* Failed to read source OUI
<3> [126.468573] xe 0000:00:02.0: [drm] *ERROR* Failed to read source OUI
<3> [126.826880] xe 0000:00:02.0: [drm] *ERROR* Failed to read source OUI
...
igt@kms_flip@bo-too-big-interruptible@a-dp1
T igt@kms_flip@bo-too-big-interruptible@a-dp1
xe-2198-9bcce25c88a853967702ceae9f9ef35d2c0e7ee8

<7> [234.993176] xe 0000:00:02.0: [drm:intel_power_well_disable [xe]] disablin...
<6> [235.009830] Console: switching to colour dummy device 80x25
<6> [235.009996] [IGT] kms_flip: executing
<7> [235.015950] xe 0000:00:02.0: [drm:drm_helper_probe_single_connector_modes...
<7> [235.015966] xe 0000:00:02.0: [drm:intel_dp_detect [xe]] [CONNECTOR:202:DP...
<7> [235.016085] xe 0000:00:02.0: [drm:intel_tc_port_update_mode [xe]] Port E/...
<7> [235.016160] xe 0000:00:02.0: [drm:drm_helper_probe_single_connector_modes...
<7> [235.016385] xe 0000:00:02.0: [drm:drm_helper_probe_single_connector_modes...
<7> [235.016393] xe 0000:00:02.0: [drm:intel_dp_detect [xe]] [CONNECTOR:210:DP...
<7> [235.016496] xe 0000:00:02.0: [drm:intel_tc_port_update_mode [xe]] Port F/...
<7> [235.016565] xe 0000:00:02.0: [drm:drm_helper_probe_single_connector_modes...
<7> [235.016807] xe 0000:00:02.0: [drm:drm_helper_probe_single_connector_modes...
<7> [235.016814] xe 0000:00:02.0: [drm:intel_dp_detect [xe]] [CONNECTOR:189:DP...
<7> [235.016920] xe 0000:00:02.0: [drm:intel_power_well_enable [xe]] enabling ...
<7> [235.020782] xe 0000:00:02.0: [drm:drm_dp_read_dpcd_caps [drm_display_help...
<7> [235.020801] xe 0000:00:02.0: [drm:drm_dp_read_dpcd_caps [drm_display_help...
<7> [235.021932] xe 0000:00:02.0: [drm:intel_dp_init_lttpr_and_dprx_caps [xe]]...
...
igt@kms_flip@dpms-vs-vblank-race@c-dp1
D igt@kms_flip@dpms-vs-vblank-race@c-dp1
xe-2198-9bcce25c88a853967702ceae9f9ef35d2c0e7ee8

<3> [403.540798] xe 0000:00:02.0: [drm] *ERROR* Failed to read source OUI
<3> [403.953454] xe 0000:00:02.0: [drm] *ERROR* Failed to read source OUI
<3> [404.384427] xe 0000:00:02.0: [drm] *ERROR* Failed to read source OUI
<3> [404.818501] xe 0000:00:02.0: [drm] *ERROR* Failed to read source OUI
igt@kms_flip@dpms-vs-vblank-race-interruptible@b-dp1
D igt@kms_flip@dpms-vs-vblank-race-interruptible@b-dp1
xe-2198-9bcce25c88a853967702ceae9f9ef35d2c0e7ee8

<3> [413.510487] xe 0000:00:02.0: [drm] *ERROR* Failed to read source OUI
<3> [413.957849] xe 0000:00:02.0: [drm] *ERROR* Failed to read source OUI
igt@kms_plane_cursor@overlay@pipe-a-dp-1-size-64
igt@kms_plane_cursor@overlay@pipe-a-dp-1-size-64
xe-2198-9bcce25c88a853967702ceae9f9ef35d2c0e7ee8

Starting subtest: overlay
Starting dynamic subtest: pipe-A-DP-1-size-64
(kms_plane_cursor:5150) igt_pipe_crc-CRITICAL: Test assertion failure function...
(kms_plane_cursor:5150) igt_pipe_crc-CRITICAL: Failed assertion: !mismatch || ...
Dynamic subtest pipe-A-DP-1-size-64 failed.
**** DEBUG ****
(kms_plane_cursor:5150) igt_kms-DEBUG: plane C.1: Setting property "SRC_Y" to ...
(kms_plane_cursor:5150) igt_kms-DEBUG: plane C.1: Setting property "SRC_W" to ...
(kms_plane_cursor:5150) igt_kms-DEBUG: plane C.1: Setting property "SRC_H" to ...
(kms_plane_cursor:5150) igt_kms-DEBUG: plane C.1: Setting property "CRTC_X" to...
(kms_plane_cursor:5150) igt_kms-DEBUG: plane C.1: Setting property "CRTC_Y" to...
(kms_plane_cursor:5150) igt_kms-DEBUG: plane C.1: Setting property "CRTC_W" to...
(kms_plane_cursor:5150) igt_kms-DEBUG: plane C.1: Setting property "CRTC_H" to...
(kms_plane_cursor:5150) igt_kms-DEBUG: plane C.1: Setting property "FB_ID" to ...
(kms_plane_cursor:5150) igt_kms-DEBUG: plane C.1: Setting property "CRTC_ID" t...
(kms_plane_cursor:5150) igt_kms-DEBUG: plane C.1: Setting property "rotation" ...
(kms_plane_cursor:5150) igt_kms-DEBUG: plane C.1: Setting property "COLOR_ENCO...
...
igt@kms_plane_cursor@overlay@pipe-a-dp-1-size-128
igt@kms_plane_cursor@overlay@pipe-a-dp-1-size-128
xe-2198-9bcce25c88a853967702ceae9f9ef35d2c0e7ee8

Starting dynamic subtest: pipe-A-DP-1-size-128
(kms_plane_cursor:5150) igt_pipe_crc-CRITICAL: Test assertion failure function...
(kms_plane_cursor:5150) igt_pipe_crc-CRITICAL: Failed assertion: !mismatch || ...
Dynamic subtest pipe-A-DP-1-size-128 failed.
**** DEBUG ****
(kms_plane_cursor:5150) DEBUG: Test requirement passed: !(size > data->max_cur...
(kms_plane_cursor:5150) igt_fb-DEBUG: igt_create_fb_with_bo_size(width=3840, h...
(kms_plane_cursor:5150) igt_fb-DEBUG: igt_create_fb_with_bo_size(handle=1, pit...
(kms_plane_cursor:5150) ioctl_wrappers-DEBUG: Test requirement passed: igt_has...
(kms_plane_cursor:5150) intel_allocator_simple-DEBUG: Using simple allocator
(kms_plane_cursor:5150) intel_allocator_simple-DEBUG: <ial: 0x5641ffb47bd0, fd...
(kms_plane_cursor:5150) intel_allocator_simple-DEBUG: <ial: 0x5641ffb47bd0, fd...
(kms_plane_cursor:5150) intel_allocator_simple-DEBUG: Using simple allocator
(kms_plane_cursor:5150) intel_allocator_simple-DEBUG: <ial: 0x5641ffb5a3c0, fd...
(kms_plane_cursor:5150) intel_allocator_simple-DEBUG: <ial: 0x5641ffb5a3c0, fd...
(kms_plane_cursor:5150) igt_fb-DEBUG: igt_create_fb_with_bo_size(width=1920, h...
(kms_plane_cursor:5150) igt_fb-DEBUG: igt_create_fb_with_bo_size(handle=2, pit...
...
igt@kms_plane_cursor@overlay@pipe-a-dp-1-size-256
igt@kms_plane_cursor@overlay@pipe-a-dp-1-size-256
xe-2198-9bcce25c88a853967702ceae9f9ef35d2c0e7ee8

Starting dynamic subtest: pipe-A-DP-1-size-256
(kms_plane_cursor:5150) igt_pipe_crc-CRITICAL: Test assertion failure function...
(kms_plane_cursor:5150) igt_pipe_crc-CRITICAL: Failed assertion: !mismatch || ...
Dynamic subtest pipe-A-DP-1-size-256 failed.
**** DEBUG ****
(kms_plane_cursor:5150) DEBUG: Test requirement passed: !(size > data->max_cur...
(kms_plane_cursor:5150) igt_fb-DEBUG: igt_create_fb_with_bo_size(width=3840, h...
(kms_plane_cursor:5150) igt_fb-DEBUG: igt_create_fb_with_bo_size(handle=1, pit...
(kms_plane_cursor:5150) ioctl_wrappers-DEBUG: Test requirement passed: igt_has...
(kms_plane_cursor:5150) intel_allocator_simple-DEBUG: Using simple allocator
(kms_plane_cursor:5150) intel_allocator_simple-DEBUG: <ial: 0x5641ffb558a0, fd...
(kms_plane_cursor:5150) intel_allocator_simple-DEBUG: <ial: 0x5641ffb558a0, fd...
(kms_plane_cursor:5150) intel_allocator_simple-DEBUG: Using simple allocator
(kms_plane_cursor:5150) intel_allocator_simple-DEBUG: <ial: 0x5641ffb49040, fd...
(kms_plane_cursor:5150) intel_allocator_simple-DEBUG: <ial: 0x5641ffb49040, fd...
(kms_plane_cursor:5150) igt_fb-DEBUG: igt_create_fb_with_bo_size(width=1920, h...
(kms_plane_cursor:5150) igt_fb-DEBUG: igt_create_fb_with_bo_size(handle=2, pit...
...
igt@kms_plane_cursor@primary@pipe-a-dp-1-size-64
igt@kms_plane_cursor@primary@pipe-a-dp-1-size-64
xe-2198-9bcce25c88a853967702ceae9f9ef35d2c0e7ee8

Starting subtest: primary
Starting dynamic subtest: pipe-A-DP-1-size-64
(kms_plane_cursor:5335) igt_pipe_crc-CRITICAL: Test assertion failure function...
(kms_plane_cursor:5335) igt_pipe_crc-CRITICAL: Failed assertion: !mismatch || ...
Dynamic subtest pipe-A-DP-1-size-64 failed.
**** DEBUG ****
(kms_plane_cursor:5335) igt_kms-DEBUG: plane B.4: Setting property "COLOR_RANG...
(kms_plane_cursor:5335) igt_kms-DEBUG: plane B.4: Setting property "pixel blen...
(kms_plane_cursor:5335) igt_kms-DEBUG: plane B.4: Setting property "alpha" to ...
(kms_plane_cursor:5335) igt_kms-DEBUG: plane B.4: Setting property "FB_DAMAGE_...
(kms_plane_cursor:5335) igt_kms-DEBUG: plane B.4: Setting property "SCALING_FI...
(kms_plane_cursor:5335) igt_kms-DEBUG: display:     populating plane data: B.5...
(kms_plane_cursor:5335) igt_kms-DEBUG: plane B.5: Setting property "SRC_X" to ...
(kms_plane_cursor:5335) igt_kms-DEBUG: plane B.5: Setting property "SRC_Y" to ...
(kms_plane_cursor:5335) igt_kms-DEBUG: plane B.5: Setting property "SRC_W" to ...
(kms_plane_cursor:5335) igt_kms-DEBUG: plane B.5: Setting property "SRC_H" to ...
(kms_plane_cursor:5335) igt_kms-DEBUG: plane B.5: Setting property "CRTC_X" to...
...
igt@kms_plane_cursor@primary@pipe-a-dp-1-size-128
igt@kms_plane_cursor@primary@pipe-a-dp-1-size-128
xe-2198-9bcce25c88a853967702ceae9f9ef35d2c0e7ee8

Starting dynamic subtest: pipe-A-DP-1-size-128
(kms_plane_cursor:5335) igt_pipe_crc-CRITICAL: Test assertion failure function...
(kms_plane_cursor:5335) igt_pipe_crc-CRITICAL: Failed assertion: !mismatch || ...
Dynamic subtest pipe-A-DP-1-size-128 failed.
**** DEBUG ****
(kms_plane_cursor:5335) DEBUG: Test requirement passed: !(size > data->max_cur...
(kms_plane_cursor:5335) igt_fb-DEBUG: igt_create_fb_with_bo_size(width=3840, h...
(kms_plane_cursor:5335) igt_fb-DEBUG: igt_create_fb_with_bo_size(handle=1, pit...
(kms_plane_cursor:5335) ioctl_wrappers-DEBUG: Test requirement passed: igt_has...
(kms_plane_cursor:5335) intel_allocator_simple-DEBUG: Using simple allocator
(kms_plane_cursor:5335) intel_allocator_simple-DEBUG: <ial: 0x55c40ce7e0a0, fd...
(kms_plane_cursor:5335) intel_allocator_simple-DEBUG: <ial: 0x55c40ce7e0a0, fd...
(kms_plane_cursor:5335) intel_allocator_simple-DEBUG: Using simple allocator
(kms_plane_cursor:5335) intel_allocator_simple-DEBUG: <ial: 0x55c40ce7ef30, fd...
(kms_plane_cursor:5335) intel_allocator_simple-DEBUG: <ial: 0x55c40ce7ef30, fd...
(kms_plane_cursor:5335) igt_fb-DEBUG: igt_create_fb_with_bo_size(width=128, he...
(kms_plane_cursor:5335) igt_fb-DEBUG: igt_create_fb_with_bo_size(handle=2, pit...
...
igt@kms_plane_cursor@primary@pipe-a-dp-1-size-256
igt@kms_plane_cursor@primary@pipe-a-dp-1-size-256
xe-2198-9bcce25c88a853967702ceae9f9ef35d2c0e7ee8

Starting dynamic subtest: pipe-A-DP-1-size-256
(kms_plane_cursor:5335) igt_pipe_crc-CRITICAL: Test assertion failure function...
(kms_plane_cursor:5335) igt_pipe_crc-CRITICAL: Failed assertion: !mismatch || ...
Dynamic subtest pipe-A-DP-1-size-256 failed.
**** DEBUG ****
(kms_plane_cursor:5335) DEBUG: Test requirement passed: !(size > data->max_cur...
(kms_plane_cursor:5335) igt_fb-DEBUG: igt_create_fb_with_bo_size(width=3840, h...
(kms_plane_cursor:5335) igt_fb-DEBUG: igt_create_fb_with_bo_size(handle=1, pit...
(kms_plane_cursor:5335) ioctl_wrappers-DEBUG: Test requirement passed: igt_has...
(kms_plane_cursor:5335) intel_allocator_simple-DEBUG: Using simple allocator
(kms_plane_cursor:5335) intel_allocator_simple-DEBUG: <ial: 0x55c40ce7b860, fd...
(kms_plane_cursor:5335) intel_allocator_simple-DEBUG: <ial: 0x55c40ce7b860, fd...
(kms_plane_cursor:5335) intel_allocator_simple-DEBUG: Using simple allocator
(kms_plane_cursor:5335) intel_allocator_simple-DEBUG: <ial: 0x55c40ce7b860, fd...
(kms_plane_cursor:5335) intel_allocator_simple-DEBUG: <ial: 0x55c40ce7b860, fd...
(kms_plane_cursor:5335) igt_fb-DEBUG: igt_create_fb_with_bo_size(width=256, he...
(kms_plane_cursor:5335) igt_fb-DEBUG: igt_create_fb_with_bo_size(handle=2, pit...
...
igt@kms_plane_cursor@viewport@pipe-a-dp-1-size-64
igt@kms_plane_cursor@viewport@pipe-a-dp-1-size-64
xe-2198-9bcce25c88a853967702ceae9f9ef35d2c0e7ee8

Starting subtest: viewport
Starting dynamic subtest: pipe-A-DP-1-size-64
(kms_plane_cursor:5485) igt_pipe_crc-CRITICAL: Test assertion failure function...
(kms_plane_cursor:5485) igt_pipe_crc-CRITICAL: Failed assertion: !mismatch || ...
Dynamic subtest pipe-A-DP-1-size-64 failed.
**** DEBUG ****
(kms_plane_cursor:5485) igt_kms-DEBUG: plane C.1: Setting property "SRC_Y" to ...
(kms_plane_cursor:5485) igt_kms-DEBUG: plane C.1: Setting property "SRC_W" to ...
(kms_plane_cursor:5485) igt_kms-DEBUG: plane C.1: Setting property "SRC_H" to ...
(kms_plane_cursor:5485) igt_kms-DEBUG: plane C.1: Setting property "CRTC_X" to...
(kms_plane_cursor:5485) igt_kms-DEBUG: plane C.1: Setting property "CRTC_Y" to...
(kms_plane_cursor:5485) igt_kms-DEBUG: plane C.1: Setting property "CRTC_W" to...
(kms_plane_cursor:5485) igt_kms-DEBUG: plane C.1: Setting property "CRTC_H" to...
(kms_plane_cursor:5485) igt_kms-DEBUG: plane C.1: Setting property "FB_ID" to ...
(kms_plane_cursor:5485) igt_kms-DEBUG: plane C.1: Setting property "CRTC_ID" t...
(kms_plane_cursor:5485) igt_kms-DEBUG: plane C.1: Setting property "rotation" ...
(kms_plane_cursor:5485) igt_kms-DEBUG: plane C.1: Setting property "COLOR_ENCO...
...
igt@kms_plane_cursor@viewport@pipe-a-dp-1-size-128
igt@kms_plane_cursor@viewport@pipe-a-dp-1-size-128
xe-2198-9bcce25c88a853967702ceae9f9ef35d2c0e7ee8

Starting dynamic subtest: pipe-A-DP-1-size-128
(kms_plane_cursor:5485) igt_pipe_crc-CRITICAL: Test assertion failure function...
(kms_plane_cursor:5485) igt_pipe_crc-CRITICAL: Failed assertion: !mismatch || ...
Dynamic subtest pipe-A-DP-1-size-128 failed.
**** DEBUG ****
(kms_plane_cursor:5485) DEBUG: Test requirement passed: !(size > data->max_cur...
(kms_plane_cursor:5485) igt_fb-DEBUG: igt_create_fb_with_bo_size(width=3840, h...
(kms_plane_cursor:5485) igt_fb-DEBUG: igt_create_fb_with_bo_size(handle=1, pit...
(kms_plane_cursor:5485) ioctl_wrappers-DEBUG: Test requirement passed: igt_has...
(kms_plane_cursor:5485) intel_allocator_simple-DEBUG: Using simple allocator
(kms_plane_cursor:5485) intel_allocator_simple-DEBUG: <ial: 0x5588ec91dbd0, fd...
(kms_plane_cursor:5485) intel_allocator_simple-DEBUG: <ial: 0x5588ec91dbd0, fd...
(kms_plane_cursor:5485) intel_allocator_simple-DEBUG: Using simple allocator
(kms_plane_cursor:5485) intel_allocator_simple-DEBUG: <ial: 0x5588ec92fe50, fd...
(kms_plane_cursor:5485) intel_allocator_simple-DEBUG: <ial: 0x5588ec92fe50, fd...
(kms_plane_cursor:5485) igt_fb-DEBUG: igt_create_fb_with_bo_size(width=2048, h...
(kms_plane_cursor:5485) igt_fb-DEBUG: igt_create_fb_with_bo_size(handle=2, pit...
...
igt@kms_plane_cursor@viewport@pipe-a-dp-1-size-256
igt@kms_plane_cursor@viewport@pipe-a-dp-1-size-256
xe-2198-9bcce25c88a853967702ceae9f9ef35d2c0e7ee8

Starting dynamic subtest: pipe-A-DP-1-size-256
(kms_plane_cursor:5485) igt_pipe_crc-CRITICAL: Test assertion failure function...
(kms_plane_cursor:5485) igt_pipe_crc-CRITICAL: Failed assertion: !mismatch || ...
Dynamic subtest pipe-A-DP-1-size-256 failed.
**** DEBUG ****
(kms_plane_cursor:5485) DEBUG: Test requirement passed: !(size > data->max_cur...
(kms_plane_cursor:5485) igt_fb-DEBUG: igt_create_fb_with_bo_size(width=3840, h...
(kms_plane_cursor:5485) igt_fb-DEBUG: igt_create_fb_with_bo_size(handle=1, pit...
(kms_plane_cursor:5485) ioctl_wrappers-DEBUG: Test requirement passed: igt_has...
(kms_plane_cursor:5485) intel_allocator_simple-DEBUG: Using simple allocator
(kms_plane_cursor:5485) intel_allocator_simple-DEBUG: <ial: 0x5588ec91ceb0, fd...
(kms_plane_cursor:5485) intel_allocator_simple-DEBUG: <ial: 0x5588ec91ceb0, fd...
(kms_plane_cursor:5485) intel_allocator_simple-DEBUG: Using simple allocator
(kms_plane_cursor:5485) intel_allocator_simple-DEBUG: <ial: 0x5588ec91ceb0, fd...
(kms_plane_cursor:5485) intel_allocator_simple-DEBUG: <ial: 0x5588ec91ceb0, fd...
(kms_plane_cursor:5485) igt_fb-DEBUG: igt_create_fb_with_bo_size(width=2048, h...
(kms_plane_cursor:5485) igt_fb-DEBUG: igt_create_fb_with_bo_size(handle=2, pit...
...
igt@kms_universal_plane@cursor-fb-leak@pipe-a-dp-1
igt@kms_universal_plane@cursor-fb-leak@pipe-a-dp-1
xe-2198-9bcce25c88a853967702ceae9f9ef35d2c0e7ee8

Starting subtest: cursor-fb-leak
Starting dynamic subtest: pipe-A-DP-1
(kms_universal_plane:9334) CRITICAL: Test assertion failure function cursor_le...
(kms_universal_plane:9334) CRITICAL: Failed assertion: count1 == count2
(kms_universal_plane:9334) CRITICAL: Last errno: 9, Bad file descriptor
(kms_universal_plane:9334) CRITICAL: error: 1 != 3
Dynamic subtest pipe-A-DP-1 failed.
**** DEBUG ****
(kms_universal_plane:9334) igt_kms-DEBUG: display: A.5: plane_set_size (64x64)
(kms_universal_plane:9334) igt_kms-DEBUG: display: A.5: fb_set_position(0,0)
(kms_universal_plane:9334) igt_kms-DEBUG: display: A.5: fb_set_size(64x64)
(kms_universal_plane:9334) igt_kms-DEBUG: display: commit {
(kms_universal_plane:9334) igt_kms-DEBUG: Test requirement passed: plane_idx >...
(kms_universal_plane:9334) igt_kms-DEBUG: Test requirement passed: plane_idx >...
(kms_universal_plane:9334) igt_kms-DEBUG: Test requirement passed: plane_idx >...
(kms_universal_plane:9334) igt_kms-DEBUG: Test requirement passed: plane_idx >...
(kms_universal_plane:9334) igt_kms-DEBUG: Test requirement passed: plane_idx >...
...
igt@kms_flip@2x-absolute-wf_vblank@bc-dp1-dp6
igt@kms_flip@2x-absolute-wf_vblank@bc-dp1-dp6
xe-2198-9bcce25c88a853967702ceae9f9ef35d2c0e7ee8

Starting dynamic subtest: BC-DP1-DP6
(kms_flip:3543) CRITICAL: Test assertion failure function check_state, file .....
(kms_flip:3543) CRITICAL: Failed assertion: timercmp(&es->last_received_ts, &e...
(kms_flip:3543) CRITICAL: vblank ts before the vblank was issued!
timerdiff -0.003766
Dynamic subtest BC-DP1-DP6 failed.
**** DEBUG ****
(kms_flip:3543) igt_fb-DEBUG: igt_create_fb_with_bo_size(width=3840, height=21...
(kms_flip:3543) igt_fb-DEBUG: igt_create_fb_with_bo_size(handle=1, pitch=15360)
(kms_flip:3543) ioctl_wrappers-DEBUG: Test requirement passed: igt_has_fb_modi...
(kms_flip:3543) igt_fb-DEBUG: igt_create_fb_with_bo_size(width=3840, height=21...
(kms_flip:3543) igt_fb-DEBUG: igt_create_fb_with_bo_size(handle=2, pitch=15360)
(kms_flip:3543) ioctl_wrappers-DEBUG: Test requirement passed: igt_has_fb_modi...
(kms_flip:3543) intel_allocator_simple-DEBUG: Using simple allocator
(kms_flip:3543) intel_allocator_simple-DEBUG: <ial: 0x55e2febe1f50, fd: 5> obj...
(kms_flip:3543) intel_allocator_simple-DEBUG: <ial: 0x55e2febe1f50, fd: 5> obj...
(kms_flip:3543) intel_allocator_simple-DEBUG: Using simple allocator
...
igt@kms_flip@2x-flip-vs-absolute-wf_vblank@ab-dp1-dp6
igt@kms_flip@2x-flip-vs-absolute-wf_vblank@ab-dp1-dp6
xe-2198-9bcce25c88a853967702ceae9f9ef35d2c0e7ee8

Starting subtest: 2x-flip-vs-absolute-wf_vblank
Starting dynamic subtest: AB-DP1-DP6
(kms_flip:3929) CRITICAL: Test assertion failure function __run_test_on_crtc_s...
(kms_flip:3929) CRITICAL: Failed assertion: !ret
(kms_flip:3929) CRITICAL: Last errno: 22, Invalid argument
Dynamic subtest AB-DP1-DP6 failed.
**** DEBUG ****
(kms_flip:3929) igt_fb-DEBUG: igt_create_fb_with_bo_size(width=3840, height=21...
(kms_flip:3929) igt_fb-DEBUG: igt_create_fb_with_bo_size(handle=1, pitch=15360)
(kms_flip:3929) ioctl_wrappers-DEBUG: Test requirement passed: igt_has_fb_modi...
(kms_flip:3929) igt_fb-DEBUG: igt_create_fb_with_bo_size(width=3840, height=21...
(kms_flip:3929) igt_fb-DEBUG: igt_create_fb_with_bo_size(handle=2, pitch=15360)
(kms_flip:3929) ioctl_wrappers-DEBUG: Test requirement passed: igt_has_fb_modi...
(kms_flip:3929) intel_allocator_simple-DEBUG: Using simple allocator
(kms_flip:3929) intel_allocator_simple-DEBUG: <ial: 0x5625c364fae0, fd: 5> obj...
(kms_flip:3929) intel_allocator_simple-DEBUG: <ial: 0x5625c364fae0, fd: 5> obj...
(kms_flip:3929) intel_allocator_simple-DEBUG: Using simple allocator
...
igt@kms_flip@2x-flip-vs-absolute-wf_vblank@ac-dp1-dp6
igt@kms_flip@2x-flip-vs-absolute-wf_vblank@ac-dp1-dp6
xe-2198-9bcce25c88a853967702ceae9f9ef35d2c0e7ee8

Starting dynamic subtest: AC-DP1-DP6
(kms_flip:3929) CRITICAL: Test assertion failure function __run_test_on_crtc_s...
(kms_flip:3929) CRITICAL: Failed assertion: !ret
(kms_flip:3929) CRITICAL: Last errno: 22, Invalid argument
Dynamic subtest AC-DP1-DP6 failed.
**** DEBUG ****
(kms_flip:3929) igt_fb-DEBUG: igt_create_fb_with_bo_size(width=3840, height=21...
(kms_flip:3929) igt_fb-DEBUG: igt_create_fb_with_bo_size(handle=3, pitch=15360)
(kms_flip:3929) ioctl_wrappers-DEBUG: Test requirement passed: igt_has_fb_modi...
(kms_flip:3929) igt_fb-DEBUG: igt_create_fb_with_bo_size(width=3840, height=21...
(kms_flip:3929) igt_fb-DEBUG: igt_create_fb_with_bo_size(handle=4, pitch=15360)
(kms_flip:3929) ioctl_wrappers-DEBUG: Test requirement passed: igt_has_fb_modi...
(kms_flip:3929) intel_allocator_simple-DEBUG: Using simple allocator
(kms_flip:3929) intel_allocator_simple-DEBUG: <ial: 0x5625c36bc000, fd: 5> obj...
(kms_flip:3929) intel_allocator_simple-DEBUG: <ial: 0x5625c36bc000, fd: 5> obj...
(kms_flip:3929) intel_allocator_simple-DEBUG: Using simple allocator
(kms_flip:3929) intel_allocator_simple-DEBUG: <ial: 0x5625c36bc000, fd: 5> obj...
...
igt@kms_flip@2x-flip-vs-absolute-wf_vblank@bc-dp1-dp6
igt@kms_flip@2x-flip-vs-absolute-wf_vblank@bc-dp1-dp6
xe-2198-9bcce25c88a853967702ceae9f9ef35d2c0e7ee8

Starting dynamic subtest: BC-DP1-DP6
(kms_flip:3929) CRITICAL: Test assertion failure function __run_test_on_crtc_s...
(kms_flip:3929) CRITICAL: Failed assertion: !ret
(kms_flip:3929) CRITICAL: Last errno: 22, Invalid argument
Dynamic subtest BC-DP1-DP6 failed.
**** DEBUG ****
(kms_flip:3929) igt_fb-DEBUG: igt_create_fb_with_bo_size(width=3840, height=21...
(kms_flip:3929) igt_fb-DEBUG: igt_create_fb_with_bo_size(handle=5, pitch=15360)
(kms_flip:3929) ioctl_wrappers-DEBUG: Test requirement passed: igt_has_fb_modi...
(kms_flip:3929) igt_fb-DEBUG: igt_create_fb_with_bo_size(width=3840, height=21...
(kms_flip:3929) igt_fb-DEBUG: igt_create_fb_with_bo_size(handle=6, pitch=15360)
(kms_flip:3929) ioctl_wrappers-DEBUG: Test requirement passed: igt_has_fb_modi...
(kms_flip:3929) intel_allocator_simple-DEBUG: Using simple allocator
(kms_flip:3929) intel_allocator_simple-DEBUG: <ial: 0x5625c36c36b0, fd: 5> obj...
(kms_flip:3929) intel_allocator_simple-DEBUG: <ial: 0x5625c36c36b0, fd: 5> obj...
(kms_flip:3929) intel_allocator_simple-DEBUG: Using simple allocator
(kms_flip:3929) intel_allocator_simple-DEBUG: <ial: 0x5625c36ce270, fd: 5> obj...
...
igt@kms_flip@2x-flip-vs-blocking-wf-vblank@ac-dp1-dp7
igt@kms_flip@2x-flip-vs-blocking-wf-vblank@ac-dp1-dp7
xe-2198-9bcce25c88a853967702ceae9f9ef35d2c0e7ee8

Starting dynamic subtest: AC-DP1-DP7
(kms_flip:4014) CRITICAL: Test assertion failure function __run_test_on_crtc_s...
(kms_flip:4014) CRITICAL: Failed assertion: !retried && needs_retry_after_link...
Dynamic subtest AC-DP1-DP7 failed.
**** DEBUG ****
(kms_flip:4014) igt_fb-DEBUG: igt_create_fb_with_bo_size(width=3840, height=21...
(kms_flip:4014) igt_fb-DEBUG: igt_create_fb_with_bo_size(handle=1, pitch=15360)
(kms_flip:4014) ioctl_wrappers-DEBUG: Test requirement passed: igt_has_fb_modi...
(kms_flip:4014) igt_fb-DEBUG: igt_create_fb_with_bo_size(width=3840, height=21...
(kms_flip:4014) igt_fb-DEBUG: igt_create_fb_with_bo_size(handle=2, pitch=15360)
(kms_flip:4014) ioctl_wrappers-DEBUG: Test requirement passed: igt_has_fb_modi...
(kms_flip:4014) intel_allocator_simple-DEBUG: Using simple allocator
(kms_flip:4014) intel_allocator_simple-DEBUG: <ial: 0x557e26391770, fd: 5> obj...
(kms_flip:4014) intel_allocator_simple-DEBUG: <ial: 0x557e26391770, fd: 5> obj...
(kms_flip:4014) intel_allocator_simple-DEBUG: Using simple allocator
(kms_flip:4014) intel_allocator_simple-DEBUG: <ial: 0x557e2632b280, fd: 5> obj...
(kms_flip:4014) intel_allocator_simple-DEBUG: <ial: 0x557e2632b280, fd: 5> obj...
...
igt@kms_flip@2x-flip-vs-blocking-wf-vblank@bc-dp1-dp7
igt@kms_flip@2x-flip-vs-blocking-wf-vblank@bc-dp1-dp7
xe-2198-9bcce25c88a853967702ceae9f9ef35d2c0e7ee8

Starting dynamic subtest: BC-DP1-DP7
(kms_flip:4014) CRITICAL: Test assertion failure function __run_test_on_crtc_s...
(kms_flip:4014) CRITICAL: Failed assertion: !retried && needs_retry_after_link...
Dynamic subtest BC-DP1-DP7 failed.
**** DEBUG ****
(kms_flip:4014) igt_fb-DEBUG: igt_create_fb_with_bo_size(width=3840, height=21...
(kms_flip:4014) igt_fb-DEBUG: igt_create_fb_with_bo_size(handle=3, pitch=15360)
(kms_flip:4014) ioctl_wrappers-DEBUG: Test requirement passed: igt_has_fb_modi...
(kms_flip:4014) igt_fb-DEBUG: igt_create_fb_with_bo_size(width=3840, height=21...
(kms_flip:4014) igt_fb-DEBUG: igt_create_fb_with_bo_size(handle=4, pitch=15360)
(kms_flip:4014) ioctl_wrappers-DEBUG: Test requirement passed: igt_has_fb_modi...
(kms_flip:4014) intel_allocator_simple-DEBUG: Using simple allocator
(kms_flip:4014) intel_allocator_simple-DEBUG: <ial: 0x557e2637ca70, fd: 5> obj...
(kms_flip:4014) intel_allocator_simple-DEBUG: <ial: 0x557e2637ca70, fd: 5> obj...
(kms_flip:4014) intel_allocator_simple-DEBUG: Using simple allocator
(kms_flip:4014) intel_allocator_simple-DEBUG: <ial: 0x557e2639f480, fd: 5> obj...
(kms_flip:4014) intel_allocator_simple-DEBUG: <ial: 0x557e2639f480, fd: 5> obj...
...
igt@kms_flip@plain-flip-fb-recreate@a-dp6
igt@kms_flip@plain-flip-fb-recreate@a-dp6
xe-2198-9bcce25c88a853967702ceae9f9ef35d2c0e7ee8

Starting dynamic subtest: A-DP6
(kms_flip:3075) CRITICAL: Test assertion failure function __run_test_on_crtc_s...
(kms_flip:3075) CRITICAL: Failed assertion: !ret
(kms_flip:3075) CRITICAL: Last errno: 22, Invalid argument
Dynamic subtest A-DP6 failed.
**** DEBUG ****
(kms_flip:3075) DEBUG: name = flip
last_ts = 849.216309
last_received_ts = 849.216003
last_seq = 14737
current_ts = 849.232971
current_received_ts = 849.232666
current_seq = 14738
count = 47
seq_step = 1
(kms_flip:3075) DEBUG: flip ts/seq: last 849.216309/14737, current 849.232971/...
(kms_flip:3075) DEBUG: name = flip
...
igt@kms_flip@plain-flip-fb-recreate@b-dp6
igt@kms_flip@plain-flip-fb-recreate@b-dp6
xe-2198-9bcce25c88a853967702ceae9f9ef35d2c0e7ee8

Starting dynamic subtest: B-DP6
(kms_flip:3075) CRITICAL: Test assertion failure function __run_test_on_crtc_s...
(kms_flip:3075) CRITICAL: Failed assertion: !ret
(kms_flip:3075) CRITICAL: Last errno: 22, Invalid argument
Dynamic subtest B-DP6 failed.
**** DEBUG ****
(kms_flip:3075) igt_fb-DEBUG: igt_create_fb_with_bo_size(width=3840, height=21...
(kms_flip:3075) igt_fb-DEBUG: igt_create_fb_with_bo_size(handle=3, pitch=15360)
(kms_flip:3075) ioctl_wrappers-DEBUG: Test requirement passed: igt_has_fb_modi...
(kms_flip:3075) igt_fb-DEBUG: igt_create_fb_with_bo_size(width=3840, height=21...
(kms_flip:3075) igt_fb-DEBUG: igt_create_fb_with_bo_size(handle=4, pitch=15360)
(kms_flip:3075) ioctl_wrappers-DEBUG: Test requirement passed: igt_has_fb_modi...
(kms_flip:3075) intel_allocator_simple-DEBUG: Using simple allocator
(kms_flip:3075) intel_allocator_simple-DEBUG: <ial: 0x55c87dcecce0, fd: 5> obj...
(kms_flip:3075) intel_allocator_simple-DEBUG: <ial: 0x55c87dcecce0, fd: 5> obj...
(kms_flip:3075) intel_allocator_simple-DEBUG: Using simple allocator
(kms_flip:3075) intel_allocator_simple-DEBUG: <ial: 0x55c87dced0a0, fd: 5> obj...
...
igt@kms_flip@plain-flip-fb-recreate@c-dp6
igt@kms_flip@plain-flip-fb-recreate@c-dp6
xe-2198-9bcce25c88a853967702ceae9f9ef35d2c0e7ee8

Starting dynamic subtest: C-DP6
(kms_flip:3075) CRITICAL: Test assertion failure function __run_test_on_crtc_s...
(kms_flip:3075) CRITICAL: Failed assertion: !ret
(kms_flip:3075) CRITICAL: Last errno: 22, Invalid argument
Dynamic subtest C-DP6 failed.
**** DEBUG ****
(kms_flip:3075) igt_fb-DEBUG: igt_create_fb_with_bo_size(width=3840, height=21...
(kms_flip:3075) igt_fb-DEBUG: igt_create_fb_with_bo_size(handle=5, pitch=15360)
(kms_flip:3075) ioctl_wrappers-DEBUG: Test requirement passed: igt_has_fb_modi...
(kms_flip:3075) igt_fb-DEBUG: igt_create_fb_with_bo_size(width=3840, height=21...
(kms_flip:3075) igt_fb-DEBUG: igt_create_fb_with_bo_size(handle=6, pitch=15360)
(kms_flip:3075) ioctl_wrappers-DEBUG: Test requirement passed: igt_has_fb_modi...
(kms_flip:3075) intel_allocator_simple-DEBUG: Using simple allocator
(kms_flip:3075) intel_allocator_simple-DEBUG: <ial: 0x55c87dd12340, fd: 5> obj...
(kms_flip:3075) intel_allocator_simple-DEBUG: <ial: 0x55c87dd12340, fd: 5> obj...
(kms_flip:3075) intel_allocator_simple-DEBUG: Using simple allocator
(kms_flip:3075) intel_allocator_simple-DEBUG: <ial: 0x55c87dd12980, fd: 5> obj...
...
igt@kms_flip@plain-flip-ts-check@a-dp6
igt@kms_flip@plain-flip-ts-check@a-dp6
xe-2198-9bcce25c88a853967702ceae9f9ef35d2c0e7ee8

Starting dynamic subtest: A-DP6
(kms_flip:3259) CRITICAL: Test assertion failure function __run_test_on_crtc_s...
(kms_flip:3259) CRITICAL: Failed assertion: !ret
(kms_flip:3259) CRITICAL: Last errno: 22, Invalid argument
Dynamic subtest A-DP6 failed.
**** DEBUG ****
(kms_flip:3259) DEBUG: name = flip
last_ts = 913.979553
last_received_ts = 913.979126
last_seq = 16326
current_ts = 913.996216
current_received_ts = 913.995850
current_seq = 16327
count = 168
seq_step = 1
(kms_flip:3259) DEBUG: flip ts/seq: last 913.979553/16326, current 913.996216/...
(kms_flip:3259) DEBUG: name = flip
...
igt@kms_flip@plain-flip-ts-check@b-dp6
igt@kms_flip@plain-flip-ts-check@b-dp6
xe-2198-9bcce25c88a853967702ceae9f9ef35d2c0e7ee8

Starting dynamic subtest: B-DP6
(kms_flip:3259) CRITICAL: Test assertion failure function __run_test_on_crtc_s...
(kms_flip:3259) CRITICAL: Failed assertion: !ret
(kms_flip:3259) CRITICAL: Last errno: 22, Invalid argument
Dynamic subtest B-DP6 failed.
**** DEBUG ****
(kms_flip:3259) igt_fb-DEBUG: igt_create_fb_with_bo_size(width=3840, height=21...
(kms_flip:3259) igt_fb-DEBUG: igt_create_fb_with_bo_size(handle=3, pitch=15360)
(kms_flip:3259) ioctl_wrappers-DEBUG: Test requirement passed: igt_has_fb_modi...
(kms_flip:3259) igt_fb-DEBUG: igt_create_fb_with_bo_size(width=3840, height=21...
(kms_flip:3259) igt_fb-DEBUG: igt_create_fb_with_bo_size(handle=4, pitch=15360)
(kms_flip:3259) ioctl_wrappers-DEBUG: Test requirement passed: igt_has_fb_modi...
(kms_flip:3259) intel_allocator_simple-DEBUG: Using simple allocator
(kms_flip:3259) intel_allocator_simple-DEBUG: <ial: 0x55e0a865ed40, fd: 5> obj...
(kms_flip:3259) intel_allocator_simple-DEBUG: <ial: 0x55e0a865ed40, fd: 5> obj...
(kms_flip:3259) intel_allocator_simple-DEBUG: Using simple allocator
(kms_flip:3259) intel_allocator_simple-DEBUG: <ial: 0x55e0a86c2f90, fd: 5> obj...
...
igt@kms_flip@plain-flip-ts-check@c-dp6
igt@kms_flip@plain-flip-ts-check@c-dp6
xe-2198-9bcce25c88a853967702ceae9f9ef35d2c0e7ee8

Starting dynamic subtest: C-DP6
(kms_flip:3259) CRITICAL: Test assertion failure function __run_test_on_crtc_s...
(kms_flip:3259) CRITICAL: Failed assertion: !ret
(kms_flip:3259) CRITICAL: Last errno: 22, Invalid argument
Dynamic subtest C-DP6 failed.
**** DEBUG ****
(kms_flip:3259) igt_fb-DEBUG: igt_create_fb_with_bo_size(width=3840, height=21...
(kms_flip:3259) igt_fb-DEBUG: igt_create_fb_with_bo_size(handle=5, pitch=15360)
(kms_flip:3259) ioctl_wrappers-DEBUG: Test requirement passed: igt_has_fb_modi...
(kms_flip:3259) igt_fb-DEBUG: igt_create_fb_with_bo_size(width=3840, height=21...
(kms_flip:3259) igt_fb-DEBUG: igt_create_fb_with_bo_size(handle=6, pitch=15360)
(kms_flip:3259) ioctl_wrappers-DEBUG: Test requirement passed: igt_has_fb_modi...
(kms_flip:3259) intel_allocator_simple-DEBUG: Using simple allocator
(kms_flip:3259) intel_allocator_simple-DEBUG: <ial: 0x55e0a865ed40, fd: 5> obj...
(kms_flip:3259) intel_allocator_simple-DEBUG: <ial: 0x55e0a865ed40, fd: 5> obj...
(kms_flip:3259) intel_allocator_simple-DEBUG: Using simple allocator
(kms_flip:3259) intel_allocator_simple-DEBUG: <ial: 0x55e0a865ed40, fd: 5> obj...
...
igt@kms_flip@plain-flip-ts-check-interruptible@b-dp7
igt@kms_flip@plain-flip-ts-check-interruptible@b-dp7
xe-2198-9bcce25c88a853967702ceae9f9ef35d2c0e7ee8

Starting dynamic subtest: B-DP7
(kms_flip:3333) CRITICAL: Test assertion failure function __run_test_on_crtc_s...
(kms_flip:3333) CRITICAL: Failed assertion: !ret
(kms_flip:3333) CRITICAL: Last errno: 22, Invalid argument
Dynamic subtest B-DP7 failed.
**** DEBUG ****
(kms_flip:3333) igt_fb-DEBUG: igt_create_fb_with_bo_size(width=3840, height=21...
(kms_flip:3333) igt_fb-DEBUG: igt_create_fb_with_bo_size(handle=1, pitch=15360)
(kms_flip:3333) ioctl_wrappers-DEBUG: Test requirement passed: igt_has_fb_modi...
(kms_flip:3333) igt_fb-DEBUG: igt_create_fb_with_bo_size(width=3840, height=21...
(kms_flip:3333) igt_fb-DEBUG: igt_create_fb_with_bo_size(handle=2, pitch=15360)
(kms_flip:3333) ioctl_wrappers-DEBUG: Test requirement passed: igt_has_fb_modi...
(kms_flip:3333) intel_allocator_simple-DEBUG: Using simple allocator
(kms_flip:3333) intel_allocator_simple-DEBUG: <ial: 0x564040bb71a0, fd: 5> obj...
(kms_flip:3333) intel_allocator_simple-DEBUG: <ial: 0x564040bb71a0, fd: 5> obj...
(kms_flip:3333) intel_allocator_simple-DEBUG: Using simple allocator
(kms_flip:3333) intel_allocator_simple-DEBUG: <ial: 0x564040c335b0, fd: 5> obj...
...
igt@kms_flip@plain-flip-ts-check-interruptible@c-dp7
igt@kms_flip@plain-flip-ts-check-interruptible@c-dp7
xe-2198-9bcce25c88a853967702ceae9f9ef35d2c0e7ee8

Starting dynamic subtest: C-DP7
(kms_flip:3333) CRITICAL: Test assertion failure function __run_test_on_crtc_s...
(kms_flip:3333) CRITICAL: Failed assertion: !ret
(kms_flip:3333) CRITICAL: Last errno: 22, Invalid argument
Dynamic subtest C-DP7 failed.
**** DEBUG ****
(kms_flip:3333) igt_fb-DEBUG: igt_create_fb_with_bo_size(width=3840, height=21...
(kms_flip:3333) igt_fb-DEBUG: igt_create_fb_with_bo_size(handle=3, pitch=15360)
(kms_flip:3333) ioctl_wrappers-DEBUG: Test requirement passed: igt_has_fb_modi...
(kms_flip:3333) igt_fb-DEBUG: igt_create_fb_with_bo_size(width=3840, height=21...
(kms_flip:3333) igt_fb-DEBUG: igt_create_fb_with_bo_size(handle=4, pitch=15360)
(kms_flip:3333) ioctl_wrappers-DEBUG: Test requirement passed: igt_has_fb_modi...
(kms_flip:3333) intel_allocator_simple-DEBUG: Using simple allocator
(kms_flip:3333) intel_allocator_simple-DEBUG: <ial: 0x564040bb71a0, fd: 5> obj...
(kms_flip:3333) intel_allocator_simple-DEBUG: <ial: 0x564040bb71a0, fd: 5> obj...
(kms_flip:3333) intel_allocator_simple-DEBUG: Using simple allocator
(kms_flip:3333) intel_allocator_simple-DEBUG: <ial: 0x564040c32e30, fd: 5> obj...
...
igt@kms_hdr@brightness-with-hdr@pipe-a-dp-1
igt@kms_hdr@brightness-with-hdr@pipe-a-dp-1
xe-2198-9bcce25c88a853967702ceae9f9ef35d2c0e7ee8

Starting subtest: brightness-with-hdr
Starting dynamic subtest: pipe-A-DP-1
(kms_hdr:3971) CRITICAL: Test assertion failure function adjust_brightness, fi...
(kms_hdr:3971) CRITICAL: Failed assertion: igt_backlight_read(&context.max, "m...
(kms_hdr:3971) CRITICAL: Last errno: 2, No such file or directory
Dynamic subtest pipe-A-DP-1 failed.
**** DEBUG ****
(kms_hdr:3971) igt_fb-DEBUG: igt_create_fb_with_bo_size(width=512, height=512,...
(kms_hdr:3971) igt_fb-DEBUG: igt_create_fb_with_bo_size(handle=1, pitch=2048)
(kms_hdr:3971) ioctl_wrappers-DEBUG: Test requirement passed: igt_has_fb_modif...
(kms_hdr:3971) intel_allocator_simple-DEBUG: Using simple allocator
(kms_hdr:3971) intel_allocator_simple-DEBUG: <ial: 0x55da85ac3450, fd: 5> obje...
(kms_hdr:3971) intel_allocator_simple-DEBUG: <ial: 0x55da85ac3450, fd: 5> obje...
(kms_hdr:3971) intel_allocator_simple-DEBUG: Using simple allocator
(kms_hdr:3971) intel_allocator_simple-DEBUG: <ial: 0x55da85acf890, fd: 5> obje...
(kms_hdr:3971) intel_allocator_simple-DEBUG: <ial: 0x55da85acf890, fd: 5> obje...
(kms_hdr:3971) igt_kms-DEBUG: display: A.0: plane_set_fb(217)
...
igt@kms_pipe_crc_basic@compare-crc-sanitycheck-nv12@pipe-c-dp-1
igt@kms_pipe_crc_basic@compare-crc-sanitycheck-nv12@pipe-c-dp-1
xe-2198-9bcce25c88a853967702ceae9f9ef35d2c0e7ee8

Starting dynamic subtest: pipe-C-DP-1
(kms_pipe_crc_basic:4408) igt_kms-CRITICAL: Test assertion failure function ig...
(kms_pipe_crc_basic:4408) igt_kms-CRITICAL: Failed assertion: ret == 0
(kms_pipe_crc_basic:4408) igt_kms-CRITICAL: Last errno: 2, No such file or dir...
(kms_pipe_crc_basic:4408) igt_kms-CRITICAL: error: -2 != 0
Dynamic subtest pipe-C-DP-1 failed.
**** DEBUG ****
(kms_pipe_crc_basic:4408) igt_kms-DEBUG: display:     SetProp plane B.1 "COLOR...
(kms_pipe_crc_basic:4408) igt_kms-DEBUG: display:     SetProp plane B.1 "COLOR...
(kms_pipe_crc_basic:4408) igt_kms-DEBUG: display:     SetProp plane B.1 "pixel...
(kms_pipe_crc_basic:4408) igt_kms-DEBUG: display:     SetProp plane B.1 "alpha...
(kms_pipe_crc_basic:4408) igt_kms-DEBUG: display:     SetProp plane B.1 "FB_DA...
(kms_pipe_crc_basic:4408) igt_kms-DEBUG: display:     SetProp plane B.1 "SCALI...
(kms_pipe_crc_basic:4408) igt_kms-DEBUG: Test requirement passed: plane_idx >=...
(kms_pipe_crc_basic:4408) igt_kms-DEBUG: display:     Fixing up initial rotati...
(kms_pipe_crc_basic:4408) igt_kms-DEBUG: display:     SetPlane pipe B, plane 2...
(kms_pipe_crc_basic:4408) igt_kms-DEBUG: display:     SetProp plane B.2 "rotat...
...
igt@kms_pipe_crc_basic@read-crc@pipe-b-dp-6
igt@kms_pipe_crc_basic@read-crc@pipe-b-dp-6
xe-2198-9bcce25c88a853967702ceae9f9ef35d2c0e7ee8

Starting dynamic subtest: pipe-B-DP-6
(kms_pipe_crc_basic:4608) igt_kms-CRITICAL: Test assertion failure function ig...
(kms_pipe_crc_basic:4608) igt_kms-CRITICAL: Failed assertion: ret == 0
(kms_pipe_crc_basic:4608) igt_kms-CRITICAL: Last errno: 2, No such file or dir...
(kms_pipe_crc_basic:4608) igt_kms-CRITICAL: error: -2 != 0
Dynamic subtest pipe-B-DP-6 failed.
**** DEBUG ****
(kms_pipe_crc_basic:4608) igt_kms-DEBUG: display:     SetProp plane B.1 "COLOR...
(kms_pipe_crc_basic:4608) igt_kms-DEBUG: display:     SetProp plane B.1 "COLOR...
(kms_pipe_crc_basic:4608) igt_kms-DEBUG: display:     SetProp plane B.1 "pixel...
(kms_pipe_crc_basic:4608) igt_kms-DEBUG: display:     SetProp plane B.1 "alpha...
(kms_pipe_crc_basic:4608) igt_kms-DEBUG: display:     SetProp plane B.1 "FB_DA...
(kms_pipe_crc_basic:4608) igt_kms-DEBUG: display:     SetProp plane B.1 "SCALI...
(kms_pipe_crc_basic:4608) igt_kms-DEBUG: Test requirement passed: plane_idx >=...
(kms_pipe_crc_basic:4608) igt_kms-DEBUG: display:     Fixing up initial rotati...
(kms_pipe_crc_basic:4608) igt_kms-DEBUG: display:     SetPlane pipe B, plane 2...
(kms_pipe_crc_basic:4608) igt_kms-DEBUG: display:     SetProp plane B.2 "rotat...
...
igt@kms_pipe_crc_basic@read-crc@pipe-c-dp-1
igt@kms_pipe_crc_basic@read-crc@pipe-c-dp-1
xe-2198-9bcce25c88a853967702ceae9f9ef35d2c0e7ee8

Starting dynamic subtest: pipe-C-DP-1
(kms_pipe_crc_basic:4608) igt_kms-CRITICAL: Test assertion failure function ig...
(kms_pipe_crc_basic:4608) igt_kms-CRITICAL: Failed assertion: ret == 0
(kms_pipe_crc_basic:4608) igt_kms-CRITICAL: Last errno: 2, No such file or dir...
(kms_pipe_crc_basic:4608) igt_kms-CRITICAL: error: -2 != 0
Dynamic subtest pipe-C-DP-1 failed.
**** DEBUG ****
SetProp plane B.3 "COLOR_ENCODING" to 0x0/0
(kms_pipe_crc_basic:4608) igt_kms-DEBUG: display:         SetProp plane B.3 "C...
(kms_pipe_crc_basic:4608) igt_kms-DEBUG: display:         SetProp plane B.3 "p...
(kms_pipe_crc_basic:4608) igt_kms-DEBUG: display:         SetProp plane B.3 "a...
(kms_pipe_crc_basic:4608) igt_kms-DEBUG: display:         SetProp plane B.3 "F...
(kms_pipe_crc_basic:4608) igt_kms-DEBUG: display:         SetProp plane B.3 "S...
(kms_pipe_crc_basic:4608) igt_kms-DEBUG: Test requirement passed: plane_idx >=...
(kms_pipe_crc_basic:4608) igt_kms-DEBUG: display:         Fixing up initial ro...
(kms_pipe_crc_basic:4608) igt_kms-DEBUG: display:         SetPlane pipe B, pla...
(kms_pipe_crc_basic:4608) igt_kms-DEBUG: display:         SetProp plane B.4 "r...
...
igt@kms_plane_cursor@overlay@pipe-b-dp-6-size-64
igt@kms_plane_cursor@overlay@pipe-b-dp-6-size-64
xe-2198-9bcce25c88a853967702ceae9f9ef35d2c0e7ee8

Starting dynamic subtest: pipe-B-DP-6-size-64
(kms_plane_cursor:5150) igt_pipe_crc-CRITICAL: Test assertion failure function...
(kms_plane_cursor:5150) igt_pipe_crc-CRITICAL: Failed assertion: !mismatch || ...
Dynamic subtest pipe-B-DP-6-size-64 failed.
**** DEBUG ****
(kms_plane_cursor:5150) igt_kms-DEBUG: plane C.1: Setting property "SRC_Y" to ...
(kms_plane_cursor:5150) igt_kms-DEBUG: plane C.1: Setting property "SRC_W" to ...
(kms_plane_cursor:5150) igt_kms-DEBUG: plane C.1: Setting property "SRC_H" to ...
(kms_plane_cursor:5150) igt_kms-DEBUG: plane C.1: Setting property "CRTC_X" to...
(kms_plane_cursor:5150) igt_kms-DEBUG: plane C.1: Setting property "CRTC_Y" to...
(kms_plane_cursor:5150) igt_kms-DEBUG: plane C.1: Setting property "CRTC_W" to...
(kms_plane_cursor:5150) igt_kms-DEBUG: plane C.1: Setting property "CRTC_H" to...
(kms_plane_cursor:5150) igt_kms-DEBUG: plane C.1: Setting property "FB_ID" to ...
(kms_plane_cursor:5150) igt_kms-DEBUG: plane C.1: Setting property "CRTC_ID" t...
(kms_plane_cursor:5150) igt_kms-DEBUG: plane C.1: Setting property "rotation" ...
(kms_plane_cursor:5150) igt_kms-DEBUG: plane C.1: Setting property "COLOR_ENCO...
(kms_plane_cursor:5150) igt_kms-DEBUG: plane C.1: Setting property "COLOR_RANG...
...
igt@kms_plane_cursor@overlay@pipe-b-dp-6-size-128
igt@kms_plane_cursor@overlay@pipe-b-dp-6-size-128
xe-2198-9bcce25c88a853967702ceae9f9ef35d2c0e7ee8

Starting dynamic subtest: pipe-B-DP-6-size-128
(kms_plane_cursor:5150) igt_pipe_crc-CRITICAL: Test assertion failure function...
(kms_plane_cursor:5150) igt_pipe_crc-CRITICAL: Failed assertion: !mismatch || ...
Dynamic subtest pipe-B-DP-6-size-128 failed.
**** DEBUG ****
(kms_plane_cursor:5150) DEBUG: Test requirement passed: !(size > data->max_cur...
(kms_plane_cursor:5150) igt_fb-DEBUG: igt_create_fb_with_bo_size(width=3840, h...
(kms_plane_cursor:5150) igt_fb-DEBUG: igt_create_fb_with_bo_size(handle=1, pit...
(kms_plane_cursor:5150) ioctl_wrappers-DEBUG: Test requirement passed: igt_has...
(kms_plane_cursor:5150) intel_allocator_simple-DEBUG: Using simple allocator
(kms_plane_cursor:5150) intel_allocator_simple-DEBUG: <ial: 0x5641ffb499f0, fd...
(kms_plane_cursor:5150) intel_allocator_simple-DEBUG: <ial: 0x5641ffb499f0, fd...
(kms_plane_cursor:5150) intel_allocator_simple-DEBUG: Using simple allocator
(kms_plane_cursor:5150) intel_allocator_simple-DEBUG: <ial: 0x5641ffb556c0, fd...
(kms_plane_cursor:5150) intel_allocator_simple-DEBUG: <ial: 0x5641ffb556c0, fd...
(kms_plane_cursor:5150) igt_fb-DEBUG: igt_create_fb_with_bo_size(width=1920, h...
(kms_plane_cursor:5150) igt_fb-DEBUG: igt_create_fb_with_bo_size(handle=2, pit...
...
igt@kms_plane_cursor@overlay@pipe-b-dp-6-size-256
igt@kms_plane_cursor@overlay@pipe-b-dp-6-size-256
xe-2198-9bcce25c88a853967702ceae9f9ef35d2c0e7ee8

Starting dynamic subtest: pipe-B-DP-6-size-256
(kms_plane_cursor:5150) igt_pipe_crc-CRITICAL: Test assertion failure function...
(kms_plane_cursor:5150) igt_pipe_crc-CRITICAL: Failed assertion: !mismatch || ...
Dynamic subtest pipe-B-DP-6-size-256 failed.
**** DEBUG ****
(kms_plane_cursor:5150) DEBUG: Test requirement passed: !(size > data->max_cur...
(kms_plane_cursor:5150) igt_fb-DEBUG: igt_create_fb_with_bo_size(width=3840, h...
(kms_plane_cursor:5150) igt_fb-DEBUG: igt_create_fb_with_bo_size(handle=1, pit...
(kms_plane_cursor:5150) ioctl_wrappers-DEBUG: Test requirement passed: igt_has...
(kms_plane_cursor:5150) intel_allocator_simple-DEBUG: Using simple allocator
(kms_plane_cursor:5150) intel_allocator_simple-DEBUG: <ial: 0x5641ffb4b9d0, fd...
(kms_plane_cursor:5150) intel_allocator_simple-DEBUG: <ial: 0x5641ffb4b9d0, fd...
(kms_plane_cursor:5150) intel_allocator_simple-DEBUG: Using simple allocator
(kms_plane_cursor:5150) intel_allocator_simple-DEBUG: <ial: 0x5641ffb59ac0, fd...
(kms_plane_cursor:5150) intel_allocator_simple-DEBUG: <ial: 0x5641ffb59ac0, fd...
(kms_plane_cursor:5150) igt_fb-DEBUG: igt_create_fb_with_bo_size(width=1920, h...
(kms_plane_cursor:5150) igt_fb-DEBUG: igt_create_fb_with_bo_size(handle=2, pit...
...
igt@kms_plane_cursor@overlay@pipe-c-dp-1-size-64
igt@kms_plane_cursor@overlay@pipe-c-dp-1-size-64
xe-2198-9bcce25c88a853967702ceae9f9ef35d2c0e7ee8

Starting dynamic subtest: pipe-C-DP-1-size-64
(kms_plane_cursor:5150) igt_pipe_crc-CRITICAL: Test assertion failure function...
(kms_plane_cursor:5150) igt_pipe_crc-CRITICAL: Failed assertion: !mismatch || ...
Dynamic subtest pipe-C-DP-1-size-64 failed.
**** DEBUG ****
(kms_plane_cursor:5150) igt_kms-DEBUG: plane C.1: Setting property "SRC_Y" to ...
(kms_plane_cursor:5150) igt_kms-DEBUG: plane C.1: Setting property "SRC_W" to ...
(kms_plane_cursor:5150) igt_kms-DEBUG: plane C.1: Setting property "SRC_H" to ...
(kms_plane_cursor:5150) igt_kms-DEBUG: plane C.1: Setting property "CRTC_X" to...
(kms_plane_cursor:5150) igt_kms-DEBUG: plane C.1: Setting property "CRTC_Y" to...
(kms_plane_cursor:5150) igt_kms-DEBUG: plane C.1: Setting property "CRTC_W" to...
(kms_plane_cursor:5150) igt_kms-DEBUG: plane C.1: Setting property "CRTC_H" to...
(kms_plane_cursor:5150) igt_kms-DEBUG: plane C.1: Setting property "FB_ID" to ...
(kms_plane_cursor:5150) igt_kms-DEBUG: plane C.1: Setting property "CRTC_ID" t...
(kms_plane_cursor:5150) igt_kms-DEBUG: plane C.1: Setting property "rotation" ...
(kms_plane_cursor:5150) igt_kms-DEBUG: plane C.1: Setting property "COLOR_ENCO...
(kms_plane_cursor:5150) igt_kms-DEBUG: plane C.1: Setting property "COLOR_RANG...
...
igt@kms_plane_cursor@overlay@pipe-c-dp-1-size-128
igt@kms_plane_cursor@overlay@pipe-c-dp-1-size-128
xe-2198-9bcce25c88a853967702ceae9f9ef35d2c0e7ee8

Starting dynamic subtest: pipe-C-DP-1-size-128
(kms_plane_cursor:5150) igt_pipe_crc-CRITICAL: Test assertion failure function...
(kms_plane_cursor:5150) igt_pipe_crc-CRITICAL: Failed assertion: !mismatch || ...
Dynamic subtest pipe-C-DP-1-size-128 failed.
**** DEBUG ****
(kms_plane_cursor:5150) DEBUG: Test requirement passed: !(size > data->max_cur...
(kms_plane_cursor:5150) igt_fb-DEBUG: igt_create_fb_with_bo_size(width=3840, h...
(kms_plane_cursor:5150) igt_fb-DEBUG: igt_create_fb_with_bo_size(handle=1, pit...
(kms_plane_cursor:5150) ioctl_wrappers-DEBUG: Test requirement passed: igt_has...
(kms_plane_cursor:5150) intel_allocator_simple-DEBUG: Using simple allocator
(kms_plane_cursor:5150) intel_allocator_simple-DEBUG: <ial: 0x5641ffb7c5d0, fd...
(kms_plane_cursor:5150) intel_allocator_simple-DEBUG: <ial: 0x5641ffb7c5d0, fd...
(kms_plane_cursor:5150) intel_allocator_simple-DEBUG: Using simple allocator
(kms_plane_cursor:5150) intel_allocator_simple-DEBUG: <ial: 0x5641ffb72340, fd...
(kms_plane_cursor:5150) intel_allocator_simple-DEBUG: <ial: 0x5641ffb72340, fd...
(kms_plane_cursor:5150) igt_fb-DEBUG: igt_create_fb_with_bo_size(width=1920, h...
(kms_plane_cursor:5150) igt_fb-DEBUG: igt_create_fb_with_bo_size(handle=2, pit...
...
igt@kms_plane_cursor@overlay@pipe-c-dp-1-size-256
igt@kms_plane_cursor@overlay@pipe-c-dp-1-size-256
xe-2198-9bcce25c88a853967702ceae9f9ef35d2c0e7ee8

Starting dynamic subtest: pipe-C-DP-1-size-256
(kms_plane_cursor:5150) igt_pipe_crc-CRITICAL: Test assertion failure function...
(kms_plane_cursor:5150) igt_pipe_crc-CRITICAL: Failed assertion: !mismatch || ...
Dynamic subtest pipe-C-DP-1-size-256 failed.
**** DEBUG ****
(kms_plane_cursor:5150) DEBUG: Test requirement passed: !(size > data->max_cur...
(kms_plane_cursor:5150) igt_fb-DEBUG: igt_create_fb_with_bo_size(width=3840, h...
(kms_plane_cursor:5150) igt_fb-DEBUG: igt_create_fb_with_bo_size(handle=1, pit...
(kms_plane_cursor:5150) ioctl_wrappers-DEBUG: Test requirement passed: igt_has...
(kms_plane_cursor:5150) intel_allocator_simple-DEBUG: Using simple allocator
(kms_plane_cursor:5150) intel_allocator_simple-DEBUG: <ial: 0x5641ffb7c5d0, fd...
(kms_plane_cursor:5150) intel_allocator_simple-DEBUG: <ial: 0x5641ffb7c5d0, fd...
(kms_plane_cursor:5150) intel_allocator_simple-DEBUG: Using simple allocator
(kms_plane_cursor:5150) intel_allocator_simple-DEBUG: <ial: 0x5641ffb7c5d0, fd...
(kms_plane_cursor:5150) intel_allocator_simple-DEBUG: <ial: 0x5641ffb7c5d0, fd...
(kms_plane_cursor:5150) igt_fb-DEBUG: igt_create_fb_with_bo_size(width=1920, h...
(kms_plane_cursor:5150) igt_fb-DEBUG: igt_create_fb_with_bo_size(handle=2, pit...
...
igt@kms_plane_cursor@primary@pipe-b-dp-6-size-64
igt@kms_plane_cursor@primary@pipe-b-dp-6-size-64
xe-2198-9bcce25c88a853967702ceae9f9ef35d2c0e7ee8

Starting dynamic subtest: pipe-B-DP-6-size-64
(kms_plane_cursor:5335) igt_pipe_crc-CRITICAL: Test assertion failure function...
(kms_plane_cursor:5335) igt_pipe_crc-CRITICAL: Failed assertion: !mismatch || ...
Dynamic subtest pipe-B-DP-6-size-64 failed.
**** DEBUG ****
(kms_plane_cursor:5335) igt_kms-DEBUG: plane B.4: Setting property "COLOR_RANG...
(kms_plane_cursor:5335) igt_kms-DEBUG: plane B.4: Setting property "pixel blen...
(kms_plane_cursor:5335) igt_kms-DEBUG: plane B.4: Setting property "alpha" to ...
(kms_plane_cursor:5335) igt_kms-DEBUG: plane B.4: Setting property "FB_DAMAGE_...
(kms_plane_cursor:5335) igt_kms-DEBUG: plane B.4: Setting property "SCALING_FI...
(kms_plane_cursor:5335) igt_kms-DEBUG: display:     populating plane data: B.5...
(kms_plane_cursor:5335) igt_kms-DEBUG: plane B.5: Setting property "SRC_X" to ...
(kms_plane_cursor:5335) igt_kms-DEBUG: plane B.5: Setting property "SRC_Y" to ...
(kms_plane_cursor:5335) igt_kms-DEBUG: plane B.5: Setting property "SRC_W" to ...
(kms_plane_cursor:5335) igt_kms-DEBUG: plane B.5: Setting property "SRC_H" to ...
(kms_plane_cursor:5335) igt_kms-DEBUG: plane B.5: Setting property "CRTC_X" to...
(kms_plane_cursor:5335) igt_kms-DEBUG: plane B.5: Setting property "CRTC_Y" to...
...
igt@kms_plane_cursor@primary@pipe-b-dp-6-size-128
igt@kms_plane_cursor@primary@pipe-b-dp-6-size-128
xe-2198-9bcce25c88a853967702ceae9f9ef35d2c0e7ee8

Starting dynamic subtest: pipe-B-DP-6-size-128
(kms_plane_cursor:5335) igt_pipe_crc-CRITICAL: Test assertion failure function...
(kms_plane_cursor:5335) igt_pipe_crc-CRITICAL: Failed assertion: !mismatch || ...
Dynamic subtest pipe-B-DP-6-size-128 failed.
**** DEBUG ****
(kms_plane_cursor:5335) DEBUG: Test requirement passed: !(size > data->max_cur...
(kms_plane_cursor:5335) igt_fb-DEBUG: igt_create_fb_with_bo_size(width=3840, h...
(kms_plane_cursor:5335) igt_fb-DEBUG: igt_create_fb_with_bo_size(handle=1, pit...
(kms_plane_cursor:5335) ioctl_wrappers-DEBUG: Test requirement passed: igt_has...
(kms_plane_cursor:5335) intel_allocator_simple-DEBUG: Using simple allocator
(kms_plane_cursor:5335) intel_allocator_simple-DEBUG: <ial: 0x55c40ce83d80, fd...
(kms_plane_cursor:5335) intel_allocator_simple-DEBUG: <ial: 0x55c40ce83d80, fd...
(kms_plane_cursor:5335) intel_allocator_simple-DEBUG: Using simple allocator
(kms_plane_cursor:5335) intel_allocator_simple-DEBUG: <ial: 0x55c40ce83d80, fd...
(kms_plane_cursor:5335) intel_allocator_simple-DEBUG: <ial: 0x55c40ce83d80, fd...
(kms_plane_cursor:5335) igt_fb-DEBUG: igt_create_fb_with_bo_size(width=128, he...
(kms_plane_cursor:5335) igt_fb-DEBUG: igt_create_fb_with_bo_size(handle=2, pit...
...
igt@kms_plane_cursor@primary@pipe-b-dp-6-size-256
igt@kms_plane_cursor@primary@pipe-b-dp-6-size-256
xe-2198-9bcce25c88a853967702ceae9f9ef35d2c0e7ee8

Starting dynamic subtest: pipe-B-DP-6-size-256
(kms_plane_cursor:5335) igt_pipe_crc-CRITICAL: Test assertion failure function...
(kms_plane_cursor:5335) igt_pipe_crc-CRITICAL: Failed assertion: !mismatch || ...
Dynamic subtest pipe-B-DP-6-size-256 failed.
**** DEBUG ****
(kms_plane_cursor:5335) DEBUG: Test requirement passed: !(size > data->max_cur...
(kms_plane_cursor:5335) igt_fb-DEBUG: igt_create_fb_with_bo_size(width=3840, h...
(kms_plane_cursor:5335) igt_fb-DEBUG: igt_create_fb_with_bo_size(handle=1, pit...
(kms_plane_cursor:5335) ioctl_wrappers-DEBUG: Test requirement passed: igt_has...
(kms_plane_cursor:5335) intel_allocator_simple-DEBUG: Using simple allocator
(kms_plane_cursor:5335) intel_allocator_simple-DEBUG: <ial: 0x55c40ce7ddd0, fd...
(kms_plane_cursor:5335) intel_allocator_simple-DEBUG: <ial: 0x55c40ce7ddd0, fd...
(kms_plane_cursor:5335) intel_allocator_simple-DEBUG: Using simple allocator
(kms_plane_cursor:5335) intel_allocator_simple-DEBUG: <ial: 0x55c40ce7ddd0, fd...
(kms_plane_cursor:5335) intel_allocator_simple-DEBUG: <ial: 0x55c40ce7ddd0, fd...
(kms_plane_cursor:5335) igt_fb-DEBUG: igt_create_fb_with_bo_size(width=256, he...
(kms_plane_cursor:5335) igt_fb-DEBUG: igt_create_fb_with_bo_size(handle=2, pit...
...
igt@kms_plane_cursor@primary@pipe-c-dp-1-size-64
igt@kms_plane_cursor@primary@pipe-c-dp-1-size-64
xe-2198-9bcce25c88a853967702ceae9f9ef35d2c0e7ee8

Starting dynamic subtest: pipe-C-DP-1-size-64
(kms_plane_cursor:5335) igt_pipe_crc-CRITICAL: Test assertion failure function...
(kms_plane_cursor:5335) igt_pipe_crc-CRITICAL: Failed assertion: !mismatch || ...
Dynamic subtest pipe-C-DP-1-size-64 failed.
**** DEBUG ****
(kms_plane_cursor:5335) igt_kms-DEBUG: plane B.4: Setting property "COLOR_RANG...
(kms_plane_cursor:5335) igt_kms-DEBUG: plane B.4: Setting property "pixel blen...
(kms_plane_cursor:5335) igt_kms-DEBUG: plane B.4: Setting property "alpha" to ...
(kms_plane_cursor:5335) igt_kms-DEBUG: plane B.4: Setting property "FB_DAMAGE_...
(kms_plane_cursor:5335) igt_kms-DEBUG: plane B.4: Setting property "SCALING_FI...
(kms_plane_cursor:5335) igt_kms-DEBUG: display:     populating plane data: B.5...
(kms_plane_cursor:5335) igt_kms-DEBUG: plane B.5: Setting property "SRC_X" to ...
(kms_plane_cursor:5335) igt_kms-DEBUG: plane B.5: Setting property "SRC_Y" to ...
(kms_plane_cursor:5335) igt_kms-DEBUG: plane B.5: Setting property "SRC_W" to ...
(kms_plane_cursor:5335) igt_kms-DEBUG: plane B.5: Setting property "SRC_H" to ...
(kms_plane_cursor:5335) igt_kms-DEBUG: plane B.5: Setting property "CRTC_X" to...
(kms_plane_cursor:5335) igt_kms-DEBUG: plane B.5: Setting property "CRTC_Y" to...
...
igt@kms_plane_cursor@primary@pipe-c-dp-1-size-128
igt@kms_plane_cursor@primary@pipe-c-dp-1-size-128
xe-2198-9bcce25c88a853967702ceae9f9ef35d2c0e7ee8

Starting dynamic subtest: pipe-C-DP-1-size-128
(kms_plane_cursor:5335) igt_pipe_crc-CRITICAL: Test assertion failure function...
(kms_plane_cursor:5335) igt_pipe_crc-CRITICAL: Failed assertion: !mismatch || ...
Dynamic subtest pipe-C-DP-1-size-128 failed.
**** DEBUG ****
(kms_plane_cursor:5335) DEBUG: Test requirement passed: !(size > data->max_cur...
(kms_plane_cursor:5335) igt_fb-DEBUG: igt_create_fb_with_bo_size(width=3840, h...
(kms_plane_cursor:5335) igt_fb-DEBUG: igt_create_fb_with_bo_size(handle=1, pit...
(kms_plane_cursor:5335) ioctl_wrappers-DEBUG: Test requirement passed: igt_has...
(kms_plane_cursor:5335) intel_allocator_simple-DEBUG: Using simple allocator
(kms_plane_cursor:5335) intel_allocator_simple-DEBUG: <ial: 0x55c40ced4bb0, fd...
(kms_plane_cursor:5335) intel_allocator_simple-DEBUG: <ial: 0x55c40ced4bb0, fd...
(kms_plane_cursor:5335) intel_allocator_simple-DEBUG: Using simple allocator
(kms_plane_cursor:5335) intel_allocator_simple-DEBUG: <ial: 0x55c40ced4bb0, fd...
(kms_plane_cursor:5335) intel_allocator_simple-DEBUG: <ial: 0x55c40ced4bb0, fd...
(kms_plane_cursor:5335) igt_fb-DEBUG: igt_create_fb_with_bo_size(width=128, he...
(kms_plane_cursor:5335) igt_fb-DEBUG: igt_create_fb_with_bo_size(handle=2, pit...
...
igt@kms_plane_cursor@primary@pipe-c-dp-1-size-256
igt@kms_plane_cursor@primary@pipe-c-dp-1-size-256
xe-2198-9bcce25c88a853967702ceae9f9ef35d2c0e7ee8

Starting dynamic subtest: pipe-C-DP-1-size-256
(kms_plane_cursor:5335) igt_pipe_crc-CRITICAL: Test assertion failure function...
(kms_plane_cursor:5335) igt_pipe_crc-CRITICAL: Failed assertion: !mismatch || ...
Dynamic subtest pipe-C-DP-1-size-256 failed.
**** DEBUG ****
(kms_plane_cursor:5335) DEBUG: Test requirement passed: !(size > data->max_cur...
(kms_plane_cursor:5335) igt_fb-DEBUG: igt_create_fb_with_bo_size(width=3840, h...
(kms_plane_cursor:5335) igt_fb-DEBUG: igt_create_fb_with_bo_size(handle=1, pit...
(kms_plane_cursor:5335) ioctl_wrappers-DEBUG: Test requirement passed: igt_has...
(kms_plane_cursor:5335) intel_allocator_simple-DEBUG: Using simple allocator
(kms_plane_cursor:5335) intel_allocator_simple-DEBUG: <ial: 0x55c40ced4bb0, fd...
(kms_plane_cursor:5335) intel_allocator_simple-DEBUG: <ial: 0x55c40ced4bb0, fd...
(kms_plane_cursor:5335) intel_allocator_simple-DEBUG: Using simple allocator
(kms_plane_cursor:5335) intel_allocator_simple-DEBUG: <ial: 0x55c40ced4bb0, fd...
(kms_plane_cursor:5335) intel_allocator_simple-DEBUG: <ial: 0x55c40ced4bb0, fd...
(kms_plane_cursor:5335) igt_fb-DEBUG: igt_create_fb_with_bo_size(width=256, he...
(kms_plane_cursor:5335) igt_fb-DEBUG: igt_create_fb_with_bo_size(handle=2, pit...
...
igt@kms_plane_cursor@viewport@pipe-b-dp-6-size-64
igt@kms_plane_cursor@viewport@pipe-b-dp-6-size-64
xe-2198-9bcce25c88a853967702ceae9f9ef35d2c0e7ee8

Starting dynamic subtest: pipe-B-DP-6-size-64
(kms_plane_cursor:5485) igt_pipe_crc-CRITICAL: Test assertion failure function...
(kms_plane_cursor:5485) igt_pipe_crc-CRITICAL: Failed assertion: !mismatch || ...
Dynamic subtest pipe-B-DP-6-size-64 failed.
**** DEBUG ****
(kms_plane_cursor:5485) igt_kms-DEBUG: plane C.1: Setting property "SRC_Y" to ...
(kms_plane_cursor:5485) igt_kms-DEBUG: plane C.1: Setting property "SRC_W" to ...
(kms_plane_cursor:5485) igt_kms-DEBUG: plane C.1: Setting property "SRC_H" to ...
(kms_plane_cursor:5485) igt_kms-DEBUG: plane C.1: Setting property "CRTC_X" to...
(kms_plane_cursor:5485) igt_kms-DEBUG: plane C.1: Setting property "CRTC_Y" to...
(kms_plane_cursor:5485) igt_kms-DEBUG: plane C.1: Setting property "CRTC_W" to...
(kms_plane_cursor:5485) igt_kms-DEBUG: plane C.1: Setting property "CRTC_H" to...
(kms_plane_cursor:5485) igt_kms-DEBUG: plane C.1: Setting property "FB_ID" to ...
(kms_plane_cursor:5485) igt_kms-DEBUG: plane C.1: Setting property "CRTC_ID" t...
(kms_plane_cursor:5485) igt_kms-DEBUG: plane C.1: Setting property "rotation" ...
(kms_plane_cursor:5485) igt_kms-DEBUG: plane C.1: Setting property "COLOR_ENCO...
(kms_plane_cursor:5485) igt_kms-DEBUG: plane C.1: Setting property "COLOR_RANG...
...
igt@kms_plane_cursor@viewport@pipe-b-dp-6-size-128
igt@kms_plane_cursor@viewport@pipe-b-dp-6-size-128
xe-2198-9bcce25c88a853967702ceae9f9ef35d2c0e7ee8

Starting dynamic subtest: pipe-B-DP-6-size-128
(kms_plane_cursor:5485) igt_pipe_crc-CRITICAL: Test assertion failure function...
(kms_plane_cursor:5485) igt_pipe_crc-CRITICAL: Failed assertion: !mismatch || ...
Dynamic subtest pipe-B-DP-6-size-128 failed.
**** DEBUG ****
(kms_plane_cursor:5485) DEBUG: Test requirement passed: !(size > data->max_cur...
(kms_plane_cursor:5485) igt_fb-DEBUG: igt_create_fb_with_bo_size(width=3840, h...
(kms_plane_cursor:5485) igt_fb-DEBUG: igt_create_fb_with_bo_size(handle=1, pit...
(kms_plane_cursor:5485) ioctl_wrappers-DEBUG: Test requirement passed: igt_has...
(kms_plane_cursor:5485) intel_allocator_simple-DEBUG: Using simple allocator
(kms_plane_cursor:5485) intel_allocator_simple-DEBUG: <ial: 0x5588ec91f330, fd...
(kms_plane_cursor:5485) intel_allocator_simple-DEBUG: <ial: 0x5588ec91f330, fd...
(kms_plane_cursor:5485) intel_allocator_simple-DEBUG: Using simple allocator
(kms_plane_cursor:5485) intel_allocator_simple-DEBUG: <ial: 0x5588ec92b6b0, fd...
(kms_plane_cursor:5485) intel_allocator_simple-DEBUG: <ial: 0x5588ec92b6b0, fd...
(kms_plane_cursor:5485) igt_fb-DEBUG: igt_create_fb_with_bo_size(width=2048, h...
(kms_plane_cursor:5485) igt_fb-DEBUG: igt_create_fb_with_bo_size(handle=2, pit...
...
igt@kms_plane_cursor@viewport@pipe-b-dp-6-size-256
igt@kms_plane_cursor@viewport@pipe-b-dp-6-size-256
xe-2198-9bcce25c88a853967702ceae9f9ef35d2c0e7ee8

Starting dynamic subtest: pipe-B-DP-6-size-256
(kms_plane_cursor:5485) igt_pipe_crc-CRITICAL: Test assertion failure function...
(kms_plane_cursor:5485) igt_pipe_crc-CRITICAL: Failed assertion: !mismatch || ...
Dynamic subtest pipe-B-DP-6-size-256 failed.
**** DEBUG ****
(kms_plane_cursor:5485) DEBUG: Test requirement passed: !(size > data->max_cur...
(kms_plane_cursor:5485) igt_fb-DEBUG: igt_create_fb_with_bo_size(width=3840, h...
(kms_plane_cursor:5485) igt_fb-DEBUG: igt_create_fb_with_bo_size(handle=1, pit...
(kms_plane_cursor:5485) ioctl_wrappers-DEBUG: Test requirement passed: igt_has...
(kms_plane_cursor:5485) intel_allocator_simple-DEBUG: Using simple allocator
(kms_plane_cursor:5485) intel_allocator_simple-DEBUG: <ial: 0x5588ec951a20, fd...
(kms_plane_cursor:5485) intel_allocator_simple-DEBUG: <ial: 0x5588ec951a20, fd...
(kms_plane_cursor:5485) intel_allocator_simple-DEBUG: Using simple allocator
(kms_plane_cursor:5485) intel_allocator_simple-DEBUG: <ial: 0x5588ec951a20, fd...
(kms_plane_cursor:5485) intel_allocator_simple-DEBUG: <ial: 0x5588ec951a20, fd...
(kms_plane_cursor:5485) igt_fb-DEBUG: igt_create_fb_with_bo_size(width=2048, h...
(kms_plane_cursor:5485) igt_fb-DEBUG: igt_create_fb_with_bo_size(handle=2, pit...
...
igt@kms_plane_cursor@viewport@pipe-c-dp-1-size-64
igt@kms_plane_cursor@viewport@pipe-c-dp-1-size-64
xe-2198-9bcce25c88a853967702ceae9f9ef35d2c0e7ee8

Starting dynamic subtest: pipe-C-DP-1-size-64
(kms_plane_cursor:5485) igt_pipe_crc-CRITICAL: Test assertion failure function...
(kms_plane_cursor:5485) igt_pipe_crc-CRITICAL: Failed assertion: !mismatch || ...
Dynamic subtest pipe-C-DP-1-size-64 failed.
**** DEBUG ****
(kms_plane_cursor:5485) igt_kms-DEBUG: plane C.1: Setting property "SRC_Y" to ...
(kms_plane_cursor:5485) igt_kms-DEBUG: plane C.1: Setting property "SRC_W" to ...
(kms_plane_cursor:5485) igt_kms-DEBUG: plane C.1: Setting property "SRC_H" to ...
(kms_plane_cursor:5485) igt_kms-DEBUG: plane C.1: Setting property "CRTC_X" to...
(kms_plane_cursor:5485) igt_kms-DEBUG: plane C.1: Setting property "CRTC_Y" to...
(kms_plane_cursor:5485) igt_kms-DEBUG: plane C.1: Setting property "CRTC_W" to...
(kms_plane_cursor:5485) igt_kms-DEBUG: plane C.1: Setting property "CRTC_H" to...
(kms_plane_cursor:5485) igt_kms-DEBUG: plane C.1: Setting property "FB_ID" to ...
(kms_plane_cursor:5485) igt_kms-DEBUG: plane C.1: Setting property "CRTC_ID" t...
(kms_plane_cursor:5485) igt_kms-DEBUG: plane C.1: Setting property "rotation" ...
(kms_plane_cursor:5485) igt_kms-DEBUG: plane C.1: Setting property "COLOR_ENCO...
(kms_plane_cursor:5485) igt_kms-DEBUG: plane C.1: Setting property "COLOR_RANG...
...
igt@kms_plane_cursor@viewport@pipe-c-dp-1-size-128
igt@kms_plane_cursor@viewport@pipe-c-dp-1-size-128
xe-2198-9bcce25c88a853967702ceae9f9ef35d2c0e7ee8

Starting dynamic subtest: pipe-C-DP-1-size-128
(kms_plane_cursor:5485) igt_pipe_crc-CRITICAL: Test assertion failure function...
(kms_plane_cursor:5485) igt_pipe_crc-CRITICAL: Failed assertion: !mismatch || ...
Dynamic subtest pipe-C-DP-1-size-128 failed.
**** DEBUG ****
(kms_plane_cursor:5485) DEBUG: Test requirement passed: !(size > data->max_cur...
(kms_plane_cursor:5485) igt_fb-DEBUG: igt_create_fb_with_bo_size(width=3840, h...
(kms_plane_cursor:5485) igt_fb-DEBUG: igt_create_fb_with_bo_size(handle=1, pit...
(kms_plane_cursor:5485) ioctl_wrappers-DEBUG: Test requirement passed: igt_has...
(kms_plane_cursor:5485) intel_allocator_simple-DEBUG: Using simple allocator
(kms_plane_cursor:5485) intel_allocator_simple-DEBUG: <ial: 0x5588ec93c400, fd...
(kms_plane_cursor:5485) intel_allocator_simple-DEBUG: <ial: 0x5588ec93c400, fd...
(kms_plane_cursor:5485) intel_allocator_simple-DEBUG: Using simple allocator
(kms_plane_cursor:5485) intel_allocator_simple-DEBUG: <ial: 0x5588ec91f300, fd...
(kms_plane_cursor:5485) intel_allocator_simple-DEBUG: <ial: 0x5588ec91f300, fd...
(kms_plane_cursor:5485) igt_fb-DEBUG: igt_create_fb_with_bo_size(width=2048, h...
(kms_plane_cursor:5485) igt_fb-DEBUG: igt_create_fb_with_bo_size(handle=2, pit...
...
igt@kms_plane_cursor@viewport@pipe-c-dp-1-size-256
igt@kms_plane_cursor@viewport@pipe-c-dp-1-size-256
xe-2198-9bcce25c88a853967702ceae9f9ef35d2c0e7ee8

Starting dynamic subtest: pipe-C-DP-1-size-256
(kms_plane_cursor:5485) igt_pipe_crc-CRITICAL: Test assertion failure function...
(kms_plane_cursor:5485) igt_pipe_crc-CRITICAL: Failed assertion: !mismatch || ...
Dynamic subtest pipe-C-DP-1-size-256 failed.
**** DEBUG ****
(kms_plane_cursor:5485) DEBUG: Test requirement passed: !(size > data->max_cur...
(kms_plane_cursor:5485) igt_fb-DEBUG: igt_create_fb_with_bo_size(width=3840, h...
(kms_plane_cursor:5485) igt_fb-DEBUG: igt_create_fb_with_bo_size(handle=1, pit...
(kms_plane_cursor:5485) ioctl_wrappers-DEBUG: Test requirement passed: igt_has...
(kms_plane_cursor:5485) intel_allocator_simple-DEBUG: Using simple allocator
(kms_plane_cursor:5485) intel_allocator_simple-DEBUG: <ial: 0x5588ec94c8d0, fd...
(kms_plane_cursor:5485) intel_allocator_simple-DEBUG: <ial: 0x5588ec94c8d0, fd...
(kms_plane_cursor:5485) intel_allocator_simple-DEBUG: Using simple allocator
(kms_plane_cursor:5485) intel_allocator_simple-DEBUG: <ial: 0x5588ec94c8d0, fd...
(kms_plane_cursor:5485) intel_allocator_simple-DEBUG: <ial: 0x5588ec94c8d0, fd...
(kms_plane_cursor:5485) igt_fb-DEBUG: igt_create_fb_with_bo_size(width=2048, h...
(kms_plane_cursor:5485) igt_fb-DEBUG: igt_create_fb_with_bo_size(handle=2, pit...
...
igt@kms_properties@connector-properties-atomic@pipe-a-dp-7
igt@kms_properties@connector-properties-atomic@pipe-a-dp-7
xe-2198-9bcce25c88a853967702ceae9f9ef35d2c0e7ee8

Starting dynamic subtest: pipe-A-DP-7
(kms_properties:1925) CRITICAL: Test assertion failure function max_bpc_prop_t...
(kms_properties:1925) CRITICAL: Failed assertion: ret == 0
(kms_properties:1925) CRITICAL: Last errno: 22, Invalid argument
(kms_properties:1925) CRITICAL: error: -22 != 0
Dynamic subtest pipe-A-DP-7 failed.
**** DEBUG ****
(kms_properties:1925) igt_kms-DEBUG: plane B.2: Setting property "CRTC_Y" to 0...
(kms_properties:1925) igt_kms-DEBUG: plane B.2: Setting property "CRTC_W" to 0...
(kms_properties:1925) igt_kms-DEBUG: plane B.2: Setting property "CRTC_H" to 0...
(kms_properties:1925) igt_kms-DEBUG: plane B.2: Setting property "FB_ID" to 0x...
(kms_properties:1925) igt_kms-DEBUG: plane B.2: Setting property "CRTC_ID" to ...
(kms_properties:1925) igt_kms-DEBUG: plane B.2: Setting property "rotation" to...
(kms_properties:1925) igt_kms-DEBUG: plane B.2: Setting property "COLOR_ENCODI...
(kms_properties:1925) igt_kms-DEBUG: plane B.2: Setting property "COLOR_RANGE"...
(kms_properties:1925) igt_kms-DEBUG: plane B.2: Setting property "pixel blend ...
(kms_properties:1925) igt_kms-DEBUG: plane B.2: Setting property "alpha" to 0x...
...
igt@kms_properties@connector-properties-legacy@pipe-a-dp-7
igt@kms_properties@connector-properties-legacy@pipe-a-dp-7
xe-2198-9bcce25c88a853967702ceae9f9ef35d2c0e7ee8

Starting dynamic subtest: pipe-A-DP-7
(kms_properties:1936) CRITICAL: Test assertion failure function max_bpc_prop_t...
(kms_properties:1936) CRITICAL: Failed assertion: ret == 0
(kms_properties:1936) CRITICAL: Last errno: 22, Invalid argument
(kms_properties:1936) CRITICAL: error: -22 != 0
Dynamic subtest pipe-A-DP-7 failed.
**** DEBUG ****
(kms_properties:1936) igt_kms-DEBUG: plane B.2: Setting property "CRTC_Y" to 0...
(kms_properties:1936) igt_kms-DEBUG: plane B.2: Setting property "CRTC_W" to 0...
(kms_properties:1936) igt_kms-DEBUG: plane B.2: Setting property "CRTC_H" to 0...
(kms_properties:1936) igt_kms-DEBUG: plane B.2: Setting property "FB_ID" to 0x...
(kms_properties:1936) igt_kms-DEBUG: plane B.2: Setting property "CRTC_ID" to ...
(kms_properties:1936) igt_kms-DEBUG: plane B.2: Setting property "rotation" to...
(kms_properties:1936) igt_kms-DEBUG: plane B.2: Setting property "COLOR_ENCODI...
(kms_properties:1936) igt_kms-DEBUG: plane B.2: Setting property "COLOR_RANGE"...
(kms_properties:1936) igt_kms-DEBUG: plane B.2: Setting property "pixel blend ...
(kms_properties:1936) igt_kms-DEBUG: plane B.2: Setting property "alpha" to 0x...
...
igt@kms_universal_plane@cursor-fb-leak@pipe-c-dp-1
igt@kms_universal_plane@cursor-fb-leak@pipe-c-dp-1
xe-2198-9bcce25c88a853967702ceae9f9ef35d2c0e7ee8

Starting dynamic subtest: pipe-C-DP-1
(kms_universal_plane:9334) CRITICAL: Test assertion failure function cursor_le...
(kms_universal_plane:9334) CRITICAL: Failed assertion: count1 == count2
(kms_universal_plane:9334) CRITICAL: Last errno: 9, Bad file descriptor
(kms_universal_plane:9334) CRITICAL: error: 1 != 2
Dynamic subtest pipe-C-DP-1 failed.
**** DEBUG ****
(kms_universal_plane:9334) igt_kms-DEBUG: display: C.5: plane_set_size (64x64)
(kms_universal_plane:9334) igt_kms-DEBUG: display: C.5: fb_set_position(0,0)
(kms_universal_plane:9334) igt_kms-DEBUG: display: C.5: fb_set_size(64x64)
(kms_universal_plane:9334) igt_kms-DEBUG: display: commit {
(kms_universal_plane:9334) igt_kms-DEBUG: Test requirement passed: plane_idx >...
(kms_universal_plane:9334) igt_kms-DEBUG: Test requirement passed: plane_idx >...
(kms_universal_plane:9334) igt_kms-DEBUG: Test requirement passed: plane_idx >...
(kms_universal_plane:9334) igt_kms-DEBUG: Test requirement passed: plane_idx >...
(kms_universal_plane:9334) igt_kms-DEBUG: Test requirement passed: plane_idx >...
(kms_universal_plane:9334) igt_kms-DEBUG: Test requirement passed: plane_idx >...
...
igt@kms_vblank@accuracy-idle@pipe-c-dp-7
igt@kms_vblank@accuracy-idle@pipe-c-dp-7
xe-2198-9bcce25c88a853967702ceae9f9ef35d2c0e7ee8

Starting dynamic subtest: pipe-C-DP-7
(kms_vblank:9633) igt_kms-CRITICAL: Test assertion failure function igt_primar...
(kms_vblank:9633) igt_kms-CRITICAL: Failed assertion: ret == 0
(kms_vblank:9633) igt_kms-CRITICAL: Last errno: 22, Invalid argument
(kms_vblank:9633) igt_kms-CRITICAL: error: -22 != 0
Dynamic subtest pipe-C-DP-7 failed.
**** DEBUG ****
(kms_vblank:9633) igt_kms-DEBUG: display:     SetProp plane A.1 "alpha" to 0xf...
(kms_vblank:9633) igt_kms-DEBUG: display:     SetProp plane A.1 "FB_DAMAGE_CLI...
(kms_vblank:9633) igt_kms-DEBUG: display:     SetProp plane A.1 "SCALING_FILTE...
(kms_vblank:9633) igt_kms-DEBUG: Test requirement passed: plane_idx >= 0 && pl...
(kms_vblank:9633) igt_kms-DEBUG: display:     Fixing up initial rotation pipe ...
(kms_vblank:9633) igt_kms-DEBUG: display:     SetPlane pipe A, plane 2, disabl...
(kms_vblank:9633) igt_kms-DEBUG: display:     SetProp plane A.2 "rotation" to ...
(kms_vblank:9633) igt_kms-DEBUG: display:     SetProp plane A.2 "COLOR_ENCODIN...
(kms_vblank:9633) igt_kms-DEBUG: display:     SetProp plane A.2 "COLOR_RANGE" ...
(kms_vblank:9633) igt_kms-DEBUG: display:     SetProp plane A.2 "pixel blend m...
...
Created at 2024-11-12 12:25:08