FAIL WARN PASS SKIP TIMEOUT NOT RUN INCOMPLETE ABORT CRASH
 
IGT_8303 xe-2901-71dac8dae6cc024b633bd6e584f4195c44c0dbc7 xe-2900-135e2838ed7d44d880e7e19971b1234e6ae04ded IGT_8302 xe-2899-8f917568adaeea8b649e337e7d0e03bd03332253 xe-2898-6deef7a0418bc26082804287b18c8db1e0810686 IGT_8301 xe-2897-883e4daea46ff15b470f138ee61573513243210d IGT_8300 IGT_8299 IGT_8298 xe-2896-f0fd77956987f035c79d08c812343a27a655a57b xe-2895-0d2ff6d7ad3b6bf64c5c0e9a921fcfa925029526 xe-2894-2dda6162c8d942406173d92a4cd3f23ea8a45696 IGT_8304
bat-bmg-1
 
 
 
 
 
 
 
 
 
 
 
 
 
 
 
bat-bmg-2
 
 
 
 
 
 
 
 
 
 
 
 
 
 
 
re-bmg-2
 
 
 
 
D igt@kms_universal_plane@cursor-fb-leak
xe-2899-8f917568adaeea8b649e337e7d0e03bd03332253

<3> [172.485777] xe 0000:03:00.0: [drm] *ERROR* Step 2 of creating MST payload...
<3> [173.233462] xe 0000:03:00.0: [drm] *ERROR* Step 2 of creating MST payload...
<3> [174.022593] xe 0000:03:00.0: [drm] *ERROR* Step 2 of creating MST payload...
<3> [174.822940] xe 0000:03:00.0: [drm] *ERROR* Step 2 of creating MST payload...
<3> [178.048423] xe 0000:03:00.0: [drm] *ERROR* Step 2 of creating MST payload...
<3> [180.926327] xe 0000:03:00.0: [drm] *ERROR* Step 2 of creating MST payload...
<3> [181.316982] xe 0000:03:00.0: [drm] *ERROR* Step 2 of creating MST payload...
<3> [181.728558] xe 0000:03:00.0: [drm] *ERROR* Step 2 of creating MST payload...
<3> [182.140414] xe 0000:03:00.0: [drm] *ERROR* Step 2 of creating MST payload...
<3> [182.590495] xe 0000:03:00.0: [drm] *ERROR* Step 2 of creating MST payload...
<3> [182.973345] xe 0000:03:00.0: [drm] *ERROR* Step 2 of creating MST payload...
 
 
 
 
 
 
 
D igt@kms_universal_plane@cursor-fb-leak
xe-2895-0d2ff6d7ad3b6bf64c5c0e9a921fcfa925029526

<3> [810.914729] xe 0000:03:00.0: [drm] *ERROR* Step 2 of creating MST payload...
<3> [811.610510] xe 0000:03:00.0: [drm] *ERROR* Step 2 of creating MST payload...
<3> [812.387491] xe 0000:03:00.0: [drm] *ERROR* Step 2 of creating MST payload...
<3> [813.204822] xe 0000:03:00.0: [drm] *ERROR* Step 2 of creating MST payload...
<3> [813.981257] xe 0000:03:00.0: [drm] *ERROR* Step 2 of creating MST payload...
<3> [816.943820] xe 0000:03:00.0: [drm] *ERROR* Step 2 of creating MST payload...
<3> [817.336305] xe 0000:03:00.0: [drm] *ERROR* Step 2 of creating MST payload...
<3> [817.742780] xe 0000:03:00.0: [drm] *ERROR* Step 2 of creating MST payload...
<3> [818.164100] xe 0000:03:00.0: [drm] *ERROR* Step 2 of creating MST payload...
<3> [818.628140] xe 0000:03:00.0: [drm] *ERROR* Step 2 of creating MST payload...
 
 
re-bmg-3
 
 
 
 
igt@kms_universal_plane@cursor-fb-leak
xe-2899-8f917568adaeea8b649e337e7d0e03bd03332253

Starting subtest: cursor-fb-leak
Starting dynamic subtest: pipe-A-DP-4
Dynamic subtest pipe-A-DP-4: SUCCESS (0.411s)
Starting dynamic subtest: pipe-B-DP-4
(kms_universal_plane:7667) CRITICAL: Test assertion failure function cursor_le...
(kms_universal_plane:7667) CRITICAL: Failed assertion: count1 == count2
(kms_universal_plane:7667) CRITICAL: Last errno: 9, Bad file descriptor
(kms_universal_plane:7667) CRITICAL: error: 1 != 3
Dynamic subtest pipe-B-DP-4 failed.
**** DEBUG ****
}
(kms_universal_plane:7667) igt_kms-DEBUG: display: B.5: plane_set_fb(300)
(kms_universal_plane:7667) igt_kms-DEBUG: display: B.5: plane_set_size (64x64)
(kms_universal_plane:7667) igt_kms-DEBUG: display: B.5: fb_set_position(0,0)
(kms_universal_plane:7667) igt_kms-DEBUG: display: B.5: fb_set_size(64x64)
(kms_universal_plane:7667) igt_kms-DEBUG: display: commit {
(kms_universal_plane:7667) igt_kms-DEBUG: Test requirement passed: plane_idx >...
...
 
 
 
 
 
 
 
igt@kms_universal_plane@cursor-fb-leak
xe-2895-0d2ff6d7ad3b6bf64c5c0e9a921fcfa925029526

Starting subtest: cursor-fb-leak
Starting dynamic subtest: pipe-A-DP-4
Dynamic subtest pipe-A-DP-4: SUCCESS (0.414s)
Starting dynamic subtest: pipe-B-DP-4
Dynamic subtest pipe-B-DP-4: SUCCESS (1.225s)
Starting dynamic subtest: pipe-C-DP-4
(kms_universal_plane:8515) CRITICAL: Test assertion failure function cursor_le...
(kms_universal_plane:8515) CRITICAL: Failed assertion: count1 == count2
(kms_universal_plane:8515) CRITICAL: Last errno: 9, Bad file descriptor
(kms_universal_plane:8515) CRITICAL: error: 1 != 16
Dynamic subtest pipe-C-DP-4 failed.
**** DEBUG ****
}
(kms_universal_plane:8515) igt_kms-DEBUG: display: C.5: plane_set_fb(300)
(kms_universal_plane:8515) igt_kms-DEBUG: display: C.5: plane_set_size (64x64)
(kms_universal_plane:8515) igt_kms-DEBUG: display: C.5: fb_set_position(0,0)
(kms_universal_plane:8515) igt_kms-DEBUG: display: C.5: fb_set_size(64x64)
...
 
 
re-bmg-4
 
 
 
 
igt@kms_universal_plane@cursor-fb-leak
xe-2899-8f917568adaeea8b649e337e7d0e03bd03332253

Starting subtest: cursor-fb-leak
Starting dynamic subtest: pipe-A-DP-1
(kms_universal_plane:16076) CRITICAL: Test assertion failure function cursor_l...
(kms_universal_plane:16076) CRITICAL: Failed assertion: count1 == count2
(kms_universal_plane:16076) CRITICAL: Last errno: 9, Bad file descriptor
(kms_universal_plane:16076) CRITICAL: error: 1 != 9
Dynamic subtest pipe-A-DP-1 failed.
**** DEBUG ****
}
(kms_universal_plane:16076) igt_kms-DEBUG: display: A.5: plane_set_fb(306)
(kms_universal_plane:16076) igt_kms-DEBUG: display: A.5: plane_set_size (64x64)
(kms_universal_plane:16076) igt_kms-DEBUG: display: A.5: fb_set_position(0,0)
(kms_universal_plane:16076) igt_kms-DEBUG: display: A.5: fb_set_size(64x64)
(kms_universal_plane:16076) igt_kms-DEBUG: display: commit {
(kms_universal_plane:16076) igt_kms-DEBUG: Test requirement passed: plane_idx ...
(kms_universal_plane:16076) igt_kms-DEBUG: Test requirement passed: plane_idx ...
(kms_universal_plane:16076) igt_kms-DEBUG: Test requirement passed: plane_idx ...
...
 
 
 
 
 
 
 
igt@kms_universal_plane@cursor-fb-leak
xe-2895-0d2ff6d7ad3b6bf64c5c0e9a921fcfa925029526

Starting subtest: cursor-fb-leak
Starting dynamic subtest: pipe-A-DP-1
Dynamic subtest pipe-A-DP-1: SUCCESS (1.316s)
Starting dynamic subtest: pipe-B-DP-2
(kms_universal_plane:23596) CRITICAL: Test assertion failure function cursor_l...
(kms_universal_plane:23596) CRITICAL: Failed assertion: count1 == count2
(kms_universal_plane:23596) CRITICAL: Last errno: 9, Bad file descriptor
(kms_universal_plane:23596) CRITICAL: error: 1 != 8
Dynamic subtest pipe-B-DP-2 failed.
**** DEBUG ****
}
(kms_universal_plane:23596) igt_kms-DEBUG: display: B.5: plane_set_fb(302)
(kms_universal_plane:23596) igt_kms-DEBUG: display: B.5: plane_set_size (64x64)
(kms_universal_plane:23596) igt_kms-DEBUG: display: B.5: fb_set_position(0,0)
(kms_universal_plane:23596) igt_kms-DEBUG: display: B.5: fb_set_size(64x64)
(kms_universal_plane:23596) igt_kms-DEBUG: display: commit {
(kms_universal_plane:23596) igt_kms-DEBUG: Test requirement passed: plane_idx ...
...
 
 
re-bmg-5
 
 
 
igt@kms_universal_plane@cursor-fb-leak
xe-2899-8f917568adaeea8b649e337e7d0e03bd03332253

Starting subtest: cursor-fb-leak
Starting dynamic subtest: pipe-A-DP-2
Dynamic subtest pipe-A-DP-2: SUCCESS (0.649s)
Starting dynamic subtest: pipe-B-HDMI-A-3
Dynamic subtest pipe-B-HDMI-A-3: SUCCESS (0.529s)
Starting dynamic subtest: pipe-C-DP-2
(kms_universal_plane:21335) CRITICAL: Test assertion failure function cursor_l...
(kms_universal_plane:21335) CRITICAL: Failed assertion: count1 == count2
(kms_universal_plane:21335) CRITICAL: Last errno: 9, Bad file descriptor
(kms_universal_plane:21335) CRITICAL: error: 1 != 17
Dynamic subtest pipe-C-DP-2 failed.
**** DEBUG ****
}
(kms_universal_plane:21335) igt_kms-DEBUG: display: C.5: plane_set_fb(297)
(kms_universal_plane:21335) igt_kms-DEBUG: display: C.5: plane_set_size (64x64)
(kms_universal_plane:21335) igt_kms-DEBUG: display: C.5: fb_set_position(0,0)
(kms_universal_plane:21335) igt_kms-DEBUG: display: C.5: fb_set_size(64x64)
...
 
 
 
 
 
 
 
igt@kms_universal_plane@cursor-fb-leak
xe-2895-0d2ff6d7ad3b6bf64c5c0e9a921fcfa925029526

Starting subtest: cursor-fb-leak
Starting dynamic subtest: pipe-A-DP-2
Dynamic subtest pipe-A-DP-2: SUCCESS (0.633s)
Starting dynamic subtest: pipe-B-HDMI-A-3
Dynamic subtest pipe-B-HDMI-A-3: SUCCESS (0.556s)
Starting dynamic subtest: pipe-C-DP-2
(kms_universal_plane:12244) CRITICAL: Test assertion failure function cursor_l...
(kms_universal_plane:12244) CRITICAL: Failed assertion: count1 == count2
(kms_universal_plane:12244) CRITICAL: Last errno: 9, Bad file descriptor
(kms_universal_plane:12244) CRITICAL: error: 1 != 3
Dynamic subtest pipe-C-DP-2 failed.
**** DEBUG ****
}
(kms_universal_plane:12244) igt_kms-DEBUG: display: C.5: plane_set_fb(297)
(kms_universal_plane:12244) igt_kms-DEBUG: display: C.5: plane_set_size (64x64)
(kms_universal_plane:12244) igt_kms-DEBUG: display: C.5: fb_set_position(0,0)
(kms_universal_plane:12244) igt_kms-DEBUG: display: C.5: fb_set_size(64x64)
...
 
 
re-bmg-6
 
 
 
 
 
 
 
 
 
 
 
 
 
 
 
shard-bmg-1
 
 
 
 
 
 
 
 
 
 
shard-bmg-2
 
 
 
 
 
 
 
 
 
 
 
 
 
shard-bmg-3
 
 
 
 
 
 
 
 
 
 
 
 
 
 
 
shard-bmg-4
 
 
 
 
 
 
 
 
 
 
 
 
 
 
 
shard-bmg-5
 
 
 
 
 
 
 
 
 
 
 
 
 
 
shard-bmg-6
 
 
 
 
 
 
 
 
 
 
 
 
 
 
 
shard-bmg-7
 
 
 
 
 
 
 
 
 
 
 
shard-bmg-8
 
 
 
 
 
 
 
 
 
 
 
 
 
 
bat-lnl-1
 
 
 
 
 
 
 
 
 
 
 
 
 
 
 
bat-lnl-2
 
 
 
 
 
 
 
 
 
 
 
 
 
 
 
re-lnl-1
 
 
 
 
 
 
 
 
 
 
 
 
 
re-lnl-2
 
 
 
 
 
 
 
 
 
 
 
 
 
 
 
re-lnl-3
 
 
 
 
igt@kms_universal_plane@cursor-fb-leak
xe-2899-8f917568adaeea8b649e337e7d0e03bd03332253

Starting subtest: cursor-fb-leak
Starting dynamic subtest: pipe-A-eDP-1
(kms_universal_plane:4265) CRITICAL: Test assertion failure function cursor_le...
(kms_universal_plane:4265) CRITICAL: Failed assertion: count1 == count2
(kms_universal_plane:4265) CRITICAL: Last errno: 9, Bad file descriptor
(kms_universal_plane:4265) CRITICAL: error: 1 != 3
Dynamic subtest pipe-A-eDP-1 failed.
**** DEBUG ****
(kms_universal_plane:4265) igt_kms-DEBUG: display: A.5: plane_set_size (64x64)
(kms_universal_plane:4265) igt_kms-DEBUG: display: A.5: fb_set_position(0,0)
(kms_universal_plane:4265) igt_kms-DEBUG: display: A.5: fb_set_size(64x64)
(kms_universal_plane:4265) igt_kms-DEBUG: display: commit {
(kms_universal_plane:4265) igt_kms-DEBUG: Test requirement passed: plane_idx >...
(kms_universal_plane:4265) igt_kms-DEBUG: Test requirement passed: plane_idx >...
(kms_universal_plane:4265) igt_kms-DEBUG: Test requirement passed: plane_idx >...
(kms_universal_plane:4265) igt_kms-DEBUG: Test requirement passed: plane_idx >...
(kms_universal_plane:4265) igt_kms-DEBUG: Test requirement passed: plane_idx >...
...
 
 
 
 
 
 
 
igt@kms_universal_plane@cursor-fb-leak
xe-2895-0d2ff6d7ad3b6bf64c5c0e9a921fcfa925029526

Starting subtest: cursor-fb-leak
Starting dynamic subtest: pipe-A-eDP-1
(kms_universal_plane:12416) CRITICAL: Test assertion failure function cursor_l...
(kms_universal_plane:12416) CRITICAL: Failed assertion: count1 == count2
(kms_universal_plane:12416) CRITICAL: Last errno: 9, Bad file descriptor
(kms_universal_plane:12416) CRITICAL: error: 1 != 2
Dynamic subtest pipe-A-eDP-1 failed.
**** DEBUG ****
(kms_universal_plane:12416) igt_kms-DEBUG: display: A.5: plane_set_size (64x64)
(kms_universal_plane:12416) igt_kms-DEBUG: display: A.5: fb_set_position(0,0)
(kms_universal_plane:12416) igt_kms-DEBUG: display: A.5: fb_set_size(64x64)
(kms_universal_plane:12416) igt_kms-DEBUG: display: commit {
(kms_universal_plane:12416) igt_kms-DEBUG: Test requirement passed: plane_idx ...
(kms_universal_plane:12416) igt_kms-DEBUG: Test requirement passed: plane_idx ...
(kms_universal_plane:12416) igt_kms-DEBUG: Test requirement passed: plane_idx ...
(kms_universal_plane:12416) igt_kms-DEBUG: Test requirement passed: plane_idx ...
(kms_universal_plane:12416) igt_kms-DEBUG: Test requirement passed: plane_idx ...
...
 
 
re-lnl-4
 
 
 
 
igt@kms_universal_plane@cursor-fb-leak
xe-2899-8f917568adaeea8b649e337e7d0e03bd03332253

Starting subtest: cursor-fb-leak
Starting dynamic subtest: pipe-A-eDP-1
(kms_universal_plane:3244) CRITICAL: Test assertion failure function cursor_le...
(kms_universal_plane:3244) CRITICAL: Failed assertion: count1 == count2
(kms_universal_plane:3244) CRITICAL: Last errno: 9, Bad file descriptor
(kms_universal_plane:3244) CRITICAL: error: 1 != 2
Dynamic subtest pipe-A-eDP-1 failed.
**** DEBUG ****
(kms_universal_plane:3244) igt_kms-DEBUG: display: A.5: plane_set_size (64x64)
(kms_universal_plane:3244) igt_kms-DEBUG: display: A.5: fb_set_position(0,0)
(kms_universal_plane:3244) igt_kms-DEBUG: display: A.5: fb_set_size(64x64)
(kms_universal_plane:3244) igt_kms-DEBUG: display: commit {
(kms_universal_plane:3244) igt_kms-DEBUG: Test requirement passed: plane_idx >...
(kms_universal_plane:3244) igt_kms-DEBUG: Test requirement passed: plane_idx >...
(kms_universal_plane:3244) igt_kms-DEBUG: Test requirement passed: plane_idx >...
(kms_universal_plane:3244) igt_kms-DEBUG: Test requirement passed: plane_idx >...
(kms_universal_plane:3244) igt_kms-DEBUG: Test requirement passed: plane_idx >...
...
 
 
 
 
 
 
 
igt@kms_universal_plane@cursor-fb-leak
xe-2895-0d2ff6d7ad3b6bf64c5c0e9a921fcfa925029526

Starting subtest: cursor-fb-leak
Starting dynamic subtest: pipe-A-eDP-1
Dynamic subtest pipe-A-eDP-1: SUCCESS (1.651s)
Starting dynamic subtest: pipe-B-DP-4
(kms_universal_plane:13206) CRITICAL: Test assertion failure function cursor_l...
(kms_universal_plane:13206) CRITICAL: Failed assertion: count1 == count2
(kms_universal_plane:13206) CRITICAL: Last errno: 9, Bad file descriptor
(kms_universal_plane:13206) CRITICAL: error: 1 != 3
Dynamic subtest pipe-B-DP-4 failed.
**** DEBUG ****
(kms_universal_plane:13206) igt_kms-DEBUG: display: B.5: plane_set_size (64x64)
(kms_universal_plane:13206) igt_kms-DEBUG: display: B.5: fb_set_position(0,0)
(kms_universal_plane:13206) igt_kms-DEBUG: display: B.5: fb_set_size(64x64)
(kms_universal_plane:13206) igt_kms-DEBUG: display: commit {
(kms_universal_plane:13206) igt_kms-DEBUG: Test requirement passed: plane_idx ...
(kms_universal_plane:13206) igt_kms-DEBUG: Test requirement passed: plane_idx ...
(kms_universal_plane:13206) igt_kms-DEBUG: Test requirement passed: plane_idx ...
...
 
 
re-lnl-5
 
 
 
 
igt@kms_universal_plane@cursor-fb-leak
xe-2899-8f917568adaeea8b649e337e7d0e03bd03332253

Starting subtest: cursor-fb-leak
Starting dynamic subtest: pipe-A-eDP-1
Dynamic subtest pipe-A-eDP-1: SUCCESS (0.487s)
Starting dynamic subtest: pipe-B-DP-1
(kms_universal_plane:4373) CRITICAL: Test assertion failure function cursor_le...
(kms_universal_plane:4373) CRITICAL: Failed assertion: count1 == count2
(kms_universal_plane:4373) CRITICAL: Last errno: 9, Bad file descriptor
(kms_universal_plane:4373) CRITICAL: error: 1 != 3
Dynamic subtest pipe-B-DP-1 failed.
**** DEBUG ****
(kms_universal_plane:4373) igt_kms-DEBUG: display: B.5: plane_set_size (64x64)
(kms_universal_plane:4373) igt_kms-DEBUG: display: B.5: fb_set_position(0,0)
(kms_universal_plane:4373) igt_kms-DEBUG: display: B.5: fb_set_size(64x64)
(kms_universal_plane:4373) igt_kms-DEBUG: display: commit {
(kms_universal_plane:4373) igt_kms-DEBUG: Test requirement passed: plane_idx >...
(kms_universal_plane:4373) igt_kms-DEBUG: Test requirement passed: plane_idx >...
(kms_universal_plane:4373) igt_kms-DEBUG: Test requirement passed: plane_idx >...
...
 
 
 
 
 
 
 
igt@kms_universal_plane@cursor-fb-leak
xe-2895-0d2ff6d7ad3b6bf64c5c0e9a921fcfa925029526

Starting subtest: cursor-fb-leak
Starting dynamic subtest: pipe-A-eDP-1
Dynamic subtest pipe-A-eDP-1: SUCCESS (0.598s)
Starting dynamic subtest: pipe-B-DP-1
(kms_universal_plane:16748) CRITICAL: Test assertion failure function cursor_l...
(kms_universal_plane:16748) CRITICAL: Failed assertion: count1 == count2
(kms_universal_plane:16748) CRITICAL: Last errno: 9, Bad file descriptor
(kms_universal_plane:16748) CRITICAL: error: 1 != 8
Dynamic subtest pipe-B-DP-1 failed.
**** DEBUG ****
(kms_universal_plane:16748) igt_kms-DEBUG: display: B.5: plane_set_size (64x64)
(kms_universal_plane:16748) igt_kms-DEBUG: display: B.5: fb_set_position(0,0)
(kms_universal_plane:16748) igt_kms-DEBUG: display: B.5: fb_set_size(64x64)
(kms_universal_plane:16748) igt_kms-DEBUG: display: commit {
(kms_universal_plane:16748) igt_kms-DEBUG: Test requirement passed: plane_idx ...
(kms_universal_plane:16748) igt_kms-DEBUG: Test requirement passed: plane_idx ...
(kms_universal_plane:16748) igt_kms-DEBUG: Test requirement passed: plane_idx ...
...
 
 
re-lnl-7
 
 
 
 
igt@kms_universal_plane@cursor-fb-leak
xe-2899-8f917568adaeea8b649e337e7d0e03bd03332253

Starting subtest: cursor-fb-leak
Starting dynamic subtest: pipe-A-eDP-1
(kms_universal_plane:2099) igt_kms-CRITICAL: Test assertion failure function i...
(kms_universal_plane:2099) igt_kms-CRITICAL: Failed assertion: ret == 0
(kms_universal_plane:2099) igt_kms-CRITICAL: Last errno: 22, Invalid argument
(kms_universal_plane:2099) igt_kms-CRITICAL: error: -22 != 0
Dynamic subtest pipe-A-eDP-1 failed.
**** DEBUG ****
(kms_universal_plane:2099) DEBUG: Test requirement passed: display->has_cursor...
(kms_universal_plane:2099) drmtest-DEBUG: Test requirement passed: is_intel_de...
(kms_universal_plane:2099) igt_kms-DEBUG: display: eDP-1: set_pipe(A)
(kms_universal_plane:2099) igt_kms-DEBUG: display: eDP-1: Selecting pipe A
(kms_universal_plane:2099) DEBUG: Test requirement passed: fp
(kms_universal_plane:2099) igt_fb-DEBUG: igt_create_fb_with_bo_size(width=2560...
(kms_universal_plane:2099) igt_fb-DEBUG: igt_create_fb_with_bo_size(handle=1, ...
(kms_universal_plane:2099) ioctl_wrappers-DEBUG: Test requirement passed: igt_...
(kms_universal_plane:2099) igt_fb-DEBUG: Test requirement passed: cairo_surfac...
...
 
 
 
 
 
 
 
igt@kms_universal_plane@cursor-fb-leak
xe-2895-0d2ff6d7ad3b6bf64c5c0e9a921fcfa925029526

Starting subtest: cursor-fb-leak
Starting dynamic subtest: pipe-A-eDP-1
(kms_universal_plane:15640) CRITICAL: Test assertion failure function cursor_l...
(kms_universal_plane:15640) CRITICAL: Failed assertion: count1 == count2
(kms_universal_plane:15640) CRITICAL: Last errno: 9, Bad file descriptor
(kms_universal_plane:15640) CRITICAL: error: 1 != 2
Dynamic subtest pipe-A-eDP-1 failed.
**** DEBUG ****
(kms_universal_plane:15640) igt_kms-DEBUG: display: A.5: plane_set_size (64x64)
(kms_universal_plane:15640) igt_kms-DEBUG: display: A.5: fb_set_position(0,0)
(kms_universal_plane:15640) igt_kms-DEBUG: display: A.5: fb_set_size(64x64)
(kms_universal_plane:15640) igt_kms-DEBUG: display: commit {
(kms_universal_plane:15640) igt_kms-DEBUG: Test requirement passed: plane_idx ...
(kms_universal_plane:15640) igt_kms-DEBUG: Test requirement passed: plane_idx ...
(kms_universal_plane:15640) igt_kms-DEBUG: Test requirement passed: plane_idx ...
(kms_universal_plane:15640) igt_kms-DEBUG: Test requirement passed: plane_idx ...
(kms_universal_plane:15640) igt_kms-DEBUG: Test requirement passed: plane_idx ...
...
 
 
re-lnl-8
 
 
 
 
igt@kms_universal_plane@cursor-fb-leak
xe-2899-8f917568adaeea8b649e337e7d0e03bd03332253

Starting subtest: cursor-fb-leak
Starting dynamic subtest: pipe-A-eDP-1
(kms_universal_plane:4688) CRITICAL: Test assertion failure function cursor_le...
(kms_universal_plane:4688) CRITICAL: Failed assertion: count1 == count2
(kms_universal_plane:4688) CRITICAL: Last errno: 9, Bad file descriptor
(kms_universal_plane:4688) CRITICAL: error: 1 != 2
Dynamic subtest pipe-A-eDP-1 failed.
**** DEBUG ****
(kms_universal_plane:4688) igt_kms-DEBUG: display: A.5: plane_set_size (64x64)
(kms_universal_plane:4688) igt_kms-DEBUG: display: A.5: fb_set_position(0,0)
(kms_universal_plane:4688) igt_kms-DEBUG: display: A.5: fb_set_size(64x64)
(kms_universal_plane:4688) igt_kms-DEBUG: display: commit {
(kms_universal_plane:4688) igt_kms-DEBUG: Test requirement passed: plane_idx >...
(kms_universal_plane:4688) igt_kms-DEBUG: Test requirement passed: plane_idx >...
(kms_universal_plane:4688) igt_kms-DEBUG: Test requirement passed: plane_idx >...
(kms_universal_plane:4688) igt_kms-DEBUG: Test requirement passed: plane_idx >...
(kms_universal_plane:4688) igt_kms-DEBUG: Test requirement passed: plane_idx >...
...
 
 
 
 
 
 
 
igt@kms_universal_plane@cursor-fb-leak
xe-2895-0d2ff6d7ad3b6bf64c5c0e9a921fcfa925029526

Starting subtest: cursor-fb-leak
Starting dynamic subtest: pipe-A-eDP-1
(kms_universal_plane:12731) CRITICAL: Test assertion failure function cursor_l...
(kms_universal_plane:12731) CRITICAL: Failed assertion: count1 == count2
(kms_universal_plane:12731) CRITICAL: Last errno: 9, Bad file descriptor
(kms_universal_plane:12731) CRITICAL: error: 1 != 2
Dynamic subtest pipe-A-eDP-1 failed.
**** DEBUG ****
(kms_universal_plane:12731) igt_kms-DEBUG: display: A.5: plane_set_size (64x64)
(kms_universal_plane:12731) igt_kms-DEBUG: display: A.5: fb_set_position(0,0)
(kms_universal_plane:12731) igt_kms-DEBUG: display: A.5: fb_set_size(64x64)
(kms_universal_plane:12731) igt_kms-DEBUG: display: commit {
(kms_universal_plane:12731) igt_kms-DEBUG: Test requirement passed: plane_idx ...
(kms_universal_plane:12731) igt_kms-DEBUG: Test requirement passed: plane_idx ...
(kms_universal_plane:12731) igt_kms-DEBUG: Test requirement passed: plane_idx ...
(kms_universal_plane:12731) igt_kms-DEBUG: Test requirement passed: plane_idx ...
(kms_universal_plane:12731) igt_kms-DEBUG: Test requirement passed: plane_idx ...
...
 
 
shard-lnl-1
 
 
 
 
 
igt@kms_universal_plane@cursor-fb-leak
xe-2898-6deef7a0418bc26082804287b18c8db1e0810686

Starting subtest: cursor-fb-leak
Starting dynamic subtest: pipe-A-eDP-1
(kms_universal_plane:2798) CRITICAL: Test assertion failure function cursor_le...
(kms_universal_plane:2798) CRITICAL: Failed assertion: count1 == count2
(kms_universal_plane:2798) CRITICAL: Last errno: 9, Bad file descriptor
(kms_universal_plane:2798) CRITICAL: error: 1 != 3
Dynamic subtest pipe-A-eDP-1 failed.
**** DEBUG ****
(kms_universal_plane:2798) igt_kms-DEBUG: display: A.5: plane_set_size (64x64)
(kms_universal_plane:2798) igt_kms-DEBUG: display: A.5: fb_set_position(0,0)
(kms_universal_plane:2798) igt_kms-DEBUG: display: A.5: fb_set_size(64x64)
(kms_universal_plane:2798) igt_kms-DEBUG: display: commit {
(kms_universal_plane:2798) igt_kms-DEBUG: Test requirement passed: plane_idx >...
(kms_universal_plane:2798) igt_kms-DEBUG: Test requirement passed: plane_idx >...
(kms_universal_plane:2798) igt_kms-DEBUG: Test requirement passed: plane_idx >...
(kms_universal_plane:2798) igt_kms-DEBUG: Test requirement passed: plane_idx >...
(kms_universal_plane:2798) igt_kms-DEBUG: Test requirement passed: plane_idx >...
...
 
 
 
 
 
 
 
 
 
shard-lnl-2
 
 
 
 
igt@kms_universal_plane@cursor-fb-leak
xe-2899-8f917568adaeea8b649e337e7d0e03bd03332253

Starting subtest: cursor-fb-leak
Starting dynamic subtest: pipe-A-eDP-1
(kms_universal_plane:2794) CRITICAL: Test assertion failure function cursor_le...
(kms_universal_plane:2794) CRITICAL: Failed assertion: count1 == count2
(kms_universal_plane:2794) CRITICAL: Last errno: 9, Bad file descriptor
(kms_universal_plane:2794) CRITICAL: error: 1 != 2
Dynamic subtest pipe-A-eDP-1 failed.
**** DEBUG ****
(kms_universal_plane:2794) igt_kms-DEBUG: display: A.5: plane_set_size (64x64)
(kms_universal_plane:2794) igt_kms-DEBUG: display: A.5: fb_set_position(0,0)
(kms_universal_plane:2794) igt_kms-DEBUG: display: A.5: fb_set_size(64x64)
(kms_universal_plane:2794) igt_kms-DEBUG: display: commit {
(kms_universal_plane:2794) igt_kms-DEBUG: Test requirement passed: plane_idx >...
(kms_universal_plane:2794) igt_kms-DEBUG: Test requirement passed: plane_idx >...
(kms_universal_plane:2794) igt_kms-DEBUG: Test requirement passed: plane_idx >...
(kms_universal_plane:2794) igt_kms-DEBUG: Test requirement passed: plane_idx >...
(kms_universal_plane:2794) igt_kms-DEBUG: Test requirement passed: plane_idx >...
...
 
 
 
 
 
 
 
 
 
shard-lnl-3
 
 
igt@kms_universal_plane@cursor-fb-leak
xe-2900-135e2838ed7d44d880e7e19971b1234e6ae04ded

Starting subtest: cursor-fb-leak
Starting dynamic subtest: pipe-A-eDP-1
Dynamic subtest pipe-A-eDP-1: SUCCESS (0.301s)
Starting dynamic subtest: pipe-B-eDP-1
Dynamic subtest pipe-B-eDP-1: SUCCESS (1.482s)
Starting dynamic subtest: pipe-C-eDP-1
(kms_universal_plane:3185) CRITICAL: Test assertion failure function cursor_le...
(kms_universal_plane:3185) CRITICAL: Failed assertion: count1 == count2
(kms_universal_plane:3185) CRITICAL: Last errno: 9, Bad file descriptor
(kms_universal_plane:3185) CRITICAL: error: 1 != 2
Dynamic subtest pipe-C-eDP-1 failed.
**** DEBUG ****
(kms_universal_plane:3185) igt_kms-DEBUG: display: C.5: plane_set_size (64x64)
(kms_universal_plane:3185) igt_kms-DEBUG: display: C.5: fb_set_position(0,0)
(kms_universal_plane:3185) igt_kms-DEBUG: display: C.5: fb_set_size(64x64)
(kms_universal_plane:3185) igt_kms-DEBUG: display: commit {
(kms_universal_plane:3185) igt_kms-DEBUG: Test requirement passed: plane_idx >...
...
 
 
 
 
 
 
igt@kms_universal_plane@cursor-fb-leak
IGT_8299

Starting subtest: cursor-fb-leak
Starting dynamic subtest: pipe-A-eDP-1
(kms_universal_plane:3782) CRITICAL: Test assertion failure function cursor_le...
(kms_universal_plane:3782) CRITICAL: Failed assertion: count1 == count2
(kms_universal_plane:3782) CRITICAL: Last errno: 9, Bad file descriptor
(kms_universal_plane:3782) CRITICAL: error: 1 != 2
Dynamic subtest pipe-A-eDP-1 failed.
**** DEBUG ****
(kms_universal_plane:3782) igt_kms-DEBUG: display: A.5: plane_set_size (64x64)
(kms_universal_plane:3782) igt_kms-DEBUG: display: A.5: fb_set_position(0,0)
(kms_universal_plane:3782) igt_kms-DEBUG: display: A.5: fb_set_size(64x64)
(kms_universal_plane:3782) igt_kms-DEBUG: display: commit {
(kms_universal_plane:3782) igt_kms-DEBUG: Test requirement passed: plane_idx >...
(kms_universal_plane:3782) igt_kms-DEBUG: Test requirement passed: plane_idx >...
(kms_universal_plane:3782) igt_kms-DEBUG: Test requirement passed: plane_idx >...
(kms_universal_plane:3782) igt_kms-DEBUG: Test requirement passed: plane_idx >...
(kms_universal_plane:3782) igt_kms-DEBUG: Test requirement passed: plane_idx >...
...
 
 
 
 
 
shard-lnl-4
 
 
 
 
 
 
 
 
 
 
 
 
igt@kms_universal_plane@cursor-fb-leak
xe-2895-0d2ff6d7ad3b6bf64c5c0e9a921fcfa925029526

Starting subtest: cursor-fb-leak
Starting dynamic subtest: pipe-A-eDP-1
Dynamic subtest pipe-A-eDP-1: SUCCESS (0.423s)
Starting dynamic subtest: pipe-B-eDP-1
(kms_universal_plane:3001) CRITICAL: Test assertion failure function cursor_le...
(kms_universal_plane:3001) CRITICAL: Failed assertion: count1 == count2
(kms_universal_plane:3001) CRITICAL: Last errno: 9, Bad file descriptor
(kms_universal_plane:3001) CRITICAL: error: 1 != 2
Dynamic subtest pipe-B-eDP-1 failed.
**** DEBUG ****
(kms_universal_plane:3001) igt_kms-DEBUG: display: B.5: plane_set_size (64x64)
(kms_universal_plane:3001) igt_kms-DEBUG: display: B.5: fb_set_position(0,0)
(kms_universal_plane:3001) igt_kms-DEBUG: display: B.5: fb_set_size(64x64)
(kms_universal_plane:3001) igt_kms-DEBUG: display: commit {
(kms_universal_plane:3001) igt_kms-DEBUG: Test requirement passed: plane_idx >...
(kms_universal_plane:3001) igt_kms-DEBUG: Test requirement passed: plane_idx >...
(kms_universal_plane:3001) igt_kms-DEBUG: Test requirement passed: plane_idx >...
...
 
 
shard-lnl-5
 
 
 
 
 
 
 
 
 
 
 
 
 
 
 
shard-lnl-6
 
igt@kms_universal_plane@cursor-fb-leak
xe-2901-71dac8dae6cc024b633bd6e584f4195c44c0dbc7

Starting subtest: cursor-fb-leak
Starting dynamic subtest: pipe-A-eDP-1
(kms_universal_plane:3195) CRITICAL: Test assertion failure function cursor_le...
(kms_universal_plane:3195) CRITICAL: Failed assertion: count1 == count2
(kms_universal_plane:3195) CRITICAL: Last errno: 9, Bad file descriptor
(kms_universal_plane:3195) CRITICAL: error: 1 != 2
Dynamic subtest pipe-A-eDP-1 failed.
**** DEBUG ****
(kms_universal_plane:3195) igt_kms-DEBUG: display: A.5: plane_set_size (64x64)
(kms_universal_plane:3195) igt_kms-DEBUG: display: A.5: fb_set_position(0,0)
(kms_universal_plane:3195) igt_kms-DEBUG: display: A.5: fb_set_size(64x64)
(kms_universal_plane:3195) igt_kms-DEBUG: display: commit {
(kms_universal_plane:3195) igt_kms-DEBUG: Test requirement passed: plane_idx >...
(kms_universal_plane:3195) igt_kms-DEBUG: Test requirement passed: plane_idx >...
(kms_universal_plane:3195) igt_kms-DEBUG: Test requirement passed: plane_idx >...
(kms_universal_plane:3195) igt_kms-DEBUG: Test requirement passed: plane_idx >...
(kms_universal_plane:3195) igt_kms-DEBUG: Test requirement passed: plane_idx >...
...
 
igt@kms_universal_plane@cursor-fb-leak
IGT_8302

Starting subtest: cursor-fb-leak
Starting dynamic subtest: pipe-A-eDP-1
Dynamic subtest pipe-A-eDP-1: SUCCESS (0.309s)
Starting dynamic subtest: pipe-B-eDP-1
(kms_universal_plane:3172) CRITICAL: Test assertion failure function cursor_le...
(kms_universal_plane:3172) CRITICAL: Failed assertion: count1 == count2
(kms_universal_plane:3172) CRITICAL: Last errno: 9, Bad file descriptor
(kms_universal_plane:3172) CRITICAL: error: 1 != 2
Dynamic subtest pipe-B-eDP-1 failed.
**** DEBUG ****
(kms_universal_plane:3172) igt_kms-DEBUG: display: B.5: plane_set_size (64x64)
(kms_universal_plane:3172) igt_kms-DEBUG: display: B.5: fb_set_position(0,0)
(kms_universal_plane:3172) igt_kms-DEBUG: display: B.5: fb_set_size(64x64)
(kms_universal_plane:3172) igt_kms-DEBUG: display: commit {
(kms_universal_plane:3172) igt_kms-DEBUG: Test requirement passed: plane_idx >...
(kms_universal_plane:3172) igt_kms-DEBUG: Test requirement passed: plane_idx >...
(kms_universal_plane:3172) igt_kms-DEBUG: Test requirement passed: plane_idx >...
...
 
 
 
 
igt@kms_universal_plane@cursor-fb-leak
IGT_8300

Starting subtest: cursor-fb-leak
Starting dynamic subtest: pipe-A-eDP-1
(kms_universal_plane:4519) CRITICAL: Test assertion failure function cursor_le...
(kms_universal_plane:4519) CRITICAL: Failed assertion: count1 == count2
(kms_universal_plane:4519) CRITICAL: Last errno: 9, Bad file descriptor
(kms_universal_plane:4519) CRITICAL: error: 1 != 2
Dynamic subtest pipe-A-eDP-1 failed.
**** DEBUG ****
(kms_universal_plane:4519) igt_kms-DEBUG: display: A.5: plane_set_size (64x64)
(kms_universal_plane:4519) igt_kms-DEBUG: display: A.5: fb_set_position(0,0)
(kms_universal_plane:4519) igt_kms-DEBUG: display: A.5: fb_set_size(64x64)
(kms_universal_plane:4519) igt_kms-DEBUG: display: commit {
(kms_universal_plane:4519) igt_kms-DEBUG: Test requirement passed: plane_idx >...
(kms_universal_plane:4519) igt_kms-DEBUG: Test requirement passed: plane_idx >...
(kms_universal_plane:4519) igt_kms-DEBUG: Test requirement passed: plane_idx >...
(kms_universal_plane:4519) igt_kms-DEBUG: Test requirement passed: plane_idx >...
(kms_universal_plane:4519) igt_kms-DEBUG: Test requirement passed: plane_idx >...
...
 
 
igt@kms_universal_plane@cursor-fb-leak
xe-2896-f0fd77956987f035c79d08c812343a27a655a57b

Starting subtest: cursor-fb-leak
Starting dynamic subtest: pipe-A-eDP-1
(kms_universal_plane:2988) CRITICAL: Test assertion failure function cursor_le...
(kms_universal_plane:2988) CRITICAL: Failed assertion: count1 == count2
(kms_universal_plane:2988) CRITICAL: Last errno: 9, Bad file descriptor
(kms_universal_plane:2988) CRITICAL: error: 1 != 2
Dynamic subtest pipe-A-eDP-1 failed.
**** DEBUG ****
(kms_universal_plane:2988) igt_kms-DEBUG: display: A.5: plane_set_size (64x64)
(kms_universal_plane:2988) igt_kms-DEBUG: display: A.5: fb_set_position(0,0)
(kms_universal_plane:2988) igt_kms-DEBUG: display: A.5: fb_set_size(64x64)
(kms_universal_plane:2988) igt_kms-DEBUG: display: commit {
(kms_universal_plane:2988) igt_kms-DEBUG: Test requirement passed: plane_idx >...
(kms_universal_plane:2988) igt_kms-DEBUG: Test requirement passed: plane_idx >...
(kms_universal_plane:2988) igt_kms-DEBUG: Test requirement passed: plane_idx >...
(kms_universal_plane:2988) igt_kms-DEBUG: Test requirement passed: plane_idx >...
(kms_universal_plane:2988) igt_kms-DEBUG: Test requirement passed: plane_idx >...
...
 
 
 
shard-lnl-7
 
 
 
 
 
 
 
 
 
 
igt@kms_universal_plane@cursor-fb-leak
IGT_8298

Starting subtest: cursor-fb-leak
Starting dynamic subtest: pipe-A-eDP-1
(kms_universal_plane:15418) CRITICAL: Test assertion failure function cursor_l...
(kms_universal_plane:15418) CRITICAL: Failed assertion: count1 == count2
(kms_universal_plane:15418) CRITICAL: Last errno: 9, Bad file descriptor
(kms_universal_plane:15418) CRITICAL: error: 1 != 3
Dynamic subtest pipe-A-eDP-1 failed.
**** DEBUG ****
(kms_universal_plane:15418) igt_kms-DEBUG: display: A.5: plane_set_size (64x64)
(kms_universal_plane:15418) igt_kms-DEBUG: display: A.5: fb_set_position(0,0)
(kms_universal_plane:15418) igt_kms-DEBUG: display: A.5: fb_set_size(64x64)
(kms_universal_plane:15418) igt_kms-DEBUG: display: commit {
(kms_universal_plane:15418) igt_kms-DEBUG: Test requirement passed: plane_idx ...
(kms_universal_plane:15418) igt_kms-DEBUG: Test requirement passed: plane_idx ...
(kms_universal_plane:15418) igt_kms-DEBUG: Test requirement passed: plane_idx ...
(kms_universal_plane:15418) igt_kms-DEBUG: Test requirement passed: plane_idx ...
(kms_universal_plane:15418) igt_kms-DEBUG: Test requirement passed: plane_idx ...
...
 
 
igt@kms_universal_plane@cursor-fb-leak
xe-2894-2dda6162c8d942406173d92a4cd3f23ea8a45696

Starting subtest: cursor-fb-leak
Starting dynamic subtest: pipe-A-eDP-1
(kms_universal_plane:2982) CRITICAL: Test assertion failure function cursor_le...
(kms_universal_plane:2982) CRITICAL: Failed assertion: count1 == count2
(kms_universal_plane:2982) CRITICAL: Last errno: 9, Bad file descriptor
(kms_universal_plane:2982) CRITICAL: error: 1 != 2
Dynamic subtest pipe-A-eDP-1 failed.
**** DEBUG ****
(kms_universal_plane:2982) igt_kms-DEBUG: display: A.5: plane_set_size (64x64)
(kms_universal_plane:2982) igt_kms-DEBUG: display: A.5: fb_set_position(0,0)
(kms_universal_plane:2982) igt_kms-DEBUG: display: A.5: fb_set_size(64x64)
(kms_universal_plane:2982) igt_kms-DEBUG: display: commit {
(kms_universal_plane:2982) igt_kms-DEBUG: Test requirement passed: plane_idx >...
(kms_universal_plane:2982) igt_kms-DEBUG: Test requirement passed: plane_idx >...
(kms_universal_plane:2982) igt_kms-DEBUG: Test requirement passed: plane_idx >...
(kms_universal_plane:2982) igt_kms-DEBUG: Test requirement passed: plane_idx >...
(kms_universal_plane:2982) igt_kms-DEBUG: Test requirement passed: plane_idx >...
...
 
shard-lnl-8
 
 
 
 
 
 
igt@kms_universal_plane@cursor-fb-leak
IGT_8301

Starting subtest: cursor-fb-leak
Starting dynamic subtest: pipe-A-eDP-1
Dynamic subtest pipe-A-eDP-1: SUCCESS (0.326s)
Starting dynamic subtest: pipe-B-eDP-1
(kms_universal_plane:2768) CRITICAL: Test assertion failure function cursor_le...
(kms_universal_plane:2768) CRITICAL: Failed assertion: count1 == count2
(kms_universal_plane:2768) CRITICAL: Last errno: 9, Bad file descriptor
(kms_universal_plane:2768) CRITICAL: error: 1 != 3
Dynamic subtest pipe-B-eDP-1 failed.
**** DEBUG ****
(kms_universal_plane:2768) igt_kms-DEBUG: display: B.5: plane_set_size (64x64)
(kms_universal_plane:2768) igt_kms-DEBUG: display: B.5: fb_set_position(0,0)
(kms_universal_plane:2768) igt_kms-DEBUG: display: B.5: fb_set_size(64x64)
(kms_universal_plane:2768) igt_kms-DEBUG: display: commit {
(kms_universal_plane:2768) igt_kms-DEBUG: Test requirement passed: plane_idx >...
(kms_universal_plane:2768) igt_kms-DEBUG: Test requirement passed: plane_idx >...
(kms_universal_plane:2768) igt_kms-DEBUG: Test requirement passed: plane_idx >...
...
 
 
 
 
 
 
 
 
bat-atsm-2
 
 
 
 
 
 
 
 
 
 
 
 
 
 
 
bat-dg2-oem2
 
 
 
 
 
 
 
 
 
 
 
 
 
 
 
shard-dg2-432
 
 
 
 
 
 
 
 
 
 
 
shard-dg2-433
 
 
 
 
 
 
 
 
 
 
 
shard-dg2-435
 
 
 
 
 
 
 
 
 
 
 
 
 
 
 
shard-dg2-463
 
 
 
 
 
 
 
 
 
 
 
 
 
 
shard-dg2-464
 
 
 
 
 
 
 
 
 
 
 
 
shard-dg2-466
 
 
 
 
 
 
 
 
 
 
 
 
 
 
bat-adlp-7
 
 
 
 
 
 
 
 
 
 
 
 
 
 
 
bat-adlp-vf
 
 
 
 
 
 
 
 
 
 
 
 
 
 
 
bat-adlp-vm
 
 
 
 
 
 
 
 
 
 
 
 
 
 
 
shard-adlp-1
 
 
 
 
 
 
 
 
 
 
 
shard-adlp-2
 
 
 
 
 
 
 
 
 
 
 
 
 
shard-adlp-4
 
 
 
 
 
 
 
 
 
 
 
 
 
 
shard-adlp-6
 
 
 
 
 
 
 
 
 
 
 
 
 
 
 
shard-adlp-8
 
 
 
 
 
 
 
 
 
 
 
 
 
shard-adlp-9
 
 
 
 
 
 
 
 
 
 
 
 
Created at 2025-04-03 15:23:34