FAIL WARN PASS SKIP TIMEOUT NOT RUN INCOMPLETE ABORT CRASH
 
IGT_8303 xe-2901-71dac8dae6cc024b633bd6e584f4195c44c0dbc7 xe-2900-135e2838ed7d44d880e7e19971b1234e6ae04ded IGT_8302 xe-2899-8f917568adaeea8b649e337e7d0e03bd03332253 xe-2898-6deef7a0418bc26082804287b18c8db1e0810686 IGT_8301 xe-2897-883e4daea46ff15b470f138ee61573513243210d IGT_8300 IGT_8299 IGT_8298 xe-2896-f0fd77956987f035c79d08c812343a27a655a57b xe-2895-0d2ff6d7ad3b6bf64c5c0e9a921fcfa925029526
igt@intel_hwmon@hwmon-write
igt@intel_hwmon@hwmon-write
IGT_8298

Starting subtest: hwmon-write
(intel_hwmon:3639) igt_sysfs-CRITICAL: Test assertion failure function igt_sys...
(intel_hwmon:3639) igt_sysfs-CRITICAL: Failed assertion: !ret
(intel_hwmon:3639) igt_sysfs-CRITICAL: Last errno: 22, Invalid argument
Subtest hwmon-write failed.
**** DEBUG ****
(intel_hwmon:3639) igt_sysfs-DEBUG: 'power1_max_interval': prev 0
(intel_hwmon:3639) igt_sysfs-DEBUG: 'power1_max_interval': sweeping range of v...
(intel_hwmon:3639) igt_sysfs-DEBUG: 'power1_max_interval': ret 1 set 1 get 0
(intel_hwmon:3639) igt_sysfs-DEBUG: 'power1_max_interval': ret 1 set 2 get 0
(intel_hwmon:3639) igt_sysfs-DEBUG: 'power1_max_interval': ret 1 set 4 get 0
(intel_hwmon:3639) igt_sysfs-DEBUG: 'power1_max_interval': ret 1 set 8 get 0
(intel_hwmon:3639) igt_sysfs-DEBUG: 'power1_max_interval': ret 1 set 16 get 0
(intel_hwmon:3639) igt_sysfs-DEBUG: 'power1_max_interval': ret 1 set 32 get 0
(intel_hwmon:3639) igt_sysfs-DEBUG: 'power1_max_interval': ret 1 set 64 get 0
(intel_hwmon:3639) igt_sysfs-DEBUG: 'power1_max_interval': ret 1 set 128 get 0
(intel_hwmon:3639) igt_sysfs-DEBUG: 'power1_max_interval': ret 1 set 256 get 0
...
igt@xe_compute_preempt@compute-preempt-many
igt@xe_compute_preempt@compute-preempt-many
IGT_8302

Starting subtest: compute-preempt-many
Starting dynamic subtest: engine-DRM_XE_ENGINE_CLASS_COMPUTE
(xe_compute_preempt:7634) intel_compute-CRITICAL: Test assertion failure funct...
(xe_compute_preempt:7634) intel_compute-CRITICAL: Failed assertion: 0 != __xe_...
(xe_compute_preempt:7634) intel_compute-CRITICAL: error: 0 == 0
Dynamic subtest engine-DRM_XE_ENGINE_CLASS_COMPUTE failed.
**** DEBUG ****
(xe_compute_preempt:7515) intel_compute-DEBUG: [i:  0 name:     instr state ba...
(xe_compute_preempt:7515) intel_compute-DEBUG: [i:  1 name:   dynamic state ba...
(xe_compute_preempt:7515) intel_compute-DEBUG: [i:  2 name:   surface state ba...
(xe_compute_preempt:7515) intel_compute-DEBUG: [i:  3 name: indirect object ba...
(xe_compute_preempt:7515) intel_compute-DEBUG: [i:  4 name:           addr inp...
(xe_compute_preempt:7515) intel_compute-DEBUG: [i:  5 name:          addr outp...
(xe_compute_preempt:7515) intel_compute-DEBUG: [i:  6 name:   general state ba...
(xe_compute_preempt:7515) intel_compute-DEBUG: [i:  7 name:        binding tab...
(xe_compute_preempt:7515) intel_compute-DEBUG: [i:  8 name:                bat...
(xe_compute_preempt:7515) intel_compute-DEBUG: [i:  9 name: state context data...
...
igt@xe_compute_preempt@compute-preempt-many
IGT_8301

Starting subtest: compute-preempt-many
Starting dynamic subtest: engine-DRM_XE_ENGINE_CLASS_COMPUTE
(xe_compute_preempt:2535) intel_compute-CRITICAL: Test assertion failure funct...
(xe_compute_preempt:2535) intel_compute-CRITICAL: Failed assertion: 0 != __xe_...
(xe_compute_preempt:2535) intel_compute-CRITICAL: error: 0 == 0
Dynamic subtest engine-DRM_XE_ENGINE_CLASS_COMPUTE failed.
**** DEBUG ****
(xe_compute_preempt:2150) intel_compute-DEBUG: [i:  0 name:     instr state ba...
(xe_compute_preempt:2150) intel_compute-DEBUG: [i:  1 name:   dynamic state ba...
(xe_compute_preempt:2150) intel_compute-DEBUG: [i:  2 name:   surface state ba...
(xe_compute_preempt:2150) intel_compute-DEBUG: [i:  3 name: indirect object ba...
(xe_compute_preempt:2150) intel_compute-DEBUG: [i:  4 name:           addr inp...
(xe_compute_preempt:2150) intel_compute-DEBUG: [i:  5 name:          addr outp...
(xe_compute_preempt:2150) intel_compute-DEBUG: [i:  6 name:   general state ba...
(xe_compute_preempt:2150) intel_compute-DEBUG: [i:  7 name:        binding tab...
(xe_compute_preempt:2150) intel_compute-DEBUG: [i:  8 name:                bat...
(xe_compute_preempt:2150) intel_compute-DEBUG: [i:  9 name: state context data...
...
igt@xe_compute_preempt@compute-preempt-many
IGT_8300

Starting subtest: compute-preempt-many
Starting dynamic subtest: engine-DRM_XE_ENGINE_CLASS_COMPUTE
(xe_compute_preempt:4529) intel_compute-CRITICAL: Test assertion failure funct...
(xe_compute_preempt:4529) intel_compute-CRITICAL: Failed assertion: 0 != __xe_...
(xe_compute_preempt:4529) intel_compute-CRITICAL: error: 0 == 0
(xe_compute_preempt:4525) intel_compute-CRITICAL: Test assertion failure funct...
(xe_compute_preempt:4525) intel_compute-CRITICAL: Failed assertion: 0 != __xe_...
(xe_compute_preempt:4525) intel_compute-CRITICAL: error: 0 == 0
Dynamic subtest engine-DRM_XE_ENGINE_CLASS_COMPUTE failed.
**** DEBUG ****
(xe_compute_preempt:4308) intel_compute-DEBUG: [i:  0 name:     instr state ba...
(xe_compute_preempt:4308) intel_compute-DEBUG: [i:  1 name:   dynamic state ba...
(xe_compute_preempt:4308) intel_compute-DEBUG: [i:  2 name:   surface state ba...
(xe_compute_preempt:4308) intel_compute-DEBUG: [i:  3 name: indirect object ba...
(xe_compute_preempt:4308) intel_compute-DEBUG: [i:  4 name:           addr inp...
(xe_compute_preempt:4308) intel_compute-DEBUG: [i:  5 name:          addr outp...
(xe_compute_preempt:4308) intel_compute-DEBUG: [i:  6 name:   general state ba...
...
igt@xe_compute_preempt@compute-preempt-many@engine-drm_xe_engine_class_compute
igt@xe_compute_preempt@compute-preempt-many@engine-drm_xe_engine_class_compute
IGT_8302

Starting subtest: compute-preempt-many
Starting dynamic subtest: engine-DRM_XE_ENGINE_CLASS_COMPUTE
(xe_compute_preempt:7634) intel_compute-CRITICAL: Test assertion failure funct...
(xe_compute_preempt:7634) intel_compute-CRITICAL: Failed assertion: 0 != __xe_...
(xe_compute_preempt:7634) intel_compute-CRITICAL: error: 0 == 0
Dynamic subtest engine-DRM_XE_ENGINE_CLASS_COMPUTE failed.
**** DEBUG ****
(xe_compute_preempt:7515) intel_compute-DEBUG: [i:  0 name:     instr state ba...
(xe_compute_preempt:7515) intel_compute-DEBUG: [i:  1 name:   dynamic state ba...
(xe_compute_preempt:7515) intel_compute-DEBUG: [i:  2 name:   surface state ba...
(xe_compute_preempt:7515) intel_compute-DEBUG: [i:  3 name: indirect object ba...
(xe_compute_preempt:7515) intel_compute-DEBUG: [i:  4 name:           addr inp...
(xe_compute_preempt:7515) intel_compute-DEBUG: [i:  5 name:          addr outp...
(xe_compute_preempt:7515) intel_compute-DEBUG: [i:  6 name:   general state ba...
(xe_compute_preempt:7515) intel_compute-DEBUG: [i:  7 name:        binding tab...
(xe_compute_preempt:7515) intel_compute-DEBUG: [i:  8 name:                bat...
(xe_compute_preempt:7515) intel_compute-DEBUG: [i:  9 name: state context data...
...
igt@xe_compute_preempt@compute-preempt-many@engine-drm_xe_engine_class_compute
IGT_8301

Starting subtest: compute-preempt-many
Starting dynamic subtest: engine-DRM_XE_ENGINE_CLASS_COMPUTE
(xe_compute_preempt:2535) intel_compute-CRITICAL: Test assertion failure funct...
(xe_compute_preempt:2535) intel_compute-CRITICAL: Failed assertion: 0 != __xe_...
(xe_compute_preempt:2535) intel_compute-CRITICAL: error: 0 == 0
Dynamic subtest engine-DRM_XE_ENGINE_CLASS_COMPUTE failed.
**** DEBUG ****
(xe_compute_preempt:2150) intel_compute-DEBUG: [i:  0 name:     instr state ba...
(xe_compute_preempt:2150) intel_compute-DEBUG: [i:  1 name:   dynamic state ba...
(xe_compute_preempt:2150) intel_compute-DEBUG: [i:  2 name:   surface state ba...
(xe_compute_preempt:2150) intel_compute-DEBUG: [i:  3 name: indirect object ba...
(xe_compute_preempt:2150) intel_compute-DEBUG: [i:  4 name:           addr inp...
(xe_compute_preempt:2150) intel_compute-DEBUG: [i:  5 name:          addr outp...
(xe_compute_preempt:2150) intel_compute-DEBUG: [i:  6 name:   general state ba...
(xe_compute_preempt:2150) intel_compute-DEBUG: [i:  7 name:        binding tab...
(xe_compute_preempt:2150) intel_compute-DEBUG: [i:  8 name:                bat...
(xe_compute_preempt:2150) intel_compute-DEBUG: [i:  9 name: state context data...
...
igt@xe_compute_preempt@compute-preempt-many@engine-drm_xe_engine_class_compute
IGT_8300

Starting subtest: compute-preempt-many
Starting dynamic subtest: engine-DRM_XE_ENGINE_CLASS_COMPUTE
(xe_compute_preempt:4529) intel_compute-CRITICAL: Test assertion failure funct...
(xe_compute_preempt:4529) intel_compute-CRITICAL: Failed assertion: 0 != __xe_...
(xe_compute_preempt:4529) intel_compute-CRITICAL: error: 0 == 0
(xe_compute_preempt:4525) intel_compute-CRITICAL: Test assertion failure funct...
(xe_compute_preempt:4525) intel_compute-CRITICAL: Failed assertion: 0 != __xe_...
(xe_compute_preempt:4525) intel_compute-CRITICAL: error: 0 == 0
Dynamic subtest engine-DRM_XE_ENGINE_CLASS_COMPUTE failed.
**** DEBUG ****
(xe_compute_preempt:4308) intel_compute-DEBUG: [i:  0 name:     instr state ba...
(xe_compute_preempt:4308) intel_compute-DEBUG: [i:  1 name:   dynamic state ba...
(xe_compute_preempt:4308) intel_compute-DEBUG: [i:  2 name:   surface state ba...
(xe_compute_preempt:4308) intel_compute-DEBUG: [i:  3 name: indirect object ba...
(xe_compute_preempt:4308) intel_compute-DEBUG: [i:  4 name:           addr inp...
(xe_compute_preempt:4308) intel_compute-DEBUG: [i:  5 name:          addr outp...
(xe_compute_preempt:4308) intel_compute-DEBUG: [i:  6 name:   general state ba...
...
igt@kms_content_protection@srm
igt@kms_content_protection@srm
xe-2901-71dac8dae6cc024b633bd6e584f4195c44c0dbc7

Starting subtest: srm
Starting dynamic subtest: pipe-A-DP-2
(kms_content_protection:4800) CRITICAL: Test assertion failure function test_c...
(kms_content_protection:4800) CRITICAL: Failed assertion: ret
(kms_content_protection:4800) CRITICAL: Content Protection not enabled
Dynamic subtest pipe-A-DP-2 failed.
**** DEBUG ****
(kms_content_protection:4800) igt_kms-DEBUG: Test requirement passed: plane_id...
(kms_content_protection:4800) igt_kms-DEBUG: display: A.0: plane_set_fb(292)
(kms_content_protection:4800) igt_kms-DEBUG: display: A.0: plane_set_size (192...
(kms_content_protection:4800) igt_kms-DEBUG: display: A.0: fb_set_position(0,0)
(kms_content_protection:4800) igt_kms-DEBUG: display: A.0: fb_set_size(1920x10...
(kms_content_protection:4800) igt_kms-DEBUG: display: commit {
(kms_content_protection:4800) igt_kms-DEBUG: display:     populating plane dat...
(kms_content_protection:4800) igt_kms-DEBUG: plane A.0: Setting property "SRC_...
(kms_content_protection:4800) igt_kms-DEBUG: plane A.0: Setting property "SRC_...
(kms_content_protection:4800) igt_kms-DEBUG: plane A.0: Setting property "SRC_...
...
igt@kms_content_protection@srm
xe-2900-135e2838ed7d44d880e7e19971b1234e6ae04ded

Starting subtest: srm
Starting dynamic subtest: pipe-A-DP-2
(kms_content_protection:4820) CRITICAL: Test assertion failure function test_c...
(kms_content_protection:4820) CRITICAL: Failed assertion: ret
(kms_content_protection:4820) CRITICAL: Content Protection not enabled
Dynamic subtest pipe-A-DP-2 failed.
**** DEBUG ****
(kms_content_protection:4820) igt_kms-DEBUG: Test requirement passed: plane_id...
(kms_content_protection:4820) igt_kms-DEBUG: display: A.0: plane_set_fb(292)
(kms_content_protection:4820) igt_kms-DEBUG: display: A.0: plane_set_size (192...
(kms_content_protection:4820) igt_kms-DEBUG: display: A.0: fb_set_position(0,0)
(kms_content_protection:4820) igt_kms-DEBUG: display: A.0: fb_set_size(1920x10...
(kms_content_protection:4820) igt_kms-DEBUG: display: commit {
(kms_content_protection:4820) igt_kms-DEBUG: display:     populating plane dat...
(kms_content_protection:4820) igt_kms-DEBUG: plane A.0: Setting property "SRC_...
(kms_content_protection:4820) igt_kms-DEBUG: plane A.0: Setting property "SRC_...
(kms_content_protection:4820) igt_kms-DEBUG: plane A.0: Setting property "SRC_...
...
igt@kms_content_protection@srm
IGT_8302

Starting subtest: srm
Starting dynamic subtest: pipe-A-DP-2
(kms_content_protection:4809) CRITICAL: Test assertion failure function test_c...
(kms_content_protection:4809) CRITICAL: Failed assertion: ret
(kms_content_protection:4809) CRITICAL: Content Protection not enabled
Dynamic subtest pipe-A-DP-2 failed.
**** DEBUG ****
(kms_content_protection:4809) igt_kms-DEBUG: Test requirement passed: plane_id...
(kms_content_protection:4809) igt_kms-DEBUG: display: A.0: plane_set_fb(292)
(kms_content_protection:4809) igt_kms-DEBUG: display: A.0: plane_set_size (192...
(kms_content_protection:4809) igt_kms-DEBUG: display: A.0: fb_set_position(0,0)
(kms_content_protection:4809) igt_kms-DEBUG: display: A.0: fb_set_size(1920x10...
(kms_content_protection:4809) igt_kms-DEBUG: display: commit {
(kms_content_protection:4809) igt_kms-DEBUG: display:     populating plane dat...
(kms_content_protection:4809) igt_kms-DEBUG: plane A.0: Setting property "SRC_...
(kms_content_protection:4809) igt_kms-DEBUG: plane A.0: Setting property "SRC_...
(kms_content_protection:4809) igt_kms-DEBUG: plane A.0: Setting property "SRC_...
...
igt@kms_content_protection@srm
xe-2899-8f917568adaeea8b649e337e7d0e03bd03332253

Starting subtest: srm
Starting dynamic subtest: pipe-A-DP-2
(kms_content_protection:6991) CRITICAL: Test assertion failure function test_c...
(kms_content_protection:6991) CRITICAL: Failed assertion: ret
(kms_content_protection:6991) CRITICAL: Content Protection not enabled
Dynamic subtest pipe-A-DP-2 failed.
**** DEBUG ****
(kms_content_protection:6991) igt_kms-DEBUG: Test requirement passed: plane_id...
(kms_content_protection:6991) igt_kms-DEBUG: display: A.0: plane_set_fb(289)
(kms_content_protection:6991) igt_kms-DEBUG: display: A.0: plane_set_size (192...
(kms_content_protection:6991) igt_kms-DEBUG: display: A.0: fb_set_position(0,0)
(kms_content_protection:6991) igt_kms-DEBUG: display: A.0: fb_set_size(1920x10...
(kms_content_protection:6991) igt_kms-DEBUG: display: commit {
(kms_content_protection:6991) igt_kms-DEBUG: display:     populating plane dat...
(kms_content_protection:6991) igt_kms-DEBUG: plane A.0: Setting property "SRC_...
(kms_content_protection:6991) igt_kms-DEBUG: plane A.0: Setting property "SRC_...
(kms_content_protection:6991) igt_kms-DEBUG: plane A.0: Setting property "SRC_...
...
igt@kms_content_protection@srm
IGT_8300

Starting subtest: srm
Starting dynamic subtest: pipe-A-DP-2
(kms_content_protection:3166) CRITICAL: Test assertion failure function test_c...
(kms_content_protection:3166) CRITICAL: Failed assertion: ret
(kms_content_protection:3166) CRITICAL: Content Protection not enabled
Dynamic subtest pipe-A-DP-2 failed.
**** DEBUG ****
(kms_content_protection:3166) igt_kms-DEBUG: Test requirement passed: plane_id...
(kms_content_protection:3166) igt_kms-DEBUG: display: A.0: plane_set_fb(291)
(kms_content_protection:3166) igt_kms-DEBUG: display: A.0: plane_set_size (192...
(kms_content_protection:3166) igt_kms-DEBUG: display: A.0: fb_set_position(0,0)
(kms_content_protection:3166) igt_kms-DEBUG: display: A.0: fb_set_size(1920x10...
(kms_content_protection:3166) igt_kms-DEBUG: display: commit {
(kms_content_protection:3166) igt_kms-DEBUG: display:     populating plane dat...
(kms_content_protection:3166) igt_kms-DEBUG: plane A.0: Setting property "SRC_...
(kms_content_protection:3166) igt_kms-DEBUG: plane A.0: Setting property "SRC_...
(kms_content_protection:3166) igt_kms-DEBUG: plane A.0: Setting property "SRC_...
...
igt@kms_content_protection@srm
IGT_8298

Starting subtest: srm
Starting dynamic subtest: pipe-A-DP-2
(kms_content_protection:8554) CRITICAL: Test assertion failure function test_c...
(kms_content_protection:8554) CRITICAL: Failed assertion: ret
(kms_content_protection:8554) CRITICAL: Content Protection not enabled
Dynamic subtest pipe-A-DP-2 failed.
**** DEBUG ****
(kms_content_protection:8554) igt_kms-DEBUG: Test requirement passed: plane_id...
(kms_content_protection:8554) igt_kms-DEBUG: display: A.0: plane_set_fb(291)
(kms_content_protection:8554) igt_kms-DEBUG: display: A.0: plane_set_size (192...
(kms_content_protection:8554) igt_kms-DEBUG: display: A.0: fb_set_position(0,0)
(kms_content_protection:8554) igt_kms-DEBUG: display: A.0: fb_set_size(1920x10...
(kms_content_protection:8554) igt_kms-DEBUG: display: commit {
(kms_content_protection:8554) igt_kms-DEBUG: display:     populating plane dat...
(kms_content_protection:8554) igt_kms-DEBUG: plane A.0: Setting property "SRC_...
(kms_content_protection:8554) igt_kms-DEBUG: plane A.0: Setting property "SRC_...
(kms_content_protection:8554) igt_kms-DEBUG: plane A.0: Setting property "SRC_...
...
igt@kms_content_protection@srm
xe-2895-0d2ff6d7ad3b6bf64c5c0e9a921fcfa925029526

Starting subtest: srm
Starting dynamic subtest: pipe-A-DP-2
(kms_content_protection:2204) CRITICAL: Test assertion failure function test_c...
(kms_content_protection:2204) CRITICAL: Failed assertion: ret
(kms_content_protection:2204) CRITICAL: Content Protection not enabled
Dynamic subtest pipe-A-DP-2 failed.
**** DEBUG ****
(kms_content_protection:2204) igt_kms-DEBUG: Test requirement passed: plane_id...
(kms_content_protection:2204) igt_kms-DEBUG: display: A.0: plane_set_fb(287)
(kms_content_protection:2204) igt_kms-DEBUG: display: A.0: plane_set_size (192...
(kms_content_protection:2204) igt_kms-DEBUG: display: A.0: fb_set_position(0,0)
(kms_content_protection:2204) igt_kms-DEBUG: display: A.0: fb_set_size(1920x10...
(kms_content_protection:2204) igt_kms-DEBUG: display: commit {
(kms_content_protection:2204) igt_kms-DEBUG: display:     populating plane dat...
(kms_content_protection:2204) igt_kms-DEBUG: plane A.0: Setting property "SRC_...
(kms_content_protection:2204) igt_kms-DEBUG: plane A.0: Setting property "SRC_...
(kms_content_protection:2204) igt_kms-DEBUG: plane A.0: Setting property "SRC_...
...
igt@kms_flip@plain-flip-fb-recreate
igt@kms_flip@plain-flip-fb-recreate
IGT_8302

Starting subtest: plain-flip-fb-recreate
Starting dynamic subtest: A-DP2
(kms_flip:2163) CRITICAL: Test assertion failure function __run_test_on_crtc_s...
(kms_flip:2163) CRITICAL: Failed assertion: !retried && needs_retry_after_link...
Dynamic subtest A-DP2 failed.
**** DEBUG ****
(kms_flip:2163) intel_allocator_simple-DEBUG: Using simple allocator
(kms_flip:2163) intel_allocator_simple-DEBUG: <ial: 0x5b255ab00b10, fd: 5> obj...
(kms_flip:2163) intel_allocator_simple-DEBUG: <ial: 0x5b255ab00b10, fd: 5> obj...
(kms_flip:2163) intel_allocator_simple-DEBUG: Using simple allocator
(kms_flip:2163) intel_allocator_simple-DEBUG: <ial: 0x5b255aaca4d0, fd: 5> obj...
(kms_flip:2163) intel_allocator_simple-DEBUG: <ial: 0x5b255aaca4d0, fd: 5> obj...
(kms_flip:2163) igt_kms-INFO:   1920x1080: 60 148500 1920 2008 2052 2200 1080 ...
(kms_flip:2163) DEBUG: No stale events found
(kms_flip:2163) i915/intel_drrs-DEBUG: Manually disabling DRRS. 0
(kms_flip:2163) i915/intel_drrs-DEBUG: Test requirement passed: dir >= 0
(kms_flip:2163) INFO: Expected frametime: 16667us; measured 16310.6us +- 23.90...
...
igt@kms_pm_dc@dc6-dpms
igt@kms_pm_dc@dc6-dpms
IGT_8301

Starting subtest: dc6-dpms
(kms_pm_dc:3156) CRITICAL: Test assertion failure function test_pkgc_state_dpm...
(kms_pm_dc:3156) CRITICAL: Failed assertion: cur_value > prev_value
(kms_pm_dc:3156) CRITICAL: PKGC10 is not achieved.
Subtest dc6-dpms failed.
**** DEBUG ****
(kms_pm_dc:3156) DEBUG: Test requirement passed: igt_pm_pc8_plus_residencies_e...
(kms_pm_dc:3156) DEBUG: Test requirement passed: !(len < 0)
(kms_pm_dc:3156) DEBUG: Test requirement passed: !(!str)
(kms_pm_dc:3156) DEBUG: Test requirement passed: !(len < 0)
(kms_pm_dc:3156) DEBUG: Test requirement passed: !(!str)
(kms_pm_dc:3156) DEBUG: Test requirement passed: !(len < 0)
(kms_pm_dc:3156) DEBUG: Test requirement passed: !(!str)
(kms_pm_dc:3156) DEBUG: Test requirement passed: !(len < 0)
(kms_pm_dc:3156) DEBUG: Test requirement passed: !(!str)
(kms_pm_dc:3156) DEBUG: Test requirement passed: !(len < 0)
(kms_pm_dc:3156) DEBUG: Test requirement passed: !(!str)
...
igt@kms_content_protection@uevent
igt@kms_content_protection@uevent
xe-2901-71dac8dae6cc024b633bd6e584f4195c44c0dbc7

Starting subtest: uevent
Starting dynamic subtest: pipe-A-DP-2
(kms_content_protection:4338) CRITICAL: Test assertion failure function wait_f...
(kms_content_protection:4338) CRITICAL: Failed assertion: igt_connector_event_...
(kms_content_protection:4338) CRITICAL: uevent is not receivedDynamic subtest ...
**** DEBUG ****
(kms_content_protection:4338) igt_kms-DEBUG: Test requirement passed: plane_id...
(kms_content_protection:4338) igt_kms-DEBUG: display: A.0: plane_set_fb(290)
(kms_content_protection:4338) igt_kms-DEBUG: display: A.0: plane_set_size (192...
(kms_content_protection:4338) igt_kms-DEBUG: display: A.0: fb_set_position(0,0)
(kms_content_protection:4338) igt_kms-DEBUG: display: A.0: fb_set_size(1920x10...
(kms_content_protection:4338) igt_kms-DEBUG: display: commit {
(kms_content_protection:4338) igt_kms-DEBUG: display:     populating plane dat...
(kms_content_protection:4338) igt_kms-DEBUG: plane A.0: Setting property "SRC_...
(kms_content_protection:4338) igt_kms-DEBUG: plane A.0: Setting property "SRC_...
(kms_content_protection:4338) igt_kms-DEBUG: plane A.0: Setting property "SRC_...
(kms_content_protection:4338) igt_kms-DEBUG: plane A.0: Setting property "SRC_...
...
igt@kms_content_protection@uevent
IGT_8302

Starting subtest: uevent
Starting dynamic subtest: pipe-A-DP-2
(kms_content_protection:4347) CRITICAL: Test assertion failure function wait_f...
(kms_content_protection:4347) CRITICAL: Failed assertion: igt_connector_event_...
(kms_content_protection:4347) CRITICAL: uevent is not receivedDynamic subtest ...
**** DEBUG ****
(kms_content_protection:4347) igt_kms-DEBUG: Test requirement passed: plane_id...
(kms_content_protection:4347) igt_kms-DEBUG: display: A.0: plane_set_fb(290)
(kms_content_protection:4347) igt_kms-DEBUG: display: A.0: plane_set_size (192...
(kms_content_protection:4347) igt_kms-DEBUG: display: A.0: fb_set_position(0,0)
(kms_content_protection:4347) igt_kms-DEBUG: display: A.0: fb_set_size(1920x10...
(kms_content_protection:4347) igt_kms-DEBUG: display: commit {
(kms_content_protection:4347) igt_kms-DEBUG: display:     populating plane dat...
(kms_content_protection:4347) igt_kms-DEBUG: plane A.0: Setting property "SRC_...
(kms_content_protection:4347) igt_kms-DEBUG: plane A.0: Setting property "SRC_...
(kms_content_protection:4347) igt_kms-DEBUG: plane A.0: Setting property "SRC_...
(kms_content_protection:4347) igt_kms-DEBUG: plane A.0: Setting property "SRC_...
...
igt@kms_content_protection@atomic-dpms
igt@kms_content_protection@atomic-dpms
xe-2901-71dac8dae6cc024b633bd6e584f4195c44c0dbc7

Starting subtest: atomic-dpms
Starting dynamic subtest: pipe-A-DP-2
(kms_content_protection:4663) CRITICAL: Test assertion failure function test_c...
(kms_content_protection:4663) CRITICAL: Failed assertion: ret
(kms_content_protection:4663) CRITICAL: Content Protection not enabled
Dynamic subtest pipe-A-DP-2 failed.
**** DEBUG ****
(kms_content_protection:4663) igt_kms-DEBUG: Test requirement passed: plane_id...
(kms_content_protection:4663) igt_kms-DEBUG: display: A.0: plane_set_fb(287)
(kms_content_protection:4663) igt_kms-DEBUG: display: A.0: plane_set_size (192...
(kms_content_protection:4663) igt_kms-DEBUG: display: A.0: fb_set_position(0,0)
(kms_content_protection:4663) igt_kms-DEBUG: display: A.0: fb_set_size(1920x10...
(kms_content_protection:4663) igt_kms-DEBUG: display: commit {
(kms_content_protection:4663) igt_kms-DEBUG: display:     populating plane dat...
(kms_content_protection:4663) igt_kms-DEBUG: plane A.0: Setting property "SRC_...
(kms_content_protection:4663) igt_kms-DEBUG: plane A.0: Setting property "SRC_...
(kms_content_protection:4663) igt_kms-DEBUG: plane A.0: Setting property "SRC_...
...
igt@kms_cursor_legacy@cursorb-vs-flipa-atomic-transitions-varying-size
D igt@kms_cursor_legacy@cursorb-vs-flipa-atomic-transitions-varying-size
IGT_8300

<3> [350.435024] xe 0000:03:00.0: [drm] *ERROR* Atomic update failure on pipe ...
<3> [353.368502] xe 0000:03:00.0: [drm] *ERROR* Atomic update failure on pipe ...
igt@kms_flip@plain-flip-fb-recreate@a-dp2
igt@kms_flip@plain-flip-fb-recreate@a-dp2
IGT_8302

Starting subtest: plain-flip-fb-recreate
Starting dynamic subtest: A-DP2
(kms_flip:2163) CRITICAL: Test assertion failure function __run_test_on_crtc_s...
(kms_flip:2163) CRITICAL: Failed assertion: !retried && needs_retry_after_link...
Dynamic subtest A-DP2 failed.
**** DEBUG ****
(kms_flip:2163) intel_allocator_simple-DEBUG: Using simple allocator
(kms_flip:2163) intel_allocator_simple-DEBUG: <ial: 0x5b255ab00b10, fd: 5> obj...
(kms_flip:2163) intel_allocator_simple-DEBUG: <ial: 0x5b255ab00b10, fd: 5> obj...
(kms_flip:2163) intel_allocator_simple-DEBUG: Using simple allocator
(kms_flip:2163) intel_allocator_simple-DEBUG: <ial: 0x5b255aaca4d0, fd: 5> obj...
(kms_flip:2163) intel_allocator_simple-DEBUG: <ial: 0x5b255aaca4d0, fd: 5> obj...
(kms_flip:2163) igt_kms-INFO:   1920x1080: 60 148500 1920 2008 2052 2200 1080 ...
(kms_flip:2163) DEBUG: No stale events found
(kms_flip:2163) i915/intel_drrs-DEBUG: Manually disabling DRRS. 0
(kms_flip:2163) i915/intel_drrs-DEBUG: Test requirement passed: dir >= 0
(kms_flip:2163) INFO: Expected frametime: 16667us; measured 16310.6us +- 23.90...
...
igt@kms_content_protection@srm@pipe-a-dp-2
igt@kms_content_protection@srm@pipe-a-dp-2
xe-2901-71dac8dae6cc024b633bd6e584f4195c44c0dbc7

Starting subtest: srm
Starting dynamic subtest: pipe-A-DP-2
(kms_content_protection:4800) CRITICAL: Test assertion failure function test_c...
(kms_content_protection:4800) CRITICAL: Failed assertion: ret
(kms_content_protection:4800) CRITICAL: Content Protection not enabled
Dynamic subtest pipe-A-DP-2 failed.
**** DEBUG ****
(kms_content_protection:4800) igt_kms-DEBUG: Test requirement passed: plane_id...
(kms_content_protection:4800) igt_kms-DEBUG: display: A.0: plane_set_fb(292)
(kms_content_protection:4800) igt_kms-DEBUG: display: A.0: plane_set_size (192...
(kms_content_protection:4800) igt_kms-DEBUG: display: A.0: fb_set_position(0,0)
(kms_content_protection:4800) igt_kms-DEBUG: display: A.0: fb_set_size(1920x10...
(kms_content_protection:4800) igt_kms-DEBUG: display: commit {
(kms_content_protection:4800) igt_kms-DEBUG: display:     populating plane dat...
(kms_content_protection:4800) igt_kms-DEBUG: plane A.0: Setting property "SRC_...
(kms_content_protection:4800) igt_kms-DEBUG: plane A.0: Setting property "SRC_...
(kms_content_protection:4800) igt_kms-DEBUG: plane A.0: Setting property "SRC_...
...
igt@kms_content_protection@srm@pipe-a-dp-2
xe-2900-135e2838ed7d44d880e7e19971b1234e6ae04ded

Starting subtest: srm
Starting dynamic subtest: pipe-A-DP-2
(kms_content_protection:4820) CRITICAL: Test assertion failure function test_c...
(kms_content_protection:4820) CRITICAL: Failed assertion: ret
(kms_content_protection:4820) CRITICAL: Content Protection not enabled
Dynamic subtest pipe-A-DP-2 failed.
**** DEBUG ****
(kms_content_protection:4820) igt_kms-DEBUG: Test requirement passed: plane_id...
(kms_content_protection:4820) igt_kms-DEBUG: display: A.0: plane_set_fb(292)
(kms_content_protection:4820) igt_kms-DEBUG: display: A.0: plane_set_size (192...
(kms_content_protection:4820) igt_kms-DEBUG: display: A.0: fb_set_position(0,0)
(kms_content_protection:4820) igt_kms-DEBUG: display: A.0: fb_set_size(1920x10...
(kms_content_protection:4820) igt_kms-DEBUG: display: commit {
(kms_content_protection:4820) igt_kms-DEBUG: display:     populating plane dat...
(kms_content_protection:4820) igt_kms-DEBUG: plane A.0: Setting property "SRC_...
(kms_content_protection:4820) igt_kms-DEBUG: plane A.0: Setting property "SRC_...
(kms_content_protection:4820) igt_kms-DEBUG: plane A.0: Setting property "SRC_...
...
igt@kms_content_protection@srm@pipe-a-dp-2
IGT_8302

Starting subtest: srm
Starting dynamic subtest: pipe-A-DP-2
(kms_content_protection:4809) CRITICAL: Test assertion failure function test_c...
(kms_content_protection:4809) CRITICAL: Failed assertion: ret
(kms_content_protection:4809) CRITICAL: Content Protection not enabled
Dynamic subtest pipe-A-DP-2 failed.
**** DEBUG ****
(kms_content_protection:4809) igt_kms-DEBUG: Test requirement passed: plane_id...
(kms_content_protection:4809) igt_kms-DEBUG: display: A.0: plane_set_fb(292)
(kms_content_protection:4809) igt_kms-DEBUG: display: A.0: plane_set_size (192...
(kms_content_protection:4809) igt_kms-DEBUG: display: A.0: fb_set_position(0,0)
(kms_content_protection:4809) igt_kms-DEBUG: display: A.0: fb_set_size(1920x10...
(kms_content_protection:4809) igt_kms-DEBUG: display: commit {
(kms_content_protection:4809) igt_kms-DEBUG: display:     populating plane dat...
(kms_content_protection:4809) igt_kms-DEBUG: plane A.0: Setting property "SRC_...
(kms_content_protection:4809) igt_kms-DEBUG: plane A.0: Setting property "SRC_...
(kms_content_protection:4809) igt_kms-DEBUG: plane A.0: Setting property "SRC_...
...
igt@kms_content_protection@srm@pipe-a-dp-2
xe-2899-8f917568adaeea8b649e337e7d0e03bd03332253

Starting subtest: srm
Starting dynamic subtest: pipe-A-DP-2
(kms_content_protection:6991) CRITICAL: Test assertion failure function test_c...
(kms_content_protection:6991) CRITICAL: Failed assertion: ret
(kms_content_protection:6991) CRITICAL: Content Protection not enabled
Dynamic subtest pipe-A-DP-2 failed.
**** DEBUG ****
(kms_content_protection:6991) igt_kms-DEBUG: Test requirement passed: plane_id...
(kms_content_protection:6991) igt_kms-DEBUG: display: A.0: plane_set_fb(289)
(kms_content_protection:6991) igt_kms-DEBUG: display: A.0: plane_set_size (192...
(kms_content_protection:6991) igt_kms-DEBUG: display: A.0: fb_set_position(0,0)
(kms_content_protection:6991) igt_kms-DEBUG: display: A.0: fb_set_size(1920x10...
(kms_content_protection:6991) igt_kms-DEBUG: display: commit {
(kms_content_protection:6991) igt_kms-DEBUG: display:     populating plane dat...
(kms_content_protection:6991) igt_kms-DEBUG: plane A.0: Setting property "SRC_...
(kms_content_protection:6991) igt_kms-DEBUG: plane A.0: Setting property "SRC_...
(kms_content_protection:6991) igt_kms-DEBUG: plane A.0: Setting property "SRC_...
...
igt@kms_content_protection@srm@pipe-a-dp-2
IGT_8300

Starting subtest: srm
Starting dynamic subtest: pipe-A-DP-2
(kms_content_protection:3166) CRITICAL: Test assertion failure function test_c...
(kms_content_protection:3166) CRITICAL: Failed assertion: ret
(kms_content_protection:3166) CRITICAL: Content Protection not enabled
Dynamic subtest pipe-A-DP-2 failed.
**** DEBUG ****
(kms_content_protection:3166) igt_kms-DEBUG: Test requirement passed: plane_id...
(kms_content_protection:3166) igt_kms-DEBUG: display: A.0: plane_set_fb(291)
(kms_content_protection:3166) igt_kms-DEBUG: display: A.0: plane_set_size (192...
(kms_content_protection:3166) igt_kms-DEBUG: display: A.0: fb_set_position(0,0)
(kms_content_protection:3166) igt_kms-DEBUG: display: A.0: fb_set_size(1920x10...
(kms_content_protection:3166) igt_kms-DEBUG: display: commit {
(kms_content_protection:3166) igt_kms-DEBUG: display:     populating plane dat...
(kms_content_protection:3166) igt_kms-DEBUG: plane A.0: Setting property "SRC_...
(kms_content_protection:3166) igt_kms-DEBUG: plane A.0: Setting property "SRC_...
(kms_content_protection:3166) igt_kms-DEBUG: plane A.0: Setting property "SRC_...
...
igt@kms_content_protection@srm@pipe-a-dp-2
IGT_8298

Starting subtest: srm
Starting dynamic subtest: pipe-A-DP-2
(kms_content_protection:8554) CRITICAL: Test assertion failure function test_c...
(kms_content_protection:8554) CRITICAL: Failed assertion: ret
(kms_content_protection:8554) CRITICAL: Content Protection not enabled
Dynamic subtest pipe-A-DP-2 failed.
**** DEBUG ****
(kms_content_protection:8554) igt_kms-DEBUG: Test requirement passed: plane_id...
(kms_content_protection:8554) igt_kms-DEBUG: display: A.0: plane_set_fb(291)
(kms_content_protection:8554) igt_kms-DEBUG: display: A.0: plane_set_size (192...
(kms_content_protection:8554) igt_kms-DEBUG: display: A.0: fb_set_position(0,0)
(kms_content_protection:8554) igt_kms-DEBUG: display: A.0: fb_set_size(1920x10...
(kms_content_protection:8554) igt_kms-DEBUG: display: commit {
(kms_content_protection:8554) igt_kms-DEBUG: display:     populating plane dat...
(kms_content_protection:8554) igt_kms-DEBUG: plane A.0: Setting property "SRC_...
(kms_content_protection:8554) igt_kms-DEBUG: plane A.0: Setting property "SRC_...
(kms_content_protection:8554) igt_kms-DEBUG: plane A.0: Setting property "SRC_...
...
igt@kms_content_protection@srm@pipe-a-dp-2
xe-2895-0d2ff6d7ad3b6bf64c5c0e9a921fcfa925029526

Starting subtest: srm
Starting dynamic subtest: pipe-A-DP-2
(kms_content_protection:2204) CRITICAL: Test assertion failure function test_c...
(kms_content_protection:2204) CRITICAL: Failed assertion: ret
(kms_content_protection:2204) CRITICAL: Content Protection not enabled
Dynamic subtest pipe-A-DP-2 failed.
**** DEBUG ****
(kms_content_protection:2204) igt_kms-DEBUG: Test requirement passed: plane_id...
(kms_content_protection:2204) igt_kms-DEBUG: display: A.0: plane_set_fb(287)
(kms_content_protection:2204) igt_kms-DEBUG: display: A.0: plane_set_size (192...
(kms_content_protection:2204) igt_kms-DEBUG: display: A.0: fb_set_position(0,0)
(kms_content_protection:2204) igt_kms-DEBUG: display: A.0: fb_set_size(1920x10...
(kms_content_protection:2204) igt_kms-DEBUG: display: commit {
(kms_content_protection:2204) igt_kms-DEBUG: display:     populating plane dat...
(kms_content_protection:2204) igt_kms-DEBUG: plane A.0: Setting property "SRC_...
(kms_content_protection:2204) igt_kms-DEBUG: plane A.0: Setting property "SRC_...
(kms_content_protection:2204) igt_kms-DEBUG: plane A.0: Setting property "SRC_...
...
igt@kms_content_protection@uevent@pipe-a-dp-2
igt@kms_content_protection@uevent@pipe-a-dp-2
xe-2901-71dac8dae6cc024b633bd6e584f4195c44c0dbc7

Starting subtest: uevent
Starting dynamic subtest: pipe-A-DP-2
(kms_content_protection:4338) CRITICAL: Test assertion failure function wait_f...
(kms_content_protection:4338) CRITICAL: Failed assertion: igt_connector_event_...
(kms_content_protection:4338) CRITICAL: uevent is not receivedDynamic subtest ...
**** DEBUG ****
(kms_content_protection:4338) igt_kms-DEBUG: Test requirement passed: plane_id...
(kms_content_protection:4338) igt_kms-DEBUG: display: A.0: plane_set_fb(290)
(kms_content_protection:4338) igt_kms-DEBUG: display: A.0: plane_set_size (192...
(kms_content_protection:4338) igt_kms-DEBUG: display: A.0: fb_set_position(0,0)
(kms_content_protection:4338) igt_kms-DEBUG: display: A.0: fb_set_size(1920x10...
(kms_content_protection:4338) igt_kms-DEBUG: display: commit {
(kms_content_protection:4338) igt_kms-DEBUG: display:     populating plane dat...
(kms_content_protection:4338) igt_kms-DEBUG: plane A.0: Setting property "SRC_...
(kms_content_protection:4338) igt_kms-DEBUG: plane A.0: Setting property "SRC_...
(kms_content_protection:4338) igt_kms-DEBUG: plane A.0: Setting property "SRC_...
(kms_content_protection:4338) igt_kms-DEBUG: plane A.0: Setting property "SRC_...
...
igt@kms_content_protection@uevent@pipe-a-dp-2
IGT_8302

Starting subtest: uevent
Starting dynamic subtest: pipe-A-DP-2
(kms_content_protection:4347) CRITICAL: Test assertion failure function wait_f...
(kms_content_protection:4347) CRITICAL: Failed assertion: igt_connector_event_...
(kms_content_protection:4347) CRITICAL: uevent is not receivedDynamic subtest ...
**** DEBUG ****
(kms_content_protection:4347) igt_kms-DEBUG: Test requirement passed: plane_id...
(kms_content_protection:4347) igt_kms-DEBUG: display: A.0: plane_set_fb(290)
(kms_content_protection:4347) igt_kms-DEBUG: display: A.0: plane_set_size (192...
(kms_content_protection:4347) igt_kms-DEBUG: display: A.0: fb_set_position(0,0)
(kms_content_protection:4347) igt_kms-DEBUG: display: A.0: fb_set_size(1920x10...
(kms_content_protection:4347) igt_kms-DEBUG: display: commit {
(kms_content_protection:4347) igt_kms-DEBUG: display:     populating plane dat...
(kms_content_protection:4347) igt_kms-DEBUG: plane A.0: Setting property "SRC_...
(kms_content_protection:4347) igt_kms-DEBUG: plane A.0: Setting property "SRC_...
(kms_content_protection:4347) igt_kms-DEBUG: plane A.0: Setting property "SRC_...
(kms_content_protection:4347) igt_kms-DEBUG: plane A.0: Setting property "SRC_...
...
igt@kms_content_protection@atomic-dpms@pipe-a-dp-2
igt@kms_content_protection@atomic-dpms@pipe-a-dp-2
xe-2901-71dac8dae6cc024b633bd6e584f4195c44c0dbc7

Starting subtest: atomic-dpms
Starting dynamic subtest: pipe-A-DP-2
(kms_content_protection:4663) CRITICAL: Test assertion failure function test_c...
(kms_content_protection:4663) CRITICAL: Failed assertion: ret
(kms_content_protection:4663) CRITICAL: Content Protection not enabled
Dynamic subtest pipe-A-DP-2 failed.
**** DEBUG ****
(kms_content_protection:4663) igt_kms-DEBUG: Test requirement passed: plane_id...
(kms_content_protection:4663) igt_kms-DEBUG: display: A.0: plane_set_fb(287)
(kms_content_protection:4663) igt_kms-DEBUG: display: A.0: plane_set_size (192...
(kms_content_protection:4663) igt_kms-DEBUG: display: A.0: fb_set_position(0,0)
(kms_content_protection:4663) igt_kms-DEBUG: display: A.0: fb_set_size(1920x10...
(kms_content_protection:4663) igt_kms-DEBUG: display: commit {
(kms_content_protection:4663) igt_kms-DEBUG: display:     populating plane dat...
(kms_content_protection:4663) igt_kms-DEBUG: plane A.0: Setting property "SRC_...
(kms_content_protection:4663) igt_kms-DEBUG: plane A.0: Setting property "SRC_...
(kms_content_protection:4663) igt_kms-DEBUG: plane A.0: Setting property "SRC_...
...
igt@kms_cursor_legacy@cursorb-vs-flipa-toggle
D igt@kms_cursor_legacy@cursorb-vs-flipa-toggle
xe-2899-8f917568adaeea8b649e337e7d0e03bd03332253

<3> [60.829715] xe 0000:03:00.0: [drm] *ERROR* Atomic update failure on pipe B...
igt@kms_content_protection@legacy
igt@kms_content_protection@legacy
IGT_8302

Starting subtest: legacy
Starting dynamic subtest: pipe-A-DP-2
(kms_content_protection:10874) CRITICAL: Test assertion failure function test_...
(kms_content_protection:10874) CRITICAL: Failed assertion: ret
(kms_content_protection:10874) CRITICAL: Content Protection not enabled
Dynamic subtest pipe-A-DP-2 failed.
**** DEBUG ****
(kms_content_protection:10874) igt_kms-DEBUG: display: commit {
(kms_content_protection:10874) igt_kms-DEBUG: Test requirement passed: plane_i...
(kms_content_protection:10874) igt_kms-DEBUG: display:     DP-2: SetCrtc pipe ...
(kms_content_protection:10874) igt_kms-DEBUG: Test requirement passed: plane_i...
(kms_content_protection:10874) igt_kms-DEBUG: Test requirement passed: plane_i...
(kms_content_protection:10874) igt_kms-DEBUG: Test requirement passed: plane_i...
(kms_content_protection:10874) igt_kms-DEBUG: Test requirement passed: plane_i...
(kms_content_protection:10874) igt_kms-DEBUG: Test requirement passed: plane_i...
(kms_content_protection:10874) igt_kms-DEBUG: Test requirement passed: plane_i...
(kms_content_protection:10874) igt_kms-DEBUG: Test requirement passed: plane_i...
...
igt@kms_content_protection@legacy
xe-2898-6deef7a0418bc26082804287b18c8db1e0810686

Starting subtest: legacy
Starting dynamic subtest: pipe-A-DP-2
(kms_content_protection:4231) CRITICAL: Test assertion failure function test_c...
(kms_content_protection:4231) CRITICAL: Failed assertion: ret
(kms_content_protection:4231) CRITICAL: Content Protection not enabled
Dynamic subtest pipe-A-DP-2 failed.
**** DEBUG ****
(kms_content_protection:4231) igt_kms-DEBUG: display: commit {
(kms_content_protection:4231) igt_kms-DEBUG: Test requirement passed: plane_id...
(kms_content_protection:4231) igt_kms-DEBUG: display:     DP-2: SetCrtc pipe A...
(kms_content_protection:4231) igt_kms-DEBUG: Test requirement passed: plane_id...
(kms_content_protection:4231) igt_kms-DEBUG: Test requirement passed: plane_id...
(kms_content_protection:4231) igt_kms-DEBUG: Test requirement passed: plane_id...
(kms_content_protection:4231) igt_kms-DEBUG: Test requirement passed: plane_id...
(kms_content_protection:4231) igt_kms-DEBUG: Test requirement passed: plane_id...
(kms_content_protection:4231) igt_kms-DEBUG: Test requirement passed: plane_id...
(kms_content_protection:4231) igt_kms-DEBUG: Test requirement passed: plane_id...
...
igt@kms_content_protection@legacy@pipe-a-dp-2
igt@kms_content_protection@legacy@pipe-a-dp-2
IGT_8302

Starting subtest: legacy
Starting dynamic subtest: pipe-A-DP-2
(kms_content_protection:10874) CRITICAL: Test assertion failure function test_...
(kms_content_protection:10874) CRITICAL: Failed assertion: ret
(kms_content_protection:10874) CRITICAL: Content Protection not enabled
Dynamic subtest pipe-A-DP-2 failed.
**** DEBUG ****
(kms_content_protection:10874) igt_kms-DEBUG: display: commit {
(kms_content_protection:10874) igt_kms-DEBUG: Test requirement passed: plane_i...
(kms_content_protection:10874) igt_kms-DEBUG: display:     DP-2: SetCrtc pipe ...
(kms_content_protection:10874) igt_kms-DEBUG: Test requirement passed: plane_i...
(kms_content_protection:10874) igt_kms-DEBUG: Test requirement passed: plane_i...
(kms_content_protection:10874) igt_kms-DEBUG: Test requirement passed: plane_i...
(kms_content_protection:10874) igt_kms-DEBUG: Test requirement passed: plane_i...
(kms_content_protection:10874) igt_kms-DEBUG: Test requirement passed: plane_i...
(kms_content_protection:10874) igt_kms-DEBUG: Test requirement passed: plane_i...
(kms_content_protection:10874) igt_kms-DEBUG: Test requirement passed: plane_i...
...
igt@kms_content_protection@legacy@pipe-a-dp-2
xe-2898-6deef7a0418bc26082804287b18c8db1e0810686

Starting subtest: legacy
Starting dynamic subtest: pipe-A-DP-2
(kms_content_protection:4231) CRITICAL: Test assertion failure function test_c...
(kms_content_protection:4231) CRITICAL: Failed assertion: ret
(kms_content_protection:4231) CRITICAL: Content Protection not enabled
Dynamic subtest pipe-A-DP-2 failed.
**** DEBUG ****
(kms_content_protection:4231) igt_kms-DEBUG: display: commit {
(kms_content_protection:4231) igt_kms-DEBUG: Test requirement passed: plane_id...
(kms_content_protection:4231) igt_kms-DEBUG: display:     DP-2: SetCrtc pipe A...
(kms_content_protection:4231) igt_kms-DEBUG: Test requirement passed: plane_id...
(kms_content_protection:4231) igt_kms-DEBUG: Test requirement passed: plane_id...
(kms_content_protection:4231) igt_kms-DEBUG: Test requirement passed: plane_id...
(kms_content_protection:4231) igt_kms-DEBUG: Test requirement passed: plane_id...
(kms_content_protection:4231) igt_kms-DEBUG: Test requirement passed: plane_id...
(kms_content_protection:4231) igt_kms-DEBUG: Test requirement passed: plane_id...
(kms_content_protection:4231) igt_kms-DEBUG: Test requirement passed: plane_id...
...
igt@kms_flip@2x-flip-vs-expired-vblank-interruptible
igt@kms_flip@2x-flip-vs-expired-vblank-interruptible
xe-2895-0d2ff6d7ad3b6bf64c5c0e9a921fcfa925029526

Starting subtest: 2x-flip-vs-expired-vblank-interruptible
Starting dynamic subtest: AB-DP2-HDMI-A3
(kms_flip:2991) CRITICAL: Test assertion failure function run_test_step, file ...
(kms_flip:2991) CRITICAL: Failed assertion: end - start < 500
(kms_flip:2991) CRITICAL: Last errno: 4, Interrupted system call
Dynamic subtest AB-DP2-HDMI-A3 failed.
**** DEBUG ****
(kms_flip:2991) igt_fb-DEBUG: igt_create_fb_with_bo_size(width=1920, height=10...
(kms_flip:2991) igt_fb-DEBUG: igt_create_fb_with_bo_size(handle=1, pitch=7680)
(kms_flip:2991) ioctl_wrappers-DEBUG: Test requirement passed: igt_has_fb_modi...
(kms_flip:2991) igt_fb-DEBUG: igt_create_fb_with_bo_size(width=1920, height=10...
(kms_flip:2991) igt_fb-DEBUG: igt_create_fb_with_bo_size(handle=2, pitch=7680)
(kms_flip:2991) ioctl_wrappers-DEBUG: Test requirement passed: igt_has_fb_modi...
(kms_flip:2991) intel_allocator_simple-DEBUG: Using simple allocator
(kms_flip:2991) intel_allocator_simple-DEBUG: <ial: 0x5f4830350910, fd: 5> obj...
(kms_flip:2991) intel_allocator_simple-DEBUG: <ial: 0x5f4830350910, fd: 5> obj...
(kms_flip:2991) intel_allocator_simple-DEBUG: Using simple allocator
...
igt@kms_ccs@crc-primary-suspend-4-tiled-bmg-ccs
igt@kms_ccs@crc-primary-suspend-4-tiled-bmg-ccs
xe-2898-6deef7a0418bc26082804287b18c8db1e0810686

<6> [227.979667] Console: switching to colour dummy device 80x25
<6> [227.979927] [IGT] kms_ccs: executing
<7> [228.003684] xe 0000:03:00.0: [drm:drm_helper_probe_single_connector_modes...
<7> [228.003701] xe 0000:03:00.0: [drm:intel_dp_detect [xe]] [CONNECTOR:241:DP...
<7> [228.008057] xe 0000:03:00.0: [drm:drm_helper_probe_single_connector_modes...
<7> [228.008449] xe 0000:03:00.0: [drm:drm_helper_probe_single_connector_modes...
<7> [228.008459] xe 0000:03:00.0: [drm:intel_hdmi_detect [xe]] [CONNECTOR:254:...
<7> [228.013161] xe 0000:03:00.0: [drm:drm_helper_probe_single_connector_modes...
<7> [228.013602] xe 0000:03:00.0: [drm:drm_helper_probe_single_connector_modes...
<7> [228.013610] xe 0000:03:00.0: [drm:intel_hdmi_detect [xe]] [CONNECTOR:268:...
<7> [228.013879] xe 0000:03:00.0: [drm:do_gmbus_xfer [xe]] GMBUS [i915 gmbus t...
<7> [228.013958] xe 0000:03:00.0: [drm:do_gmbus_xfer [xe]] GMBUS [i915 gmbus t...
<7> [228.014220] xe 0000:03:00.0: [drm:do_gmbus_xfer [xe]] GMBUS [i915 gmbus t...
<7> [228.014297] [drm:drm_do_probe_ddc_edid] drm: skipping non-existent adapte...
<7> [228.014301] xe 0000:03:00.0: [drm:intel_hdmi_set_edid [xe]] HDMI GMBUS ED...
<7> [228.014377] xe 0000:03:00.0: [drm:intel_gmbus_force_bit [xe]] enabling bi...
<7> [228.015515] [drm:drm_do_probe_ddc_edid] drm: skipping non-existent adapte...
...
igt@kms_ccs@crc-primary-suspend-4-tiled-bmg-ccs@pipe-d-hdmi-a-3
igt@kms_ccs@crc-primary-suspend-4-tiled-bmg-ccs@pipe-d-hdmi-a-3
xe-2898-6deef7a0418bc26082804287b18c8db1e0810686

<6> [274.902628] [IGT] kms_ccs: starting dynamic subtest pipe-D-HDMI-A-3
<7> [274.902867] xe 0000:03:00.0: [drm:drm_mode_addfb2] [FB:314]
<7> [274.905706] xe 0000:03:00.0: [drm:xe_migrate_copy [xe]] Pass 0, sizes: 82...
<7> [274.905838] xe 0000:03:00.0: [drm:xe_migrate_copy [xe]] Pass 1, sizes: 41...
<7> [274.905925] xe 0000:03:00.0: [drm:xe_migrate_copy [xe]] Pass 2, sizes: 20...
<7> [274.906002] xe 0000:03:00.0: [drm:xe_migrate_copy [xe]] Pass 3, sizes: 95...
<7> [274.906079] xe 0000:03:00.0: [drm:xe_migrate_copy [xe]] Pass 4, sizes: 43...
<7> [274.906154] xe 0000:03:00.0: [drm:xe_migrate_copy [xe]] Pass 5, sizes: 16...
<7> [274.906229] xe 0000:03:00.0: [drm:xe_migrate_copy [xe]] Pass 6, sizes: 36...
<7> [274.914452] xe 0000:03:00.0: [drm:intel_hdmi_compute_clock [xe]] picking ...
<7> [274.914552] xe 0000:03:00.0: [drm:intel_atomic_check [xe]] [CRTC:238:pipe...
<7> [274.914645] xe 0000:03:00.0: [drm:intel_ddi_compute_config_late [xe]] [EN...
<7> [274.914736] xe 0000:03:00.0: [drm:intel_pipe_config_compare [xe]] [CRTC:2...
<7> [274.914844] xe 0000:03:00.0: [drm:intel_pipe_config_compare [xe]] [CRTC:2...
<7> [274.914928] xe 0000:03:00.0: [drm:intel_pipe_config_compare [xe]] [CRTC:2...
<7> [274.915010] xe 0000:03:00.0: [drm:intel_pipe_config_compare [xe]] [CRTC:2...
<7> [274.915091] xe 0000:03:00.0: [drm:intel_pipe_config_compare [xe]] [CRTC:2...
...
igt@kms_flip@2x-flip-vs-expired-vblank
igt@kms_flip@2x-flip-vs-expired-vblank
xe-2897-883e4daea46ff15b470f138ee61573513243210d

Starting subtest: 2x-flip-vs-expired-vblank
Starting dynamic subtest: AB-DP2-HDMI-A3
Dynamic subtest AB-DP2-HDMI-A3: SUCCESS (5.414s)
Starting dynamic subtest: AC-DP2-HDMI-A3
Dynamic subtest AC-DP2-HDMI-A3: SUCCESS (5.366s)
Starting dynamic subtest: AD-DP2-HDMI-A3
Dynamic subtest AD-DP2-HDMI-A3: SUCCESS (5.377s)
Starting dynamic subtest: BC-DP2-HDMI-A3
Dynamic subtest BC-DP2-HDMI-A3: SUCCESS (5.390s)
Starting dynamic subtest: BD-DP2-HDMI-A3
(kms_flip:4233) CRITICAL: Test assertion failure function run_test_step, file ...
(kms_flip:4233) CRITICAL: Failed assertion: end - start < 500
Dynamic subtest BD-DP2-HDMI-A3 failed.
**** DEBUG ****
(kms_flip:4233) igt_fb-DEBUG: igt_create_fb_with_bo_size(width=1920, height=10...
(kms_flip:4233) igt_fb-DEBUG: igt_create_fb_with_bo_size(handle=1, pitch=7680)
(kms_flip:4233) ioctl_wrappers-DEBUG: Test requirement passed: igt_has_fb_modi...
...
igt@kms_flip@2x-flip-vs-expired-vblank
IGT_8299

<6> [199.225464] Console: switching to colour dummy device 80x25
<6> [199.226099] [IGT] kms_flip: executing
<7> [199.234866] xe 0000:03:00.0: [drm:intel_power_well_enable [xe]] enabling ...
<7> [199.252447] xe 0000:03:00.0: [drm:drm_helper_probe_single_connector_modes...
<7> [199.252464] xe 0000:03:00.0: [drm:intel_dp_detect [xe]] [CONNECTOR:241:DP...
<7> [199.256540] xe 0000:03:00.0: [drm:drm_helper_probe_single_connector_modes...
<7> [199.256917] xe 0000:03:00.0: [drm:drm_helper_probe_single_connector_modes...
<7> [199.256927] xe 0000:03:00.0: [drm:intel_hdmi_detect [xe]] [CONNECTOR:254:...
<7> [199.261543] xe 0000:03:00.0: [drm:drm_helper_probe_single_connector_modes...
<7> [199.262154] xe 0000:03:00.0: [drm:drm_helper_probe_single_connector_modes...
<7> [199.262165] xe 0000:03:00.0: [drm:intel_hdmi_detect [xe]] [CONNECTOR:268:...
<7> [199.262460] xe 0000:03:00.0: [drm:do_gmbus_xfer [xe]] GMBUS [i915 gmbus t...
<7> [199.262642] xe 0000:03:00.0: [drm:do_gmbus_xfer [xe]] GMBUS [i915 gmbus t...
<7> [199.263163] xe 0000:03:00.0: [drm:do_gmbus_xfer [xe]] GMBUS [i915 gmbus t...
<7> [199.263251] [drm:drm_do_probe_ddc_edid] drm: skipping non-existent adapte...
<7> [199.263256] xe 0000:03:00.0: [drm:intel_hdmi_set_edid [xe]] HDMI GMBUS ED...
<7> [199.263344] xe 0000:03:00.0: [drm:intel_gmbus_force_bit [xe]] enabling bi...
...
igt@kms_flip@2x-flip-vs-expired-vblank@ab-dp2-hdmi-a3
igt@kms_flip@2x-flip-vs-expired-vblank@ab-dp2-hdmi-a3
IGT_8299

Starting subtest: 2x-flip-vs-expired-vblank
Starting dynamic subtest: AB-DP2-HDMI-A3
(kms_flip:4046) CRITICAL: Test assertion failure function run_test_step, file ...
(kms_flip:4046) CRITICAL: Failed assertion: end - start < 500
Dynamic subtest AB-DP2-HDMI-A3 failed.
**** DEBUG ****
(kms_flip:4046) DEBUG: name = flip
last_ts = 199.761536
last_received_ts = 199.762085
last_seq = 252
current_ts = 199.778198
current_received_ts = 199.777847
current_seq = 253
count = 10
seq_step = 1
(kms_flip:4046) DEBUG: Vblank took 35us
(kms_flip:4046) DEBUG: name = flip
...
igt@kms_flip@2x-flip-vs-expired-vblank@bc-dp2-hdmi-a3
igt@kms_flip@2x-flip-vs-expired-vblank@bc-dp2-hdmi-a3
IGT_8299

Starting dynamic subtest: BC-DP2-HDMI-A3
(kms_flip:4046) CRITICAL: Test assertion failure function run_test_step, file ...
(kms_flip:4046) CRITICAL: Failed assertion: end - start < 500
Dynamic subtest BC-DP2-HDMI-A3 failed.
**** DEBUG ****
(kms_flip:4046) igt_fb-DEBUG: igt_create_fb_with_bo_size(width=1920, height=10...
(kms_flip:4046) igt_fb-DEBUG: igt_create_fb_with_bo_size(handle=3, pitch=7680)
(kms_flip:4046) ioctl_wrappers-DEBUG: Test requirement passed: igt_has_fb_modi...
(kms_flip:4046) igt_fb-DEBUG: igt_create_fb_with_bo_size(width=1920, height=10...
(kms_flip:4046) igt_fb-DEBUG: igt_create_fb_with_bo_size(handle=4, pitch=7680)
(kms_flip:4046) ioctl_wrappers-DEBUG: Test requirement passed: igt_has_fb_modi...
(kms_flip:4046) intel_allocator_simple-DEBUG: Using simple allocator
(kms_flip:4046) intel_allocator_simple-DEBUG: <ial: 0x61250ff21090, fd: 5> obj...
(kms_flip:4046) intel_allocator_simple-DEBUG: <ial: 0x61250ff21090, fd: 5> obj...
(kms_flip:4046) intel_allocator_simple-DEBUG: Using simple allocator
(kms_flip:4046) intel_allocator_simple-DEBUG: <ial: 0x61250ff213f0, fd: 5> obj...
(kms_flip:4046) intel_allocator_simple-DEBUG: <ial: 0x61250ff213f0, fd: 5> obj...
...
igt@kms_flip@2x-flip-vs-expired-vblank@bd-dp2-hdmi-a3
igt@kms_flip@2x-flip-vs-expired-vblank@bd-dp2-hdmi-a3
xe-2897-883e4daea46ff15b470f138ee61573513243210d

Starting dynamic subtest: BD-DP2-HDMI-A3
(kms_flip:4233) CRITICAL: Test assertion failure function run_test_step, file ...
(kms_flip:4233) CRITICAL: Failed assertion: end - start < 500
Dynamic subtest BD-DP2-HDMI-A3 failed.
**** DEBUG ****
(kms_flip:4233) igt_fb-DEBUG: igt_create_fb_with_bo_size(width=1920, height=10...
(kms_flip:4233) igt_fb-DEBUG: igt_create_fb_with_bo_size(handle=1, pitch=7680)
(kms_flip:4233) ioctl_wrappers-DEBUG: Test requirement passed: igt_has_fb_modi...
(kms_flip:4233) igt_fb-DEBUG: igt_create_fb_with_bo_size(width=1920, height=10...
(kms_flip:4233) igt_fb-DEBUG: igt_create_fb_with_bo_size(handle=2, pitch=7680)
(kms_flip:4233) ioctl_wrappers-DEBUG: Test requirement passed: igt_has_fb_modi...
(kms_flip:4233) intel_allocator_simple-DEBUG: Using simple allocator
(kms_flip:4233) intel_allocator_simple-DEBUG: <ial: 0x55f2a0bb2f20, fd: 5> obj...
(kms_flip:4233) intel_allocator_simple-DEBUG: <ial: 0x55f2a0bb2f20, fd: 5> obj...
(kms_flip:4233) intel_allocator_simple-DEBUG: Using simple allocator
(kms_flip:4233) intel_allocator_simple-DEBUG: <ial: 0x55f2a0bb30a0, fd: 5> obj...
(kms_flip:4233) intel_allocator_simple-DEBUG: <ial: 0x55f2a0bb30a0, fd: 5> obj...
...
igt@kms_flip@2x-flip-vs-expired-vblank@bd-dp2-hdmi-a3
IGT_8299

<6> [215.222917] [IGT] kms_flip: starting dynamic subtest BD-DP2-HDMI-A3
<7> [215.223496] xe 0000:03:00.0: [drm:drm_mode_addfb2] [FB:296]
<7> [215.223791] xe 0000:03:00.0: [drm:drm_mode_addfb2] [FB:297]
<7> [215.288885] xe 0000:03:00.0: [drm:drm_mode_setcrtc] [CRTC:82:pipe A]
<7> [215.289443] xe 0000:03:00.0: [drm:drm_mode_setcrtc] [CRTC:134:pipe B]
<7> [215.289568] xe 0000:03:00.0: [drm:intel_pipe_config_compare [xe]] [CRTC:1...
<7> [215.289806] xe 0000:03:00.0: [drm:intel_pipe_config_compare [xe]] [CRTC:1...
<7> [215.290038] xe 0000:03:00.0: [drm:intel_pipe_config_compare [xe]] [CRTC:1...
<7> [215.290233] xe 0000:03:00.0: [drm:intel_pipe_config_compare [xe]] [CRTC:1...
<7> [215.290429] xe 0000:03:00.0: [drm:intel_pipe_config_compare [xe]] [CRTC:1...
<7> [215.290622] xe 0000:03:00.0: [drm:intel_pipe_config_compare [xe]] [CRTC:1...
<7> [215.290799] xe 0000:03:00.0: [drm:intel_pipe_config_compare [xe]] [CRTC:1...
<7> [215.290990] xe 0000:03:00.0: [drm:intel_pipe_config_compare [xe]] [CRTC:1...
<7> [215.291169] xe 0000:03:00.0: [drm:intel_pipe_config_compare [xe]] [CRTC:1...
<7> [215.291342] xe 0000:03:00.0: [drm:intel_pipe_config_compare [xe]] [CRTC:1...
<7> [215.291504] xe 0000:03:00.0: [drm:intel_pipe_config_compare [xe]] [CRTC:1...
<7> [215.291668] xe 0000:03:00.0: [drm:intel_pipe_config_compare [xe]] [CRTC:1...
...
igt@kms_flip@2x-flip-vs-expired-vblank@cd-dp2-hdmi-a3
igt@kms_flip@2x-flip-vs-expired-vblank@cd-dp2-hdmi-a3
xe-2897-883e4daea46ff15b470f138ee61573513243210d

Starting dynamic subtest: CD-DP2-HDMI-A3
(kms_flip:4233) CRITICAL: Test assertion failure function run_test_step, file ...
(kms_flip:4233) CRITICAL: Failed assertion: end - start < 500
Dynamic subtest CD-DP2-HDMI-A3 failed.
**** DEBUG ****
(kms_flip:4233) igt_fb-DEBUG: igt_create_fb_with_bo_size(width=1920, height=10...
(kms_flip:4233) igt_fb-DEBUG: igt_create_fb_with_bo_size(handle=3, pitch=7680)
(kms_flip:4233) ioctl_wrappers-DEBUG: Test requirement passed: igt_has_fb_modi...
(kms_flip:4233) igt_fb-DEBUG: igt_create_fb_with_bo_size(width=1920, height=10...
(kms_flip:4233) igt_fb-DEBUG: igt_create_fb_with_bo_size(handle=4, pitch=7680)
(kms_flip:4233) ioctl_wrappers-DEBUG: Test requirement passed: igt_has_fb_modi...
(kms_flip:4233) intel_allocator_simple-DEBUG: Using simple allocator
(kms_flip:4233) intel_allocator_simple-DEBUG: <ial: 0x55f2a0bb7c20, fd: 5> obj...
(kms_flip:4233) intel_allocator_simple-DEBUG: <ial: 0x55f2a0bb7c20, fd: 5> obj...
(kms_flip:4233) intel_allocator_simple-DEBUG: Using simple allocator
(kms_flip:4233) intel_allocator_simple-DEBUG: <ial: 0x55f2a0bb7c20, fd: 5> obj...
(kms_flip:4233) intel_allocator_simple-DEBUG: <ial: 0x55f2a0bb7c20, fd: 5> obj...
...
igt@kms_flip@2x-flip-vs-expired-vblank-interruptible@ab-dp2-hdmi-a3
igt@kms_flip@2x-flip-vs-expired-vblank-interruptible@ab-dp2-hdmi-a3
xe-2895-0d2ff6d7ad3b6bf64c5c0e9a921fcfa925029526

Starting subtest: 2x-flip-vs-expired-vblank-interruptible
Starting dynamic subtest: AB-DP2-HDMI-A3
(kms_flip:2991) CRITICAL: Test assertion failure function run_test_step, file ...
(kms_flip:2991) CRITICAL: Failed assertion: end - start < 500
(kms_flip:2991) CRITICAL: Last errno: 4, Interrupted system call
Dynamic subtest AB-DP2-HDMI-A3 failed.
**** DEBUG ****
(kms_flip:2991) igt_fb-DEBUG: igt_create_fb_with_bo_size(width=1920, height=10...
(kms_flip:2991) igt_fb-DEBUG: igt_create_fb_with_bo_size(handle=1, pitch=7680)
(kms_flip:2991) ioctl_wrappers-DEBUG: Test requirement passed: igt_has_fb_modi...
(kms_flip:2991) igt_fb-DEBUG: igt_create_fb_with_bo_size(width=1920, height=10...
(kms_flip:2991) igt_fb-DEBUG: igt_create_fb_with_bo_size(handle=2, pitch=7680)
(kms_flip:2991) ioctl_wrappers-DEBUG: Test requirement passed: igt_has_fb_modi...
(kms_flip:2991) intel_allocator_simple-DEBUG: Using simple allocator
(kms_flip:2991) intel_allocator_simple-DEBUG: <ial: 0x5f4830350910, fd: 5> obj...
(kms_flip:2991) intel_allocator_simple-DEBUG: <ial: 0x5f4830350910, fd: 5> obj...
(kms_flip:2991) intel_allocator_simple-DEBUG: Using simple allocator
...
igt@kms_flip@2x-flip-vs-expired-vblank-interruptible@ac-dp2-hdmi-a3
igt@kms_flip@2x-flip-vs-expired-vblank-interruptible@ac-dp2-hdmi-a3
xe-2895-0d2ff6d7ad3b6bf64c5c0e9a921fcfa925029526

Starting dynamic subtest: AC-DP2-HDMI-A3
(kms_flip:2991) CRITICAL: Test assertion failure function run_test_step, file ...
(kms_flip:2991) CRITICAL: Failed assertion: end - start < 500
(kms_flip:2991) CRITICAL: Last errno: 4, Interrupted system call
Dynamic subtest AC-DP2-HDMI-A3 failed.
**** DEBUG ****
(kms_flip:2991) igt_fb-DEBUG: igt_create_fb_with_bo_size(width=1920, height=10...
(kms_flip:2991) igt_fb-DEBUG: igt_create_fb_with_bo_size(handle=3, pitch=7680)
(kms_flip:2991) ioctl_wrappers-DEBUG: Test requirement passed: igt_has_fb_modi...
(kms_flip:2991) igt_fb-DEBUG: igt_create_fb_with_bo_size(width=1920, height=10...
(kms_flip:2991) igt_fb-DEBUG: igt_create_fb_with_bo_size(handle=4, pitch=7680)
(kms_flip:2991) ioctl_wrappers-DEBUG: Test requirement passed: igt_has_fb_modi...
(kms_flip:2991) intel_allocator_simple-DEBUG: Using simple allocator
(kms_flip:2991) intel_allocator_simple-DEBUG: <ial: 0x5f48303621a0, fd: 5> obj...
(kms_flip:2991) intel_allocator_simple-DEBUG: <ial: 0x5f48303621a0, fd: 5> obj...
(kms_flip:2991) intel_allocator_simple-DEBUG: Using simple allocator
(kms_flip:2991) intel_allocator_simple-DEBUG: <ial: 0x5f48303621a0, fd: 5> obj...
...
igt@kms_flip@2x-flip-vs-expired-vblank-interruptible@bd-dp2-hdmi-a3
igt@kms_flip@2x-flip-vs-expired-vblank-interruptible@bd-dp2-hdmi-a3
xe-2895-0d2ff6d7ad3b6bf64c5c0e9a921fcfa925029526

Starting dynamic subtest: BD-DP2-HDMI-A3
(kms_flip:2991) CRITICAL: Test assertion failure function run_test_step, file ...
(kms_flip:2991) CRITICAL: Failed assertion: end - start < 500
(kms_flip:2991) CRITICAL: Last errno: 4, Interrupted system call
Dynamic subtest BD-DP2-HDMI-A3 failed.
**** DEBUG ****
(kms_flip:2991) DEBUG: Vblank took 39us
(kms_flip:2991) DEBUG: name = flip
last_ts = 125.565208
last_received_ts = 125.564674
last_seq = 2781
current_ts = 125.581871
current_received_ts = 125.581284
current_seq = 2782
count = 60
seq_step = 1
(kms_flip:2991) DEBUG: Vblank took 27us
...
igt@kms_flip@2x-flip-vs-expired-vblank-interruptible@cd-dp2-hdmi-a3
igt@kms_flip@2x-flip-vs-expired-vblank-interruptible@cd-dp2-hdmi-a3
xe-2895-0d2ff6d7ad3b6bf64c5c0e9a921fcfa925029526

Starting dynamic subtest: CD-DP2-HDMI-A3
(kms_flip:2991) CRITICAL: Test assertion failure function run_test_step, file ...
(kms_flip:2991) CRITICAL: Failed assertion: end - start < 500
(kms_flip:2991) CRITICAL: Last errno: 4, Interrupted system call
Dynamic subtest CD-DP2-HDMI-A3 failed.
**** DEBUG ****
(kms_flip:2991) igt_fb-DEBUG: igt_create_fb_with_bo_size(width=1920, height=10...
(kms_flip:2991) igt_fb-DEBUG: igt_create_fb_with_bo_size(handle=7, pitch=7680)
(kms_flip:2991) ioctl_wrappers-DEBUG: Test requirement passed: igt_has_fb_modi...
(kms_flip:2991) igt_fb-DEBUG: igt_create_fb_with_bo_size(width=1920, height=10...
(kms_flip:2991) igt_fb-DEBUG: igt_create_fb_with_bo_size(handle=8, pitch=7680)
(kms_flip:2991) ioctl_wrappers-DEBUG: Test requirement passed: igt_has_fb_modi...
(kms_flip:2991) intel_allocator_simple-DEBUG: Using simple allocator
(kms_flip:2991) intel_allocator_simple-DEBUG: <ial: 0x5f483039f3e0, fd: 5> obj...
(kms_flip:2991) intel_allocator_simple-DEBUG: <ial: 0x5f483039f3e0, fd: 5> obj...
(kms_flip:2991) intel_allocator_simple-DEBUG: Using simple allocator
(kms_flip:2991) intel_allocator_simple-DEBUG: <ial: 0x5f48303e4e80, fd: 5> obj...
...
Created at 2025-04-03 17:27:46