FAIL WARN PASS SKIP TIMEOUT NOT RUN INCOMPLETE ABORT CRASH
 
xe-2899-8f917568adaeea8b649e337e7d0e03bd03332253 xe-2895-0d2ff6d7ad3b6bf64c5c0e9a921fcfa925029526
igt@kms_setmode@invalid-clone-single-crtc-stealing
igt@kms_setmode@invalid-clone-single-crtc-stealing
xe-2899-8f917568adaeea8b649e337e7d0e03bd03332253

Starting subtest: invalid-clone-single-crtc-stealing
Starting dynamic subtest: pipe-A-eDP-1-DP-1
Dynamic subtest pipe-A-eDP-1-DP-1: SUCCESS (1.071s)
Starting dynamic subtest: pipe-B-eDP-1-DP-1
Dynamic subtest pipe-B-eDP-1-DP-1: SUCCESS (1.037s)
Starting dynamic subtest: pipe-A-eDP-1-DP-2
(kms_setmode:4679) CRITICAL: Test assertion failure function test_stealing, fi...
(kms_setmode:4679) CRITICAL: Failed assertion: ret == 0
(kms_setmode:4679) CRITICAL: Last errno: 22, Invalid argument
(kms_setmode:4679) CRITICAL: error: -22 != 0
Dynamic subtest pipe-A-eDP-1-DP-2 failed.
**** DEBUG ****
(kms_setmode:4679) INFO:   Test id#3 CRTC count 1
(kms_setmode:4679) INFO:     CRTC[82] [Pipe A] Mode: 3840x2160@30Hz Connectors...
(kms_setmode:4679) igt_fb-DEBUG: igt_create_fb_with_bo_size(width=3840, height...
(kms_setmode:4679) igt_fb-DEBUG: igt_create_fb_with_bo_size(handle=4, pitch=15...
(kms_setmode:4679) ioctl_wrappers-DEBUG: Test requirement passed: igt_has_fb_m...
...
igt@kms_setmode@invalid-clone-single-crtc-stealing
xe-2895-0d2ff6d7ad3b6bf64c5c0e9a921fcfa925029526

Starting subtest: invalid-clone-single-crtc-stealing
Starting dynamic subtest: pipe-A-eDP-1-DP-1
Dynamic subtest pipe-A-eDP-1-DP-1: SUCCESS (0.990s)
Starting dynamic subtest: pipe-B-eDP-1-DP-1
Dynamic subtest pipe-B-eDP-1-DP-1: SUCCESS (0.985s)
Starting dynamic subtest: pipe-A-eDP-1-DP-2
(kms_setmode:12650) CRITICAL: Test assertion failure function test_stealing, f...
(kms_setmode:12650) CRITICAL: Failed assertion: ret == 0
(kms_setmode:12650) CRITICAL: Last errno: 22, Invalid argument
(kms_setmode:12650) CRITICAL: error: -22 != 0
Dynamic subtest pipe-A-eDP-1-DP-2 failed.
**** DEBUG ****
(kms_setmode:12650) INFO:   Test id#3 CRTC count 1
(kms_setmode:12650) INFO:     CRTC[82] [Pipe A] Mode: 3840x2160@30Hz Connector...
(kms_setmode:12650) igt_fb-DEBUG: igt_create_fb_with_bo_size(width=3840, heigh...
(kms_setmode:12650) igt_fb-DEBUG: igt_create_fb_with_bo_size(handle=4, pitch=1...
(kms_setmode:12650) ioctl_wrappers-DEBUG: Test requirement passed: igt_has_fb_...
...
igt@kms_plane_cursor@primary
igt@kms_plane_cursor@primary
xe-2895-0d2ff6d7ad3b6bf64c5c0e9a921fcfa925029526

Starting subtest: primary
Starting dynamic subtest: pipe-A-eDP-1-size-64
Dynamic subtest pipe-A-eDP-1-size-64: SUCCESS (4.283s)
Starting dynamic subtest: pipe-A-eDP-1-size-128
Dynamic subtest pipe-A-eDP-1-size-128: SUCCESS (4.132s)
Starting dynamic subtest: pipe-A-eDP-1-size-256
Dynamic subtest pipe-A-eDP-1-size-256: SUCCESS (4.115s)
Starting dynamic subtest: pipe-B-DP-1-size-64
(kms_plane_cursor:10661) igt_pipe_crc-CRITICAL: Test assertion failure functio...
(kms_plane_cursor:10661) igt_pipe_crc-CRITICAL: Failed assertion: !mismatch ||...
Dynamic subtest pipe-B-DP-1-size-64 failed.
**** DEBUG ****
(kms_plane_cursor:10661) igt_kms-DEBUG: plane B.4: Setting property "SRC_Y" to...
(kms_plane_cursor:10661) igt_kms-DEBUG: plane B.4: Setting property "SRC_W" to...
(kms_plane_cursor:10661) igt_kms-DEBUG: plane B.4: Setting property "SRC_H" to...
(kms_plane_cursor:10661) igt_kms-DEBUG: plane B.4: Setting property "CRTC_X" t...
(kms_plane_cursor:10661) igt_kms-DEBUG: plane B.4: Setting property "CRTC_Y" t...
...
igt@kms_flip_scaled_crc@flip-64bpp-xtile-to-32bpp-xtile-upscaling
igt@kms_flip_scaled_crc@flip-64bpp-xtile-to-32bpp-xtile-upscaling
xe-2899-8f917568adaeea8b649e337e7d0e03bd03332253

Starting subtest: flip-64bpp-xtile-to-32bpp-xtile-upscaling
Starting dynamic subtest: pipe-A-valid-mode
(kms_flip_scaled_crc:2798) igt_pipe_crc-CRITICAL: Test assertion failure funct...
(kms_flip_scaled_crc:2798) igt_pipe_crc-CRITICAL: Failed assertion: !mismatch ...
Dynamic subtest pipe-A-valid-mode failed.
**** DEBUG ****
    populating plane data: C.0, fb 0
(kms_flip_scaled_crc:2798) igt_kms-DEBUG: plane C.0: Setting property "SRC_X" ...
(kms_flip_scaled_crc:2798) igt_kms-DEBUG: plane C.0: Setting property "SRC_Y" ...
(kms_flip_scaled_crc:2798) igt_kms-DEBUG: plane C.0: Setting property "SRC_W" ...
(kms_flip_scaled_crc:2798) igt_kms-DEBUG: plane C.0: Setting property "SRC_H" ...
(kms_flip_scaled_crc:2798) igt_kms-DEBUG: plane C.0: Setting property "CRTC_X"...
(kms_flip_scaled_crc:2798) igt_kms-DEBUG: plane C.0: Setting property "CRTC_Y"...
(kms_flip_scaled_crc:2798) igt_kms-DEBUG: plane C.0: Setting property "CRTC_W"...
(kms_flip_scaled_crc:2798) igt_kms-DEBUG: plane C.0: Setting property "CRTC_H"...
(kms_flip_scaled_crc:2798) igt_kms-DEBUG: plane C.0: Setting property "FB_ID" ...
(kms_flip_scaled_crc:2798) igt_kms-DEBUG: plane C.0: Setting property "CRTC_ID...
...
igt@kms_flip_scaled_crc@flip-64bpp-xtile-to-32bpp-xtile-upscaling@pipe-a-valid-mode
igt@kms_flip_scaled_crc@flip-64bpp-xtile-to-32bpp-xtile-upscaling@pipe-a-valid-mode
xe-2899-8f917568adaeea8b649e337e7d0e03bd03332253

Starting subtest: flip-64bpp-xtile-to-32bpp-xtile-upscaling
Starting dynamic subtest: pipe-A-valid-mode
(kms_flip_scaled_crc:2798) igt_pipe_crc-CRITICAL: Test assertion failure funct...
(kms_flip_scaled_crc:2798) igt_pipe_crc-CRITICAL: Failed assertion: !mismatch ...
Dynamic subtest pipe-A-valid-mode failed.
**** DEBUG ****
    populating plane data: C.0, fb 0
(kms_flip_scaled_crc:2798) igt_kms-DEBUG: plane C.0: Setting property "SRC_X" ...
(kms_flip_scaled_crc:2798) igt_kms-DEBUG: plane C.0: Setting property "SRC_Y" ...
(kms_flip_scaled_crc:2798) igt_kms-DEBUG: plane C.0: Setting property "SRC_W" ...
(kms_flip_scaled_crc:2798) igt_kms-DEBUG: plane C.0: Setting property "SRC_H" ...
(kms_flip_scaled_crc:2798) igt_kms-DEBUG: plane C.0: Setting property "CRTC_X"...
(kms_flip_scaled_crc:2798) igt_kms-DEBUG: plane C.0: Setting property "CRTC_Y"...
(kms_flip_scaled_crc:2798) igt_kms-DEBUG: plane C.0: Setting property "CRTC_W"...
(kms_flip_scaled_crc:2798) igt_kms-DEBUG: plane C.0: Setting property "CRTC_H"...
(kms_flip_scaled_crc:2798) igt_kms-DEBUG: plane C.0: Setting property "FB_ID" ...
(kms_flip_scaled_crc:2798) igt_kms-DEBUG: plane C.0: Setting property "CRTC_ID...
...
igt@kms_plane_lowres@tiling-x
igt@kms_plane_lowres@tiling-x
xe-2899-8f917568adaeea8b649e337e7d0e03bd03332253

Starting subtest: tiling-x
Starting dynamic subtest: pipe-A-eDP-1
Dynamic subtest pipe-A-eDP-1: SKIP (0.000s)
Starting dynamic subtest: pipe-A-DP-1
(kms_plane_lowres:3313) igt_pipe_crc-CRITICAL: Test assertion failure function...
(kms_plane_lowres:3313) igt_pipe_crc-CRITICAL: Failed assertion: !mismatch || ...
Dynamic subtest pipe-A-DP-1 failed.
**** DEBUG ****
(kms_plane_lowres:3313) igt_kms-DEBUG: plane C.5: Setting property "SRC_X" to ...
(kms_plane_lowres:3313) igt_kms-DEBUG: plane C.5: Setting property "SRC_Y" to ...
(kms_plane_lowres:3313) igt_kms-DEBUG: plane C.5: Setting property "SRC_W" to ...
(kms_plane_lowres:3313) igt_kms-DEBUG: plane C.5: Setting property "SRC_H" to ...
(kms_plane_lowres:3313) igt_kms-DEBUG: plane C.5: Setting property "CRTC_X" to...
(kms_plane_lowres:3313) igt_kms-DEBUG: plane C.5: Setting property "CRTC_Y" to...
(kms_plane_lowres:3313) igt_kms-DEBUG: plane C.5: Setting property "CRTC_W" to...
(kms_plane_lowres:3313) igt_kms-DEBUG: plane C.5: Setting property "CRTC_H" to...
(kms_plane_lowres:3313) igt_kms-DEBUG: plane C.5: Setting property "FB_ID" to ...
...
igt@kms_flip@2x-flip-vs-wf_vblank
igt@kms_flip@2x-flip-vs-wf_vblank
xe-2899-8f917568adaeea8b649e337e7d0e03bd03332253

Starting subtest: 2x-flip-vs-wf_vblank
Starting dynamic subtest: AB-DP1-DP2
(kms_flip:2705) CRITICAL: Test assertion failure function calibrate_ts, file ....
(kms_flip:2705) CRITICAL: Failed assertion: 3 * stddev / mean < 0.005
Dynamic subtest AB-DP1-DP2 failed.
**** DEBUG ****
(kms_flip:2705) igt_fb-DEBUG: igt_create_fb_with_bo_size(width=3840, height=21...
(kms_flip:2705) igt_fb-DEBUG: igt_create_fb_with_bo_size(handle=1, pitch=15360)
(kms_flip:2705) ioctl_wrappers-DEBUG: Test requirement passed: igt_has_fb_modi...
(kms_flip:2705) igt_fb-DEBUG: igt_create_fb_with_bo_size(width=3840, height=21...
(kms_flip:2705) igt_fb-DEBUG: igt_create_fb_with_bo_size(handle=2, pitch=15360)
(kms_flip:2705) ioctl_wrappers-DEBUG: Test requirement passed: igt_has_fb_modi...
(kms_flip:2705) igt_fb-DEBUG: Test requirement passed: cairo_surface_status(fb...
(kms_flip:2705) igt_fb-DEBUG: Test requirement passed: cairo_surface_status(fb...
(kms_flip:2705) igt_kms-INFO:   3840x2160: 30 262750 3840 3888 3920 4000 2160 ...
(kms_flip:2705) igt_kms-INFO:   3840x2160: 30 297000 3840 4016 4104 4400 2160 ...
(kms_flip:2705) DEBUG: No stale events found
...
igt@kms_pm_dc@dc6-dpms
igt@kms_pm_dc@dc6-dpms
xe-2899-8f917568adaeea8b649e337e7d0e03bd03332253

Starting subtest: dc6-dpms
(kms_pm_dc:5674) CRITICAL: Test assertion failure function test_pkgc_state_dpm...
(kms_pm_dc:5674) CRITICAL: Failed assertion: cur_value > prev_value
(kms_pm_dc:5674) CRITICAL: PKGC10 is not achieved.
Subtest dc6-dpms failed.
**** DEBUG ****
(kms_pm_dc:5674) DEBUG: Test requirement passed: igt_pm_pc8_plus_residencies_e...
(kms_pm_dc:5674) DEBUG: Test requirement passed: !(len < 0)
(kms_pm_dc:5674) DEBUG: Test requirement passed: !(!str)
(kms_pm_dc:5674) DEBUG: Test requirement passed: !(len < 0)
(kms_pm_dc:5674) DEBUG: Test requirement passed: !(!str)
(kms_pm_dc:5674) DEBUG: Test requirement passed: !(len < 0)
(kms_pm_dc:5674) DEBUG: Test requirement passed: !(!str)
(kms_pm_dc:5674) DEBUG: Test requirement passed: !(len < 0)
(kms_pm_dc:5674) DEBUG: Test requirement passed: !(!str)
(kms_pm_dc:5674) DEBUG: Test requirement passed: !(len < 0)
(kms_pm_dc:5674) DEBUG: Test requirement passed: !(!str)
...
igt@kms_pm_dc@dc6-dpms
xe-2895-0d2ff6d7ad3b6bf64c5c0e9a921fcfa925029526

Starting subtest: dc6-dpms
(kms_pm_dc:13542) CRITICAL: Test assertion failure function test_pkgc_state_dp...
(kms_pm_dc:13542) CRITICAL: Failed assertion: cur_value > prev_value
(kms_pm_dc:13542) CRITICAL: PKGC10 is not achieved.
Subtest dc6-dpms failed.
**** DEBUG ****
(kms_pm_dc:13542) DEBUG: Test requirement passed: igt_pm_pc8_plus_residencies_...
(kms_pm_dc:13542) DEBUG: Test requirement passed: !(len < 0)
(kms_pm_dc:13542) DEBUG: Test requirement passed: !(!str)
(kms_pm_dc:13542) DEBUG: Test requirement passed: !(len < 0)
(kms_pm_dc:13542) DEBUG: Test requirement passed: !(!str)
(kms_pm_dc:13542) DEBUG: Test requirement passed: !(len < 0)
(kms_pm_dc:13542) DEBUG: Test requirement passed: !(!str)
(kms_pm_dc:13542) DEBUG: Test requirement passed: !(len < 0)
(kms_pm_dc:13542) DEBUG: Test requirement passed: !(!str)
(kms_pm_dc:13542) DEBUG: Test requirement passed: !(len < 0)
(kms_pm_dc:13542) DEBUG: Test requirement passed: !(!str)
...
igt@kms_plane_multiple@2x-tiling-x
D igt@kms_plane_multiple@2x-tiling-x
xe-2899-8f917568adaeea8b649e337e7d0e03bd03332253

<3> [325.771390] [drm:drm_crtc_add_crc_entry] *ERROR* Overflow of CRC buffer, ...
<3> [329.598434] [drm:drm_crtc_add_crc_entry] *ERROR* Overflow of CRC buffer, ...
<3> [354.943343] [drm:drm_crtc_add_crc_entry] *ERROR* Overflow of CRC buffer, ...
<3> [359.971263] [drm:drm_crtc_add_crc_entry] *ERROR* Overflow of CRC buffer, ...
<3> [368.660793] [drm:drm_crtc_add_crc_entry] *ERROR* Overflow of CRC buffer, ...
<3> [378.374363] [drm:drm_crtc_add_crc_entry] *ERROR* Overflow of CRC buffer, ...
<3> [384.357969] [drm:drm_crtc_add_crc_entry] *ERROR* Overflow of CRC buffer, ...
<3> [390.453171] [drm:drm_crtc_add_crc_entry] *ERROR* Overflow of CRC buffer, ...
<3> [398.692259] [drm:drm_crtc_add_crc_entry] *ERROR* Overflow of CRC buffer, ...
igt@kms_content_protection@uevent
igt@kms_content_protection@uevent
xe-2895-0d2ff6d7ad3b6bf64c5c0e9a921fcfa925029526

Starting subtest: uevent
Starting dynamic subtest: pipe-A-DP-1
(kms_content_protection:5628) CRITICAL: Test assertion failure function wait_f...
(kms_content_protection:5628) CRITICAL: Failed assertion: igt_connector_event_...
(kms_content_protection:5628) CRITICAL: uevent is not receivedDynamic subtest ...
**** DEBUG ****
(kms_content_protection:5628) igt_kms-DEBUG: Test requirement passed: plane_id...
(kms_content_protection:5628) igt_kms-DEBUG: display: A.0: plane_set_fb(227)
(kms_content_protection:5628) igt_kms-DEBUG: display: A.0: plane_set_size (384...
(kms_content_protection:5628) igt_kms-DEBUG: display: A.0: fb_set_position(0,0)
(kms_content_protection:5628) igt_kms-DEBUG: display: A.0: fb_set_size(3840x21...
(kms_content_protection:5628) igt_kms-DEBUG: display: commit {
(kms_content_protection:5628) igt_kms-DEBUG: display:     populating plane dat...
(kms_content_protection:5628) igt_kms-DEBUG: plane A.0: Setting property "SRC_...
(kms_content_protection:5628) igt_kms-DEBUG: plane A.0: Setting property "SRC_...
(kms_content_protection:5628) igt_kms-DEBUG: plane A.0: Setting property "SRC_...
(kms_content_protection:5628) igt_kms-DEBUG: plane A.0: Setting property "SRC_...
...
igt@kms_flip@flip-vs-expired-vblank-interruptible
igt@kms_flip@flip-vs-expired-vblank-interruptible
xe-2895-0d2ff6d7ad3b6bf64c5c0e9a921fcfa925029526

Starting subtest: flip-vs-expired-vblank-interruptible
Starting dynamic subtest: A-eDP1
Dynamic subtest A-eDP1: SUCCESS (4.633s)
Starting dynamic subtest: B-eDP1
Dynamic subtest B-eDP1: SUCCESS (4.645s)
Starting dynamic subtest: C-eDP1
Dynamic subtest C-eDP1: SUCCESS (4.663s)
Starting dynamic subtest: A-DP1
Dynamic subtest A-DP1: SUCCESS (3.942s)
Starting dynamic subtest: B-DP1
Dynamic subtest B-DP1: SUCCESS (3.677s)
Starting dynamic subtest: C-DP1
(kms_flip:2264) CRITICAL: Test assertion failure function run_test_step, file ...
(kms_flip:2264) CRITICAL: Failed assertion: end - start < 500
(kms_flip:2264) CRITICAL: Last errno: 4, Interrupted system call
Dynamic subtest C-DP1 failed.
**** DEBUG ****
...
igt@kms_vrr@cmrr
igt@kms_vrr@cmrr
xe-2899-8f917568adaeea8b649e337e7d0e03bd03332253

Starting subtest: cmrr
Starting dynamic subtest: pipe-A-eDP-1
(kms_vrr:2706) CRITICAL: Test assertion failure function test_cmrr, file ../te...
(kms_vrr:2706) CRITICAL: Failed assertion: result > 75
(kms_vrr:2706) CRITICAL: Refresh rate (60 Hz) 16666666ns: Target CMRR on thres...
Dynamic subtest pipe-A-eDP-1 failed.
**** DEBUG ****
(kms_vrr:2706) igt_kms-DEBUG: plane A.0: Setting property "CRTC_H" to 0x708/1800
(kms_vrr:2706) igt_kms-DEBUG: plane A.0: Setting property "FB_ID" to 0xe1/225
(kms_vrr:2706) igt_kms-DEBUG: plane A.0: Setting property "CRTC_ID" to 0x52/82
(kms_vrr:2706) igt_kms-DEBUG: plane A.0: Setting property "COLOR_ENCODING" to ...
(kms_vrr:2706) igt_kms-DEBUG: plane A.0: Setting property "COLOR_RANGE" to 0x0/0
(kms_vrr:2706) igt_kms-DEBUG: display: }
(kms_vrr:2706) DEBUG: event_ns - last_event_ns: 33337000 ns (30.00 Hz)
(kms_vrr:2706) igt_kms-DEBUG: display: A.0: plane_set_fb(226)
(kms_vrr:2706) igt_kms-DEBUG: display: A.0: plane_set_size (2880x1800)
(kms_vrr:2706) igt_kms-DEBUG: display: A.0: fb_set_position(0,0)
...
igt@kms_pm_dc@deep-pkgc
igt@kms_pm_dc@deep-pkgc
xe-2899-8f917568adaeea8b649e337e7d0e03bd03332253

Starting subtest: deep-pkgc
(kms_pm_dc:5693) CRITICAL: Test assertion failure function test_deep_pkgc_stat...
(kms_pm_dc:5693) CRITICAL: Failed assertion: pkgc_flag
(kms_pm_dc:5693) CRITICAL: PKGC10 is not achieved.
Subtest deep-pkgc failed.
**** DEBUG ****
(kms_pm_dc:5693) igt_kms-DEBUG: display:     SetProp plane B.3 "SCALING_FILTER...
(kms_pm_dc:5693) igt_kms-DEBUG: Test requirement passed: plane_idx >= 0 && pla...
(kms_pm_dc:5693) igt_kms-DEBUG: display:     Fixing up initial rotation pipe B...
(kms_pm_dc:5693) igt_kms-DEBUG: display:     SetPlane pipe B, plane 4, disabling
(kms_pm_dc:5693) igt_kms-DEBUG: display:     SetProp plane B.4 "rotation" to 0...
(kms_pm_dc:5693) igt_kms-DEBUG: display:     SetProp plane B.4 "COLOR_ENCODING...
(kms_pm_dc:5693) igt_kms-DEBUG: display:     SetProp plane B.4 "COLOR_RANGE" t...
(kms_pm_dc:5693) igt_kms-DEBUG: display:     SetProp plane B.4 "pixel blend mo...
(kms_pm_dc:5693) igt_kms-DEBUG: display:     SetProp plane B.4 "alpha" to 0xff...
(kms_pm_dc:5693) igt_kms-DEBUG: display:     SetProp plane B.4 "FB_DAMAGE_CLIP...
(kms_pm_dc:5693) igt_kms-DEBUG: display:     SetProp plane B.4 "SCALING_FILTER...
...
igt@kms_pm_dc@deep-pkgc
xe-2895-0d2ff6d7ad3b6bf64c5c0e9a921fcfa925029526

Starting subtest: deep-pkgc
(kms_pm_dc:13567) CRITICAL: Test assertion failure function test_deep_pkgc_sta...
(kms_pm_dc:13567) CRITICAL: Failed assertion: pkgc_flag
(kms_pm_dc:13567) CRITICAL: PKGC10 is not achieved.
Subtest deep-pkgc failed.
**** DEBUG ****
(kms_pm_dc:13567) igt_kms-DEBUG: display:     SetProp plane B.3 "SCALING_FILTE...
(kms_pm_dc:13567) igt_kms-DEBUG: Test requirement passed: plane_idx >= 0 && pl...
(kms_pm_dc:13567) igt_kms-DEBUG: display:     Fixing up initial rotation pipe ...
(kms_pm_dc:13567) igt_kms-DEBUG: display:     SetPlane pipe B, plane 4, disabl...
(kms_pm_dc:13567) igt_kms-DEBUG: display:     SetProp plane B.4 "rotation" to ...
(kms_pm_dc:13567) igt_kms-DEBUG: display:     SetProp plane B.4 "COLOR_ENCODIN...
(kms_pm_dc:13567) igt_kms-DEBUG: display:     SetProp plane B.4 "COLOR_RANGE" ...
(kms_pm_dc:13567) igt_kms-DEBUG: display:     SetProp plane B.4 "pixel blend m...
(kms_pm_dc:13567) igt_kms-DEBUG: display:     SetProp plane B.4 "alpha" to 0xf...
(kms_pm_dc:13567) igt_kms-DEBUG: display:     SetProp plane B.4 "FB_DAMAGE_CLI...
(kms_pm_dc:13567) igt_kms-DEBUG: display:     SetProp plane B.4 "SCALING_FILTE...
...
igt@intel_sysfs_debugfs@xe-forcewake
D igt@intel_sysfs_debugfs@xe-forcewake
xe-2895-0d2ff6d7ad3b6bf64c5c0e9a921fcfa925029526

<3> [64.791856] xe 0000:00:02.0: [drm] *ERROR* GT1: Force wake domain 3 failed...
<3> [64.842114] xe 0000:00:02.0: [drm] *ERROR* GT1: Force wake domain 11 faile...
<3> [64.892119] xe 0000:00:02.0: [drm] *ERROR* GT1: Force wake domain 15 faile...
<4> [64.892169] xe 0000:00:02.0: [drm] GT1: Forcewake domains 0x8808 failed to...
<4> [64.892289] Modules linked in: snd_hda_codec_hdmi xe drm_gpuvm drm_gpusvm ...
<4> [64.892405] CPU: 3 UID: 0 PID: 2080 Comm: intel_sysfs_deb Tainted: G     U...
igt@intel_sysfs_debugfs@xe-debugfs-read-all-entries-display-off
D igt@intel_sysfs_debugfs@xe-debugfs-read-all-entries-display-off
xe-2895-0d2ff6d7ad3b6bf64c5c0e9a921fcfa925029526

<3> [67.224745] xe 0000:00:02.0: [drm] *ERROR* GT1: Force wake domain 15 faile...
<4> [67.225703] xe 0000:00:02.0: [drm] GT1: Forcewake domain 0x8000 failed to ...
<4> [67.225879] Modules linked in: snd_hda_codec_hdmi xe drm_gpuvm drm_gpusvm ...
<3> [68.232613] xe 0000:00:02.0: [drm] *ERROR* failed to submit GSC PXP messag...
<3> [68.232636] xe 0000:00:02.0: [drm] *ERROR* Failed to invalidate PXP stream...
<3> [68.232645] xe 0000:00:02.0: [drm] *ERROR* PXP termination failed: -ETIME
<3> [68.232665] xe 0000:00:02.0: [drm] *ERROR* PXP termination complete while ...
igt@kms_plane_lowres@tiling-x@pipe-a-dp-2
igt@kms_plane_lowres@tiling-x@pipe-a-dp-2
xe-2899-8f917568adaeea8b649e337e7d0e03bd03332253

Starting dynamic subtest: pipe-A-DP-2
(kms_plane_lowres:3313) igt_pipe_crc-CRITICAL: Test assertion failure function...
(kms_plane_lowres:3313) igt_pipe_crc-CRITICAL: Failed assertion: !mismatch || ...
Dynamic subtest pipe-A-DP-2 failed.
**** DEBUG ****
(kms_plane_lowres:3313) igt_kms-DEBUG: plane C.5: Setting property "SRC_X" to ...
(kms_plane_lowres:3313) igt_kms-DEBUG: plane C.5: Setting property "SRC_Y" to ...
(kms_plane_lowres:3313) igt_kms-DEBUG: plane C.5: Setting property "SRC_W" to ...
(kms_plane_lowres:3313) igt_kms-DEBUG: plane C.5: Setting property "SRC_H" to ...
(kms_plane_lowres:3313) igt_kms-DEBUG: plane C.5: Setting property "CRTC_X" to...
(kms_plane_lowres:3313) igt_kms-DEBUG: plane C.5: Setting property "CRTC_Y" to...
(kms_plane_lowres:3313) igt_kms-DEBUG: plane C.5: Setting property "CRTC_W" to...
(kms_plane_lowres:3313) igt_kms-DEBUG: plane C.5: Setting property "CRTC_H" to...
(kms_plane_lowres:3313) igt_kms-DEBUG: plane C.5: Setting property "FB_ID" to ...
(kms_plane_lowres:3313) igt_kms-DEBUG: plane C.5: Setting property "CRTC_ID" t...
(kms_plane_lowres:3313) igt_kms-DEBUG: plane C.5: Setting property "rotation" ...
(kms_plane_lowres:3313) igt_kms-DEBUG: plane C.5: Setting property "FB_DAMAGE_...
...
igt@kms_plane_lowres@tiling-x@pipe-b-dp-2
igt@kms_plane_lowres@tiling-x@pipe-b-dp-2
xe-2899-8f917568adaeea8b649e337e7d0e03bd03332253

Starting dynamic subtest: pipe-B-DP-2
(kms_plane_lowres:3313) igt_pipe_crc-CRITICAL: Test assertion failure function...
(kms_plane_lowres:3313) igt_pipe_crc-CRITICAL: Failed assertion: !mismatch || ...
Dynamic subtest pipe-B-DP-2 failed.
**** DEBUG ****
(kms_plane_lowres:3313) igt_kms-DEBUG: plane C.5: Setting property "SRC_X" to ...
(kms_plane_lowres:3313) igt_kms-DEBUG: plane C.5: Setting property "SRC_Y" to ...
(kms_plane_lowres:3313) igt_kms-DEBUG: plane C.5: Setting property "SRC_W" to ...
(kms_plane_lowres:3313) igt_kms-DEBUG: plane C.5: Setting property "SRC_H" to ...
(kms_plane_lowres:3313) igt_kms-DEBUG: plane C.5: Setting property "CRTC_X" to...
(kms_plane_lowres:3313) igt_kms-DEBUG: plane C.5: Setting property "CRTC_Y" to...
(kms_plane_lowres:3313) igt_kms-DEBUG: plane C.5: Setting property "CRTC_W" to...
(kms_plane_lowres:3313) igt_kms-DEBUG: plane C.5: Setting property "CRTC_H" to...
(kms_plane_lowres:3313) igt_kms-DEBUG: plane C.5: Setting property "FB_ID" to ...
(kms_plane_lowres:3313) igt_kms-DEBUG: plane C.5: Setting property "CRTC_ID" t...
(kms_plane_lowres:3313) igt_kms-DEBUG: plane C.5: Setting property "rotation" ...
(kms_plane_lowres:3313) igt_kms-DEBUG: plane C.5: Setting property "FB_DAMAGE_...
...
igt@kms_plane_lowres@tiling-x@pipe-c-dp-2
igt@kms_plane_lowres@tiling-x@pipe-c-dp-2
xe-2899-8f917568adaeea8b649e337e7d0e03bd03332253

Starting dynamic subtest: pipe-C-DP-2
(kms_plane_lowres:3313) igt_pipe_crc-CRITICAL: Test assertion failure function...
(kms_plane_lowres:3313) igt_pipe_crc-CRITICAL: Failed assertion: !mismatch || ...
Dynamic subtest pipe-C-DP-2 failed.
**** DEBUG ****
(kms_plane_lowres:3313) igt_kms-DEBUG: plane C.5: Setting property "SRC_X" to ...
(kms_plane_lowres:3313) igt_kms-DEBUG: plane C.5: Setting property "SRC_Y" to ...
(kms_plane_lowres:3313) igt_kms-DEBUG: plane C.5: Setting property "SRC_W" to ...
(kms_plane_lowres:3313) igt_kms-DEBUG: plane C.5: Setting property "SRC_H" to ...
(kms_plane_lowres:3313) igt_kms-DEBUG: plane C.5: Setting property "CRTC_X" to...
(kms_plane_lowres:3313) igt_kms-DEBUG: plane C.5: Setting property "CRTC_Y" to...
(kms_plane_lowres:3313) igt_kms-DEBUG: plane C.5: Setting property "CRTC_W" to...
(kms_plane_lowres:3313) igt_kms-DEBUG: plane C.5: Setting property "CRTC_H" to...
(kms_plane_lowres:3313) igt_kms-DEBUG: plane C.5: Setting property "FB_ID" to ...
(kms_plane_lowres:3313) igt_kms-DEBUG: plane C.5: Setting property "CRTC_ID" t...
(kms_plane_lowres:3313) igt_kms-DEBUG: plane C.5: Setting property "rotation" ...
(kms_plane_lowres:3313) igt_kms-DEBUG: plane C.5: Setting property "FB_DAMAGE_...
...
igt@kms_atomic_transition@plane-all-modeset-transition
igt@kms_atomic_transition@plane-all-modeset-transition
xe-2895-0d2ff6d7ad3b6bf64c5c0e9a921fcfa925029526

Starting subtest: plane-all-modeset-transition
Starting dynamic subtest: pipe-A-DP-1
Dynamic subtest pipe-A-DP-1: SUCCESS (36.453s)
Starting dynamic subtest: pipe-A-DP-2
Dynamic subtest pipe-A-DP-2: SUCCESS (55.451s)
Starting dynamic subtest: pipe-B-DP-1
Dynamic subtest pipe-B-DP-1: SUCCESS (35.956s)
Starting dynamic subtest: pipe-B-DP-2
Dynamic subtest pipe-B-DP-2: SUCCESS (55.314s)
Starting dynamic subtest: pipe-C-DP-1
Dynamic subtest pipe-C-DP-1: SUCCESS (35.706s)
Starting dynamic subtest: pipe-C-DP-2
(kms_atomic_transition:7295) igt_kms-CRITICAL: Test assertion failure function...
(kms_atomic_transition:7295) igt_kms-CRITICAL: Failed assertion: ret == 0
(kms_atomic_transition:7295) igt_kms-CRITICAL: Last errno: 22, Invalid argument
(kms_atomic_transition:7295) igt_kms-CRITICAL: error: -22 != 0
Dynamic subtest pipe-C-DP-2 failed.
...
igt@kms_rotation_crc@primary-x-tiled-reflect-x-180
igt@kms_rotation_crc@primary-x-tiled-reflect-x-180
xe-2899-8f917568adaeea8b649e337e7d0e03bd03332253

Starting subtest: primary-x-tiled-reflect-x-180
(kms_rotation_crc:4238) igt_pipe_crc-CRITICAL: Test assertion failure function...
(kms_rotation_crc:4238) igt_pipe_crc-CRITICAL: Failed assertion: !mismatch || ...
Subtest primary-x-tiled-reflect-x-180 failed.
**** DEBUG ****
    populating plane data: C.1, fb 0
(kms_rotation_crc:4238) igt_kms-DEBUG: plane C.1: Setting property "SRC_X" to ...
(kms_rotation_crc:4238) igt_kms-DEBUG: plane C.1: Setting property "SRC_Y" to ...
(kms_rotation_crc:4238) igt_kms-DEBUG: plane C.1: Setting property "SRC_W" to ...
(kms_rotation_crc:4238) igt_kms-DEBUG: plane C.1: Setting property "SRC_H" to ...
(kms_rotation_crc:4238) igt_kms-DEBUG: plane C.1: Setting property "CRTC_X" to...
(kms_rotation_crc:4238) igt_kms-DEBUG: plane C.1: Setting property "CRTC_Y" to...
(kms_rotation_crc:4238) igt_kms-DEBUG: plane C.1: Setting property "CRTC_W" to...
(kms_rotation_crc:4238) igt_kms-DEBUG: plane C.1: Setting property "CRTC_H" to...
(kms_rotation_crc:4238) igt_kms-DEBUG: plane C.1: Setting property "FB_ID" to ...
(kms_rotation_crc:4238) igt_kms-DEBUG: plane C.1: Setting property "CRTC_ID" t...
(kms_rotation_crc:4238) igt_kms-DEBUG: plane C.1: Setting property "rotation" ...
...
igt@intel_sysfs_debugfs@xe-debugfs-read-all-entries
D igt@intel_sysfs_debugfs@xe-debugfs-read-all-entries
xe-2899-8f917568adaeea8b649e337e7d0e03bd03332253

<3> [113.279936] xe 0000:00:02.0: [drm] *ERROR* GT1: Force wake domain 15 fail...
<4> [113.280774] xe 0000:00:02.0: [drm] GT1: Forcewake domain 0x8000 failed to...
<4> [113.280950] Modules linked in: snd_hda_intel snd_hda_codec_hdmi xe drm_gp...
D igt@intel_sysfs_debugfs@xe-debugfs-read-all-entries
xe-2895-0d2ff6d7ad3b6bf64c5c0e9a921fcfa925029526

<3> [111.412913] xe 0000:00:02.0: [drm] *ERROR* GT1: Force wake domain 15 fail...
<4> [111.413087] xe 0000:00:02.0: [drm] GT1: Forcewake domain 0x8000 failed to...
<4> [111.413167] Modules linked in: snd_hda_intel snd_hda_codec_hdmi xe drm_gp...
igt@kms_pm_dc@dc5-dpms
igt@kms_pm_dc@dc5-dpms
xe-2895-0d2ff6d7ad3b6bf64c5c0e9a921fcfa925029526

Starting subtest: dc5-dpms
(kms_pm_dc:13520) CRITICAL: Test assertion failure function check_dc_counter, ...
(kms_pm_dc:13520) CRITICAL: Failed assertion: dc_state_wait_entry(data->debugf...
(kms_pm_dc:13520) CRITICAL: DC5 state is not achieved
i915_power_domain_info:
Runtime power status: enabled
Power well/domain         Use count
always-on                 0
  DISPLAY_CORE            0
  PIPE_A                  0
  PIPE_B                  0
  PIPE_C                  0
  PIPE_D                  0
  PIPE_PANEL_FITTER_A     0
  PIPE_PANEL_FITTER_B     0
  PIPE_PANEL_FITTER_C     0
  PIPE_PANEL_FITTER_D     0
...
igt@kms_plane_cursor@overlay
igt@kms_plane_cursor@overlay
xe-2895-0d2ff6d7ad3b6bf64c5c0e9a921fcfa925029526

Starting subtest: overlay
Starting dynamic subtest: pipe-A-eDP-1-size-64
Dynamic subtest pipe-A-eDP-1-size-64: SUCCESS (4.391s)
Starting dynamic subtest: pipe-A-eDP-1-size-128
Dynamic subtest pipe-A-eDP-1-size-128: SUCCESS (4.235s)
Starting dynamic subtest: pipe-A-eDP-1-size-256
Dynamic subtest pipe-A-eDP-1-size-256: SUCCESS (4.247s)
Starting dynamic subtest: pipe-B-DP-1-size-64
(kms_plane_cursor:10100) igt_pipe_crc-CRITICAL: Test assertion failure functio...
(kms_plane_cursor:10100) igt_pipe_crc-CRITICAL: Failed assertion: !mismatch ||...
Dynamic subtest pipe-B-DP-1-size-64 failed.
**** DEBUG ****
(kms_plane_cursor:10100) igt_kms-DEBUG: plane C.0: Setting property "CRTC_ID" ...
(kms_plane_cursor:10100) igt_kms-DEBUG: plane C.0: Setting property "rotation"...
(kms_plane_cursor:10100) igt_kms-DEBUG: plane C.0: Setting property "COLOR_ENC...
(kms_plane_cursor:10100) igt_kms-DEBUG: plane C.0: Setting property "COLOR_RAN...
(kms_plane_cursor:10100) igt_kms-DEBUG: plane C.0: Setting property "pixel ble...
...
igt@kms_pm_dc@dc5-psr
igt@kms_pm_dc@dc5-psr
xe-2895-0d2ff6d7ad3b6bf64c5c0e9a921fcfa925029526

Starting subtest: dc5-psr
(kms_pm_dc:13530) CRITICAL: Test assertion failure function check_dc_counter, ...
(kms_pm_dc:13530) CRITICAL: Failed assertion: dc_state_wait_entry(data->debugf...
(kms_pm_dc:13530) CRITICAL: DC5 state is not achieved
i915_power_domain_info:
Runtime power status: enabled
Power well/domain         Use count
always-on                 4
  DISPLAY_CORE            0
  PIPE_A                  1
  PIPE_B                  0
  PIPE_C                  0
  PIPE_D                  0
  PIPE_PANEL_FITTER_A     0
  PIPE_PANEL_FITTER_B     0
  PIPE_PANEL_FITTER_C     0
  PIPE_PANEL_FITTER_D     0
...
igt@fbdev@pan
igt@fbdev@pan
xe-2899-8f917568adaeea8b649e337e7d0e03bd03332253

Starting subtest: pan
(fbdev:2685) CRITICAL: Test assertion failure function pan_test, file ../tests...
(fbdev:2685) CRITICAL: Failed assertion: ret == expected_ret
(fbdev:2685) CRITICAL: Last errno: 28, No space left on device
(fbdev:2685) CRITICAL: ioctl(FBIOPAN_DISPLAY) returned ret=-1, expected 0
Subtest pan failed.
**** DEBUG ****
(fbdev:2685) DEBUG: Jump to opposite end of virtual screen
(fbdev:2685) CRITICAL: Test assertion failure function pan_test, file ../tests...
(fbdev:2685) CRITICAL: Failed assertion: ret == expected_ret
(fbdev:2685) CRITICAL: Last errno: 28, No space left on device
(fbdev:2685) CRITICAL: ioctl(FBIOPAN_DISPLAY) returned ret=-1, expected 0
(fbdev:2685) igt_core-INFO: Stack trace:
(fbdev:2685) igt_core-INFO:   #0 ../lib/igt_core.c:2065 __igt_fail_assert()
(fbdev:2685) igt_core-INFO:   #1 ../tests/fbdev.c:112 pan_test()
(fbdev:2685) igt_core-INFO:   #2 ../tests/fbdev.c:183 mode_tests()
(fbdev:2685) igt_core-INFO:   #3 ../tests/fbdev.c:473 __igt_unique____real_mai...
...
igt@fbdev@pan
xe-2895-0d2ff6d7ad3b6bf64c5c0e9a921fcfa925029526

Starting subtest: pan
(fbdev:2678) CRITICAL: Test assertion failure function pan_test, file ../tests...
(fbdev:2678) CRITICAL: Failed assertion: ret == expected_ret
(fbdev:2678) CRITICAL: Last errno: 28, No space left on device
(fbdev:2678) CRITICAL: ioctl(FBIOPAN_DISPLAY) returned ret=-1, expected 0
Subtest pan failed.
**** DEBUG ****
(fbdev:2678) DEBUG: Jump to opposite end of virtual screen
(fbdev:2678) CRITICAL: Test assertion failure function pan_test, file ../tests...
(fbdev:2678) CRITICAL: Failed assertion: ret == expected_ret
(fbdev:2678) CRITICAL: Last errno: 28, No space left on device
(fbdev:2678) CRITICAL: ioctl(FBIOPAN_DISPLAY) returned ret=-1, expected 0
(fbdev:2678) igt_core-INFO: Stack trace:
(fbdev:2678) igt_core-INFO:   #0 ../lib/igt_core.c:2065 __igt_fail_assert()
(fbdev:2678) igt_core-INFO:   #1 ../tests/fbdev.c:112 pan_test()
(fbdev:2678) igt_core-INFO:   #2 ../tests/fbdev.c:183 mode_tests()
(fbdev:2678) igt_core-INFO:   #3 ../tests/fbdev.c:473 __igt_unique____real_mai...
...
igt@xe_module_load@reload-no-display
D igt@xe_module_load@reload-no-display
xe-2899-8f917568adaeea8b649e337e7d0e03bd03332253

<4> [279.108324]  #0: ffffffffa0bd4560 (drm_sched_lockdep_map){+.+.}-{0:0}, at...
<4> [279.108472] Workqueue:  drm_sched_free_job_work [gpu_sched]
<4> [279.108666]  drm_sched_wqueue_stop+0x2c/0x40 [gpu_sched]
<4> [279.111223]  drm_sched_free_job_work+0x187/0x230 [gpu_sched]
<4> [279.134471] WARNING: CPU: 3 PID: 8481 at drivers/gpu/drm/drm_mm.c:964 drm...
<4> [279.134479] Modules linked in: xe snd_hda_codec_hdmi drm_gpuvm drm_gpusvm...
<4> [279.134558] RIP: 0010:drm_mm_takedown+0x3f/0x100
<4> [279.134602]  ? drm_mm_takedown+0x3f/0x100
<4> [279.134617]  ? drm_mm_takedown+0x3f/0x100
<4> [279.134680]  drm_managed_release+0x88/0x170
<4> [279.134682]  drm_dev_put.part.0+0x52/0x90
<4> [279.134686]  devm_drm_dev_init_release+0x13/0x30
<4> [279.134837]  ? xe_drm_ioctl+0x5e/0x80 [xe]
<3> [279.135832] [drm:drm_mm_takedown] *ERROR* node [01d7a000 + 00006000]: ins...
 drm_mm_insert_node_in_range+0x2b5/0x520
 __xe_ggtt_insert_bo_at+0x15b/0x460 [xe]
 xe_ggtt_insert_bo+0x17/0x30 [xe]
...
igt@kms_flip_scaled_crc@flip-32bpp-xtile-to-64bpp-xtile-upscaling
igt@kms_flip_scaled_crc@flip-32bpp-xtile-to-64bpp-xtile-upscaling
xe-2899-8f917568adaeea8b649e337e7d0e03bd03332253

Starting subtest: flip-32bpp-xtile-to-64bpp-xtile-upscaling
Starting dynamic subtest: pipe-A-valid-mode
(kms_flip_scaled_crc:2680) igt_pipe_crc-CRITICAL: Test assertion failure funct...
(kms_flip_scaled_crc:2680) igt_pipe_crc-CRITICAL: Failed assertion: !mismatch ...
Dynamic subtest pipe-A-valid-mode failed.
**** DEBUG ****
    populating plane data: C.0, fb 0
(kms_flip_scaled_crc:2680) igt_kms-DEBUG: plane C.0: Setting property "SRC_X" ...
(kms_flip_scaled_crc:2680) igt_kms-DEBUG: plane C.0: Setting property "SRC_Y" ...
(kms_flip_scaled_crc:2680) igt_kms-DEBUG: plane C.0: Setting property "SRC_W" ...
(kms_flip_scaled_crc:2680) igt_kms-DEBUG: plane C.0: Setting property "SRC_H" ...
(kms_flip_scaled_crc:2680) igt_kms-DEBUG: plane C.0: Setting property "CRTC_X"...
(kms_flip_scaled_crc:2680) igt_kms-DEBUG: plane C.0: Setting property "CRTC_Y"...
(kms_flip_scaled_crc:2680) igt_kms-DEBUG: plane C.0: Setting property "CRTC_W"...
(kms_flip_scaled_crc:2680) igt_kms-DEBUG: plane C.0: Setting property "CRTC_H"...
(kms_flip_scaled_crc:2680) igt_kms-DEBUG: plane C.0: Setting property "FB_ID" ...
(kms_flip_scaled_crc:2680) igt_kms-DEBUG: plane C.0: Setting property "CRTC_ID...
...
igt@kms_flip_scaled_crc@flip-32bpp-xtile-to-64bpp-xtile-upscaling@pipe-a-valid-mode
igt@kms_flip_scaled_crc@flip-32bpp-xtile-to-64bpp-xtile-upscaling@pipe-a-valid-mode
xe-2899-8f917568adaeea8b649e337e7d0e03bd03332253

Starting subtest: flip-32bpp-xtile-to-64bpp-xtile-upscaling
Starting dynamic subtest: pipe-A-valid-mode
(kms_flip_scaled_crc:2680) igt_pipe_crc-CRITICAL: Test assertion failure funct...
(kms_flip_scaled_crc:2680) igt_pipe_crc-CRITICAL: Failed assertion: !mismatch ...
Dynamic subtest pipe-A-valid-mode failed.
**** DEBUG ****
    populating plane data: C.0, fb 0
(kms_flip_scaled_crc:2680) igt_kms-DEBUG: plane C.0: Setting property "SRC_X" ...
(kms_flip_scaled_crc:2680) igt_kms-DEBUG: plane C.0: Setting property "SRC_Y" ...
(kms_flip_scaled_crc:2680) igt_kms-DEBUG: plane C.0: Setting property "SRC_W" ...
(kms_flip_scaled_crc:2680) igt_kms-DEBUG: plane C.0: Setting property "SRC_H" ...
(kms_flip_scaled_crc:2680) igt_kms-DEBUG: plane C.0: Setting property "CRTC_X"...
(kms_flip_scaled_crc:2680) igt_kms-DEBUG: plane C.0: Setting property "CRTC_Y"...
(kms_flip_scaled_crc:2680) igt_kms-DEBUG: plane C.0: Setting property "CRTC_W"...
(kms_flip_scaled_crc:2680) igt_kms-DEBUG: plane C.0: Setting property "CRTC_H"...
(kms_flip_scaled_crc:2680) igt_kms-DEBUG: plane C.0: Setting property "FB_ID" ...
(kms_flip_scaled_crc:2680) igt_kms-DEBUG: plane C.0: Setting property "CRTC_ID...
...
igt@kms_async_flips@async-flip-with-page-flip-events
igt@kms_async_flips@async-flip-with-page-flip-events
xe-2899-8f917568adaeea8b649e337e7d0e03bd03332253

Starting subtest: async-flip-with-page-flip-events
Starting dynamic subtest: pipe-A-eDP-1-4-rc-ccs
Dynamic subtest pipe-A-eDP-1-4-rc-ccs: SUCCESS (2.506s)
Starting dynamic subtest: pipe-A-eDP-1-4
Dynamic subtest pipe-A-eDP-1-4: SUCCESS (2.244s)
Starting dynamic subtest: pipe-A-eDP-1-x
Dynamic subtest pipe-A-eDP-1-x: SUCCESS (2.079s)
Starting dynamic subtest: pipe-A-eDP-1-linear
(kms_async_flips:2328) CRITICAL: Test assertion failure function test_async_fl...
(kms_async_flips:2328) CRITICAL: Failed assertion: (fps / 1000) > (data->refre...
(kms_async_flips:2328) CRITICAL: FPS should be significantly higher than the r...
Dynamic subtest pipe-A-eDP-1-linear failed.
**** DEBUG ****
(kms_async_flips:2328) igt_kms-DEBUG: Test requirement passed: dir != -1
(kms_async_flips:2328) igt_kms-DEBUG: Test requirement passed: res > 0
(kms_async_flips:2328) DEBUG: Test requirement passed: !(is_joiner_mode(data->...
(kms_async_flips:2328) igt_fb-DEBUG: igt_create_fb_with_bo_size(width=2880, he...
...
igt@kms_async_flips@async-flip-with-page-flip-events
xe-2895-0d2ff6d7ad3b6bf64c5c0e9a921fcfa925029526

Starting subtest: async-flip-with-page-flip-events
Starting dynamic subtest: pipe-A-eDP-1-4-rc-ccs
Dynamic subtest pipe-A-eDP-1-4-rc-ccs: SUCCESS (2.547s)
Starting dynamic subtest: pipe-A-eDP-1-4
Dynamic subtest pipe-A-eDP-1-4: SUCCESS (2.194s)
Starting dynamic subtest: pipe-A-eDP-1-x
Dynamic subtest pipe-A-eDP-1-x: SUCCESS (2.231s)
Starting dynamic subtest: pipe-A-eDP-1-linear
(kms_async_flips:3146) CRITICAL: Test assertion failure function test_async_fl...
(kms_async_flips:3146) CRITICAL: Failed assertion: (fps / 1000) > (data->refre...
(kms_async_flips:3146) CRITICAL: FPS should be significantly higher than the r...
Dynamic subtest pipe-A-eDP-1-linear failed.
**** DEBUG ****
(kms_async_flips:3146) igt_kms-DEBUG: Test requirement passed: dir != -1
(kms_async_flips:3146) igt_kms-DEBUG: Test requirement passed: res > 0
(kms_async_flips:3146) DEBUG: Test requirement passed: !(is_joiner_mode(data->...
(kms_async_flips:3146) igt_fb-DEBUG: igt_create_fb_with_bo_size(width=2880, he...
...
igt@kms_flip_scaled_crc@flip-64bpp-xtile-to-16bpp-xtile-upscaling
igt@kms_flip_scaled_crc@flip-64bpp-xtile-to-16bpp-xtile-upscaling
xe-2899-8f917568adaeea8b649e337e7d0e03bd03332253

Starting subtest: flip-64bpp-xtile-to-16bpp-xtile-upscaling
Starting dynamic subtest: pipe-A-valid-mode
(kms_flip_scaled_crc:2791) igt_pipe_crc-CRITICAL: Test assertion failure funct...
(kms_flip_scaled_crc:2791) igt_pipe_crc-CRITICAL: Failed assertion: !mismatch ...
Dynamic subtest pipe-A-valid-mode failed.
**** DEBUG ****
    populating plane data: C.0, fb 0
(kms_flip_scaled_crc:2791) igt_kms-DEBUG: plane C.0: Setting property "SRC_X" ...
(kms_flip_scaled_crc:2791) igt_kms-DEBUG: plane C.0: Setting property "SRC_Y" ...
(kms_flip_scaled_crc:2791) igt_kms-DEBUG: plane C.0: Setting property "SRC_W" ...
(kms_flip_scaled_crc:2791) igt_kms-DEBUG: plane C.0: Setting property "SRC_H" ...
(kms_flip_scaled_crc:2791) igt_kms-DEBUG: plane C.0: Setting property "CRTC_X"...
(kms_flip_scaled_crc:2791) igt_kms-DEBUG: plane C.0: Setting property "CRTC_Y"...
(kms_flip_scaled_crc:2791) igt_kms-DEBUG: plane C.0: Setting property "CRTC_W"...
(kms_flip_scaled_crc:2791) igt_kms-DEBUG: plane C.0: Setting property "CRTC_H"...
(kms_flip_scaled_crc:2791) igt_kms-DEBUG: plane C.0: Setting property "FB_ID" ...
(kms_flip_scaled_crc:2791) igt_kms-DEBUG: plane C.0: Setting property "CRTC_ID...
...
igt@kms_flip_scaled_crc@flip-64bpp-xtile-to-16bpp-xtile-upscaling@pipe-a-valid-mode
igt@kms_flip_scaled_crc@flip-64bpp-xtile-to-16bpp-xtile-upscaling@pipe-a-valid-mode
xe-2899-8f917568adaeea8b649e337e7d0e03bd03332253

Starting subtest: flip-64bpp-xtile-to-16bpp-xtile-upscaling
Starting dynamic subtest: pipe-A-valid-mode
(kms_flip_scaled_crc:2791) igt_pipe_crc-CRITICAL: Test assertion failure funct...
(kms_flip_scaled_crc:2791) igt_pipe_crc-CRITICAL: Failed assertion: !mismatch ...
Dynamic subtest pipe-A-valid-mode failed.
**** DEBUG ****
    populating plane data: C.0, fb 0
(kms_flip_scaled_crc:2791) igt_kms-DEBUG: plane C.0: Setting property "SRC_X" ...
(kms_flip_scaled_crc:2791) igt_kms-DEBUG: plane C.0: Setting property "SRC_Y" ...
(kms_flip_scaled_crc:2791) igt_kms-DEBUG: plane C.0: Setting property "SRC_W" ...
(kms_flip_scaled_crc:2791) igt_kms-DEBUG: plane C.0: Setting property "SRC_H" ...
(kms_flip_scaled_crc:2791) igt_kms-DEBUG: plane C.0: Setting property "CRTC_X"...
(kms_flip_scaled_crc:2791) igt_kms-DEBUG: plane C.0: Setting property "CRTC_Y"...
(kms_flip_scaled_crc:2791) igt_kms-DEBUG: plane C.0: Setting property "CRTC_W"...
(kms_flip_scaled_crc:2791) igt_kms-DEBUG: plane C.0: Setting property "CRTC_H"...
(kms_flip_scaled_crc:2791) igt_kms-DEBUG: plane C.0: Setting property "FB_ID" ...
(kms_flip_scaled_crc:2791) igt_kms-DEBUG: plane C.0: Setting property "CRTC_ID...
...
igt@kms_flip@bo-too-big-interruptible
T igt@kms_flip@bo-too-big-interruptible
xe-2899-8f917568adaeea8b649e337e7d0e03bd03332253

<6> [273.845427] Console: switching to colour dummy device 80x25
<6> [273.845739] [IGT] kms_flip: executing
<7> [273.876779] xe 0000:00:02.0: [drm:drm_helper_probe_single_connector_modes...
<7> [273.876828] xe 0000:00:02.0: [drm:intel_dp_detect [xe]] [CONNECTOR:218:DP...
<7> [273.877187] xe 0000:00:02.0: [drm:intel_tc_port_reset_mode [xe]] Port F/T...
<7> [273.877425] xe 0000:00:02.0: [drm:drm_helper_probe_single_connector_modes...
<7> [273.878320] xe 0000:00:02.0: [drm:drm_helper_probe_single_connector_modes...
<7> [273.878343] xe 0000:00:02.0: [drm:intel_dp_detect [xe]] [CONNECTOR:189:eD...
<7> [273.879298] xe 0000:00:02.0: [drm:intel_dp_read_dsc_dpcd [xe]] DSC DPCD: ...
<7> [273.879992] xe 0000:00:02.0: [drm:intel_dp_print_rates [xe]] source rates...
<7> [273.880368] xe 0000:00:02.0: [drm:intel_dp_print_rates [xe]] sink rates: ...
<7> [273.880832] xe 0000:00:02.0: [drm:intel_dp_print_rates [xe]] common rates...
<7> [273.881128] xe 0000:00:02.0: [drm:update_display_info.part.0] [CONNECTOR:...
<5> [273.881143] [drm] DisplayID checksum invalid, remainder is 248
<5> [273.881146] [drm] DisplayID checksum invalid, remainder is 248
<7> [273.881149] xe 0000:00:02.0: [drm:update_display_info.part.0] [CONNECTOR:...
<5> [273.881154] [drm] DisplayID checksum invalid, remainder is 248
...
T igt@kms_flip@bo-too-big-interruptible
xe-2895-0d2ff6d7ad3b6bf64c5c0e9a921fcfa925029526

<6> [920.667818] Console: switching to colour dummy device 80x25
<6> [920.668091] [IGT] kms_flip: executing
<7> [920.712044] xe 0000:00:02.0: [drm:drm_helper_probe_single_connector_modes...
<7> [920.712091] xe 0000:00:02.0: [drm:intel_dp_detect [xe]] [CONNECTOR:218:DP...
<7> [920.712524] xe 0000:00:02.0: [drm:intel_tc_port_reset_mode [xe]] Port F/T...
<7> [920.712771] xe 0000:00:02.0: [drm:drm_helper_probe_single_connector_modes...
<7> [920.713569] xe 0000:00:02.0: [drm:drm_helper_probe_single_connector_modes...
<7> [920.713591] xe 0000:00:02.0: [drm:intel_dp_detect [xe]] [CONNECTOR:189:eD...
<7> [920.714509] xe 0000:00:02.0: [drm:intel_dp_read_dsc_dpcd [xe]] DSC DPCD: ...
<7> [920.715261] xe 0000:00:02.0: [drm:intel_dp_print_rates [xe]] source rates...
<7> [920.715710] xe 0000:00:02.0: [drm:intel_dp_print_rates [xe]] sink rates: ...
<7> [920.716002] xe 0000:00:02.0: [drm:intel_dp_print_rates [xe]] common rates...
<7> [920.716318] xe 0000:00:02.0: [drm:update_display_info.part.0] [CONNECTOR:...
<5> [920.716336] [drm] DisplayID checksum invalid, remainder is 248
<5> [920.716340] [drm] DisplayID checksum invalid, remainder is 248
<7> [920.716344] xe 0000:00:02.0: [drm:update_display_info.part.0] [CONNECTOR:...
<5> [920.716351] [drm] DisplayID checksum invalid, remainder is 248
...
igt@kms_flip@2x-flip-vs-expired-vblank-interruptible
igt@kms_flip@2x-flip-vs-expired-vblank-interruptible
xe-2895-0d2ff6d7ad3b6bf64c5c0e9a921fcfa925029526

Starting subtest: 2x-flip-vs-expired-vblank-interruptible
Starting dynamic subtest: AB-DP1-DP2
(kms_flip:5555) CRITICAL: Test assertion failure function run_test_step, file ...
(kms_flip:5555) CRITICAL: Failed assertion: end - start < 500
(kms_flip:5555) CRITICAL: Last errno: 4, Interrupted system call
Dynamic subtest AB-DP1-DP2 failed.
**** DEBUG ****
(kms_flip:5555) igt_fb-DEBUG: igt_create_fb_with_bo_size(width=3840, height=21...
(kms_flip:5555) igt_fb-DEBUG: igt_create_fb_with_bo_size(handle=1, pitch=15360)
(kms_flip:5555) ioctl_wrappers-DEBUG: Test requirement passed: igt_has_fb_modi...
(kms_flip:5555) igt_fb-DEBUG: igt_create_fb_with_bo_size(width=3840, height=21...
(kms_flip:5555) igt_fb-DEBUG: igt_create_fb_with_bo_size(handle=2, pitch=15360)
(kms_flip:5555) ioctl_wrappers-DEBUG: Test requirement passed: igt_has_fb_modi...
(kms_flip:5555) intel_allocator_simple-DEBUG: Using simple allocator
(kms_flip:5555) intel_allocator_simple-DEBUG: <ial: 0x56e4a942fad0, fd: 5> obj...
(kms_flip:5555) intel_allocator_simple-DEBUG: <ial: 0x56e4a942fad0, fd: 5> obj...
(kms_flip:5555) intel_allocator_simple-DEBUG: Using simple allocator
...
igt@kms_flip@2x-flip-vs-expired-vblank
igt@kms_flip@2x-flip-vs-expired-vblank
xe-2899-8f917568adaeea8b649e337e7d0e03bd03332253

Starting subtest: 2x-flip-vs-expired-vblank
Starting dynamic subtest: AB-DP1-DP2
(kms_flip:2201) CRITICAL: Test assertion failure function run_test_step, file ...
(kms_flip:2201) CRITICAL: Failed assertion: end - start < 500
Dynamic subtest AB-DP1-DP2 failed.
**** DEBUG ****
(kms_flip:2201) DEBUG: name = flip
last_ts = 202.738342
last_received_ts = 202.737991
last_seq = 2519
current_ts = 202.771698
current_received_ts = 202.771317
current_seq = 2520
count = 43
seq_step = 1
(kms_flip:2201) DEBUG: Vblank took 274us
(kms_flip:2201) DEBUG: name = flip
...
igt@kms_flip@2x-flip-vs-expired-vblank
xe-2895-0d2ff6d7ad3b6bf64c5c0e9a921fcfa925029526

Starting subtest: 2x-flip-vs-expired-vblank
Starting dynamic subtest: AB-DP1-DP2
(kms_flip:5524) CRITICAL: Test assertion failure function run_test_step, file ...
(kms_flip:5524) CRITICAL: Failed assertion: end - start < 500
Dynamic subtest AB-DP1-DP2 failed.
**** DEBUG ****
(kms_flip:5524) igt_fb-DEBUG: igt_create_fb_with_bo_size(width=3840, height=21...
(kms_flip:5524) igt_fb-DEBUG: igt_create_fb_with_bo_size(handle=1, pitch=15360)
(kms_flip:5524) ioctl_wrappers-DEBUG: Test requirement passed: igt_has_fb_modi...
(kms_flip:5524) igt_fb-DEBUG: igt_create_fb_with_bo_size(width=3840, height=21...
(kms_flip:5524) igt_fb-DEBUG: igt_create_fb_with_bo_size(handle=2, pitch=15360)
(kms_flip:5524) ioctl_wrappers-DEBUG: Test requirement passed: igt_has_fb_modi...
(kms_flip:5524) intel_allocator_simple-DEBUG: Using simple allocator
(kms_flip:5524) intel_allocator_simple-DEBUG: <ial: 0x5be674d6fad0, fd: 5> obj...
(kms_flip:5524) intel_allocator_simple-DEBUG: <ial: 0x5be674d6fad0, fd: 5> obj...
(kms_flip:5524) intel_allocator_simple-DEBUG: Using simple allocator
(kms_flip:5524) intel_allocator_simple-DEBUG: <ial: 0x5be674d517a0, fd: 5> obj...
...
igt@kms_pm_dc@dc6-psr
igt@kms_pm_dc@dc6-psr
xe-2899-8f917568adaeea8b649e337e7d0e03bd03332253

Starting subtest: dc6-psr
(kms_pm_dc:5681) CRITICAL: Test assertion failure function test_pkgc_state_psr...
(kms_pm_dc:5681) CRITICAL: Failed assertion: cur_value > prev_value
(kms_pm_dc:5681) CRITICAL: PKGC10 is not achieved.
Subtest dc6-psr failed.
**** DEBUG ****
(kms_pm_dc:5681) igt_kms-DEBUG: display:     SetProp plane C.1 "pixel blend mo...
(kms_pm_dc:5681) igt_kms-DEBUG: display:     SetProp plane C.1 "alpha" to 0xff...
(kms_pm_dc:5681) igt_kms-DEBUG: display:     SetProp plane C.1 "FB_DAMAGE_CLIP...
(kms_pm_dc:5681) igt_kms-DEBUG: display:     SetProp plane C.1 "SCALING_FILTER...
(kms_pm_dc:5681) igt_kms-DEBUG: Test requirement passed: plane_idx >= 0 && pla...
(kms_pm_dc:5681) igt_kms-DEBUG: display:     Fixing up initial rotation pipe C...
(kms_pm_dc:5681) igt_kms-DEBUG: display:     SetPlane pipe C, plane 2, disabling
(kms_pm_dc:5681) igt_kms-DEBUG: display:     SetProp plane C.2 "rotation" to 0...
(kms_pm_dc:5681) igt_kms-DEBUG: display:     SetProp plane C.2 "COLOR_ENCODING...
(kms_pm_dc:5681) igt_kms-DEBUG: display:     SetProp plane C.2 "COLOR_RANGE" t...
(kms_pm_dc:5681) igt_kms-DEBUG: display:     SetProp plane C.2 "pixel blend mo...
...
igt@kms_pm_dc@dc6-psr
xe-2895-0d2ff6d7ad3b6bf64c5c0e9a921fcfa925029526

Starting subtest: dc6-psr
(kms_pm_dc:13551) CRITICAL: Test assertion failure function test_pkgc_state_ps...
(kms_pm_dc:13551) CRITICAL: Failed assertion: cur_value > prev_value
(kms_pm_dc:13551) CRITICAL: PKGC10 is not achieved.
Subtest dc6-psr failed.
**** DEBUG ****
(kms_pm_dc:13551) igt_kms-DEBUG: display:     SetProp plane C.1 "pixel blend m...
(kms_pm_dc:13551) igt_kms-DEBUG: display:     SetProp plane C.1 "alpha" to 0xf...
(kms_pm_dc:13551) igt_kms-DEBUG: display:     SetProp plane C.1 "FB_DAMAGE_CLI...
(kms_pm_dc:13551) igt_kms-DEBUG: display:     SetProp plane C.1 "SCALING_FILTE...
(kms_pm_dc:13551) igt_kms-DEBUG: Test requirement passed: plane_idx >= 0 && pl...
(kms_pm_dc:13551) igt_kms-DEBUG: display:     Fixing up initial rotation pipe ...
(kms_pm_dc:13551) igt_kms-DEBUG: display:     SetPlane pipe C, plane 2, disabl...
(kms_pm_dc:13551) igt_kms-DEBUG: display:     SetProp plane C.2 "rotation" to ...
(kms_pm_dc:13551) igt_kms-DEBUG: display:     SetProp plane C.2 "COLOR_ENCODIN...
(kms_pm_dc:13551) igt_kms-DEBUG: display:     SetProp plane C.2 "COLOR_RANGE" ...
(kms_pm_dc:13551) igt_kms-DEBUG: display:     SetProp plane C.2 "pixel blend m...
...
igt@kms_plane_cursor@primary@pipe-c-dp-2-size-64
igt@kms_plane_cursor@primary@pipe-c-dp-2-size-64
xe-2895-0d2ff6d7ad3b6bf64c5c0e9a921fcfa925029526

Starting dynamic subtest: pipe-C-DP-2-size-64
(kms_plane_cursor:10661) igt_pipe_crc-CRITICAL: Test assertion failure functio...
(kms_plane_cursor:10661) igt_pipe_crc-CRITICAL: Failed assertion: !mismatch ||...
Dynamic subtest pipe-C-DP-2-size-64 failed.
**** DEBUG ****
(kms_plane_cursor:10661) igt_kms-DEBUG: plane B.4: Setting property "SRC_Y" to...
(kms_plane_cursor:10661) igt_kms-DEBUG: plane B.4: Setting property "SRC_W" to...
(kms_plane_cursor:10661) igt_kms-DEBUG: plane B.4: Setting property "SRC_H" to...
(kms_plane_cursor:10661) igt_kms-DEBUG: plane B.4: Setting property "CRTC_X" t...
(kms_plane_cursor:10661) igt_kms-DEBUG: plane B.4: Setting property "CRTC_Y" t...
(kms_plane_cursor:10661) igt_kms-DEBUG: plane B.4: Setting property "CRTC_W" t...
(kms_plane_cursor:10661) igt_kms-DEBUG: plane B.4: Setting property "CRTC_H" t...
(kms_plane_cursor:10661) igt_kms-DEBUG: plane B.4: Setting property "FB_ID" to...
(kms_plane_cursor:10661) igt_kms-DEBUG: plane B.4: Setting property "CRTC_ID" ...
(kms_plane_cursor:10661) igt_kms-DEBUG: plane B.4: Setting property "rotation"...
(kms_plane_cursor:10661) igt_kms-DEBUG: plane B.4: Setting property "COLOR_ENC...
(kms_plane_cursor:10661) igt_kms-DEBUG: plane B.4: Setting property "COLOR_RAN...
...
igt@kms_plane_cursor@primary@pipe-c-dp-2-size-128
igt@kms_plane_cursor@primary@pipe-c-dp-2-size-128
xe-2895-0d2ff6d7ad3b6bf64c5c0e9a921fcfa925029526

Starting dynamic subtest: pipe-C-DP-2-size-128
(kms_plane_cursor:10661) igt_pipe_crc-CRITICAL: Test assertion failure functio...
(kms_plane_cursor:10661) igt_pipe_crc-CRITICAL: Failed assertion: !mismatch ||...
Dynamic subtest pipe-C-DP-2-size-128 failed.
**** DEBUG ****
(kms_plane_cursor:10661) DEBUG: Test requirement passed: !(size > data->max_cu...
(kms_plane_cursor:10661) igt_fb-DEBUG: igt_create_fb_with_bo_size(width=3840, ...
(kms_plane_cursor:10661) igt_fb-DEBUG: igt_create_fb_with_bo_size(handle=1, pi...
(kms_plane_cursor:10661) ioctl_wrappers-DEBUG: Test requirement passed: igt_ha...
(kms_plane_cursor:10661) intel_allocator_simple-DEBUG: Using simple allocator
(kms_plane_cursor:10661) intel_allocator_simple-DEBUG: <ial: 0x61b3a6f10d40, f...
(kms_plane_cursor:10661) intel_allocator_simple-DEBUG: <ial: 0x61b3a6f10d40, f...
(kms_plane_cursor:10661) intel_allocator_simple-DEBUG: Using simple allocator
(kms_plane_cursor:10661) intel_allocator_simple-DEBUG: <ial: 0x61b3a6f10bb0, f...
(kms_plane_cursor:10661) intel_allocator_simple-DEBUG: <ial: 0x61b3a6f10bb0, f...
(kms_plane_cursor:10661) igt_fb-DEBUG: igt_create_fb_with_bo_size(width=128, h...
(kms_plane_cursor:10661) igt_fb-DEBUG: igt_create_fb_with_bo_size(handle=2, pi...
...
igt@kms_plane_cursor@primary@pipe-c-dp-2-size-256
igt@kms_plane_cursor@primary@pipe-c-dp-2-size-256
xe-2895-0d2ff6d7ad3b6bf64c5c0e9a921fcfa925029526

Starting dynamic subtest: pipe-C-DP-2-size-256
(kms_plane_cursor:10661) igt_pipe_crc-CRITICAL: Test assertion failure functio...
(kms_plane_cursor:10661) igt_pipe_crc-CRITICAL: Failed assertion: !mismatch ||...
Dynamic subtest pipe-C-DP-2-size-256 failed.
**** DEBUG ****
(kms_plane_cursor:10661) DEBUG: Test requirement passed: !(size > data->max_cu...
(kms_plane_cursor:10661) igt_fb-DEBUG: igt_create_fb_with_bo_size(width=3840, ...
(kms_plane_cursor:10661) igt_fb-DEBUG: igt_create_fb_with_bo_size(handle=1, pi...
(kms_plane_cursor:10661) ioctl_wrappers-DEBUG: Test requirement passed: igt_ha...
(kms_plane_cursor:10661) intel_allocator_simple-DEBUG: Using simple allocator
(kms_plane_cursor:10661) intel_allocator_simple-DEBUG: <ial: 0x61b3a6f3cbe0, f...
(kms_plane_cursor:10661) intel_allocator_simple-DEBUG: <ial: 0x61b3a6f3cbe0, f...
(kms_plane_cursor:10661) intel_allocator_simple-DEBUG: Using simple allocator
(kms_plane_cursor:10661) intel_allocator_simple-DEBUG: <ial: 0x61b3a6f3cbe0, f...
(kms_plane_cursor:10661) intel_allocator_simple-DEBUG: <ial: 0x61b3a6f3cbe0, f...
(kms_plane_cursor:10661) igt_fb-DEBUG: igt_create_fb_with_bo_size(width=256, h...
(kms_plane_cursor:10661) igt_fb-DEBUG: igt_create_fb_with_bo_size(handle=2, pi...
...
igt@kms_content_protection@lic-type-1
igt@kms_content_protection@lic-type-1
xe-2899-8f917568adaeea8b649e337e7d0e03bd03332253

Starting subtest: lic-type-1
Starting dynamic subtest: pipe-A-DP-1
(kms_content_protection:2227) CRITICAL: Test assertion failure function test_c...
(kms_content_protection:2227) CRITICAL: Failed assertion: !ret
(kms_content_protection:2227) CRITICAL: Content Protection LIC Failed
Dynamic subtest pipe-A-DP-1 failed.
**** DEBUG ****
(kms_content_protection:2227) igt_kms-DEBUG: Test requirement passed: plane_id...
(kms_content_protection:2227) igt_kms-DEBUG: display: A.0: plane_set_fb(231)
(kms_content_protection:2227) igt_kms-DEBUG: display: A.0: plane_set_size (384...
(kms_content_protection:2227) igt_kms-DEBUG: display: A.0: fb_set_position(0,0)
(kms_content_protection:2227) igt_kms-DEBUG: display: A.0: fb_set_size(3840x21...
(kms_content_protection:2227) igt_kms-DEBUG: display: commit {
(kms_content_protection:2227) igt_kms-DEBUG: display:     populating plane dat...
(kms_content_protection:2227) igt_kms-DEBUG: plane A.0: Setting property "SRC_...
(kms_content_protection:2227) igt_kms-DEBUG: plane A.0: Setting property "SRC_...
(kms_content_protection:2227) igt_kms-DEBUG: plane A.0: Setting property "SRC_...
...
igt@kms_content_protection@lic-type-1
xe-2895-0d2ff6d7ad3b6bf64c5c0e9a921fcfa925029526

Starting subtest: lic-type-1
Starting dynamic subtest: pipe-A-DP-1
(kms_content_protection:5560) CRITICAL: Test assertion failure function test_c...
(kms_content_protection:5560) CRITICAL: Failed assertion: !ret
(kms_content_protection:5560) CRITICAL: Content Protection LIC Failed
Dynamic subtest pipe-A-DP-1 failed.
**** DEBUG ****
(kms_content_protection:5560) igt_kms-DEBUG: Test requirement passed: plane_id...
(kms_content_protection:5560) igt_kms-DEBUG: display: A.0: plane_set_fb(227)
(kms_content_protection:5560) igt_kms-DEBUG: display: A.0: plane_set_size (384...
(kms_content_protection:5560) igt_kms-DEBUG: display: A.0: fb_set_position(0,0)
(kms_content_protection:5560) igt_kms-DEBUG: display: A.0: fb_set_size(3840x21...
(kms_content_protection:5560) igt_kms-DEBUG: display: commit {
(kms_content_protection:5560) igt_kms-DEBUG: display:     populating plane dat...
(kms_content_protection:5560) igt_kms-DEBUG: plane A.0: Setting property "SRC_...
(kms_content_protection:5560) igt_kms-DEBUG: plane A.0: Setting property "SRC_...
(kms_content_protection:5560) igt_kms-DEBUG: plane A.0: Setting property "SRC_...
...
igt@kms_plane_cursor@viewport
igt@kms_plane_cursor@viewport
xe-2895-0d2ff6d7ad3b6bf64c5c0e9a921fcfa925029526

Starting subtest: viewport
Starting dynamic subtest: pipe-A-eDP-1-size-64
Dynamic subtest pipe-A-eDP-1-size-64: SUCCESS (4.352s)
Starting dynamic subtest: pipe-A-eDP-1-size-128
Dynamic subtest pipe-A-eDP-1-size-128: SUCCESS (4.252s)
Starting dynamic subtest: pipe-A-eDP-1-size-256
Dynamic subtest pipe-A-eDP-1-size-256: SUCCESS (4.113s)
Starting dynamic subtest: pipe-B-DP-1-size-64
(kms_plane_cursor:11186) igt_pipe_crc-CRITICAL: Test assertion failure functio...
(kms_plane_cursor:11186) igt_pipe_crc-CRITICAL: Failed assertion: !mismatch ||...
Dynamic subtest pipe-B-DP-1-size-64 failed.
**** DEBUG ****
(kms_plane_cursor:11186) igt_kms-DEBUG: plane C.0: Setting property "CRTC_ID" ...
(kms_plane_cursor:11186) igt_kms-DEBUG: plane C.0: Setting property "rotation"...
(kms_plane_cursor:11186) igt_kms-DEBUG: plane C.0: Setting property "COLOR_ENC...
(kms_plane_cursor:11186) igt_kms-DEBUG: plane C.0: Setting property "COLOR_RAN...
(kms_plane_cursor:11186) igt_kms-DEBUG: plane C.0: Setting property "pixel ble...
...
igt@kms_async_flips@async-flip-with-page-flip-events-atomic
igt@kms_async_flips@async-flip-with-page-flip-events-atomic
xe-2899-8f917568adaeea8b649e337e7d0e03bd03332253

Starting subtest: async-flip-with-page-flip-events-atomic
Starting dynamic subtest: pipe-A-eDP-1-4-rc-ccs
Dynamic subtest pipe-A-eDP-1-4-rc-ccs: SUCCESS (2.589s)
Starting dynamic subtest: pipe-A-eDP-1-4
Dynamic subtest pipe-A-eDP-1-4: SUCCESS (2.229s)
Starting dynamic subtest: pipe-A-eDP-1-x
Dynamic subtest pipe-A-eDP-1-x: SUCCESS (2.099s)
Starting dynamic subtest: pipe-A-eDP-1-linear
(kms_async_flips:2967) CRITICAL: Test assertion failure function test_async_fl...
(kms_async_flips:2967) CRITICAL: Failed assertion: (fps / 1000) > (data->refre...
(kms_async_flips:2967) CRITICAL: FPS should be significantly higher than the r...
Dynamic subtest pipe-A-eDP-1-linear failed.
**** DEBUG ****
A.0: fb_set_size(2880x1800)
(kms_async_flips:2967) igt_kms-DEBUG: display: commit {
(kms_async_flips:2967) igt_kms-DEBUG: display:     populating plane data: A.0,...
(kms_async_flips:2967) igt_kms-DEBUG: plane A.0: Setting property "SRC_X" to 0...
...
igt@kms_async_flips@async-flip-with-page-flip-events-atomic
xe-2895-0d2ff6d7ad3b6bf64c5c0e9a921fcfa925029526

Starting subtest: async-flip-with-page-flip-events-atomic
Starting dynamic subtest: pipe-A-eDP-1-4-rc-ccs
Dynamic subtest pipe-A-eDP-1-4-rc-ccs: SUCCESS (2.502s)
Starting dynamic subtest: pipe-A-eDP-1-4
Dynamic subtest pipe-A-eDP-1-4: SUCCESS (2.245s)
Starting dynamic subtest: pipe-A-eDP-1-x
Dynamic subtest pipe-A-eDP-1-x: SUCCESS (2.232s)
Starting dynamic subtest: pipe-A-eDP-1-linear
(kms_async_flips:4361) CRITICAL: Test assertion failure function test_async_fl...
(kms_async_flips:4361) CRITICAL: Failed assertion: (fps / 1000) > (data->refre...
(kms_async_flips:4361) CRITICAL: FPS should be significantly higher than the r...
Dynamic subtest pipe-A-eDP-1-linear failed.
**** DEBUG ****
A.0: fb_set_size(2880x1800)
(kms_async_flips:4361) igt_kms-DEBUG: display: commit {
(kms_async_flips:4361) igt_kms-DEBUG: display:     populating plane data: A.0,...
(kms_async_flips:4361) igt_kms-DEBUG: plane A.0: Setting property "SRC_X" to 0...
...
igt@kms_cursor_legacy@flip-vs-cursor-crc-atomic
igt@kms_cursor_legacy@flip-vs-cursor-crc-atomic
xe-2899-8f917568adaeea8b649e337e7d0e03bd03332253

Starting subtest: flip-vs-cursor-crc-atomic
(kms_cursor_legacy:2620) CRITICAL: Test assertion failure function flip_vs_cur...
(kms_cursor_legacy:2620) CRITICAL: Failed assertion: kmstest_get_vblank(displa...
(kms_cursor_legacy:2620) CRITICAL: error: 14245 != 14244
Subtest flip-vs-cursor-crc-atomic failed.
**** DEBUG ****
populating plane data: B.4, fb 0
(kms_cursor_legacy:2620) igt_kms-DEBUG: plane B.4: Setting property "SRC_X" to...
(kms_cursor_legacy:2620) igt_kms-DEBUG: plane B.4: Setting property "SRC_Y" to...
(kms_cursor_legacy:2620) igt_kms-DEBUG: plane B.4: Setting property "SRC_W" to...
(kms_cursor_legacy:2620) igt_kms-DEBUG: plane B.4: Setting property "SRC_H" to...
(kms_cursor_legacy:2620) igt_kms-DEBUG: plane B.4: Setting property "CRTC_X" t...
(kms_cursor_legacy:2620) igt_kms-DEBUG: plane B.4: Setting property "CRTC_Y" t...
(kms_cursor_legacy:2620) igt_kms-DEBUG: plane B.4: Setting property "CRTC_W" t...
(kms_cursor_legacy:2620) igt_kms-DEBUG: plane B.4: Setting property "CRTC_H" t...
(kms_cursor_legacy:2620) igt_kms-DEBUG: plane B.4: Setting property "FB_ID" to...
(kms_cursor_legacy:2620) igt_kms-DEBUG: plane B.4: Setting property "CRTC_ID" ...
...
igt@kms_cursor_legacy@flip-vs-cursor-crc-atomic
xe-2895-0d2ff6d7ad3b6bf64c5c0e9a921fcfa925029526

Starting subtest: flip-vs-cursor-crc-atomic
(kms_cursor_legacy:2182) CRITICAL: Test assertion failure function flip_vs_cur...
(kms_cursor_legacy:2182) CRITICAL: Failed assertion: kmstest_get_vblank(displa...
(kms_cursor_legacy:2182) CRITICAL: error: 2611 != 2610
Subtest flip-vs-cursor-crc-atomic failed.
**** DEBUG ****
populating plane data: B.4, fb 0
(kms_cursor_legacy:2182) igt_kms-DEBUG: plane B.4: Setting property "SRC_X" to...
(kms_cursor_legacy:2182) igt_kms-DEBUG: plane B.4: Setting property "SRC_Y" to...
(kms_cursor_legacy:2182) igt_kms-DEBUG: plane B.4: Setting property "SRC_W" to...
(kms_cursor_legacy:2182) igt_kms-DEBUG: plane B.4: Setting property "SRC_H" to...
(kms_cursor_legacy:2182) igt_kms-DEBUG: plane B.4: Setting property "CRTC_X" t...
(kms_cursor_legacy:2182) igt_kms-DEBUG: plane B.4: Setting property "CRTC_Y" t...
(kms_cursor_legacy:2182) igt_kms-DEBUG: plane B.4: Setting property "CRTC_W" t...
(kms_cursor_legacy:2182) igt_kms-DEBUG: plane B.4: Setting property "CRTC_H" t...
(kms_cursor_legacy:2182) igt_kms-DEBUG: plane B.4: Setting property "FB_ID" to...
(kms_cursor_legacy:2182) igt_kms-DEBUG: plane B.4: Setting property "CRTC_ID" ...
...
igt@kms_plane@pixel-format-source-clamping
igt@kms_plane@pixel-format-source-clamping
xe-2899-8f917568adaeea8b649e337e7d0e03bd03332253

<6> [520.298968] Console: switching to colour dummy device 80x25
<6> [520.299250] [IGT] kms_plane: executing
<7> [520.317991] xe 0000:00:02.0: [drm:drm_helper_probe_single_connector_modes...
<7> [520.318020] xe 0000:00:02.0: [drm:intel_dp_detect [xe]] [CONNECTOR:218:DP...
<7> [520.318193] xe 0000:00:02.0: [drm:intel_tc_port_reset_mode [xe]] Port F/T...
<7> [520.318300] xe 0000:00:02.0: [drm:drm_helper_probe_single_connector_modes...
<7> [520.318727] xe 0000:00:02.0: [drm:drm_helper_probe_single_connector_modes...
<7> [520.318737] xe 0000:00:02.0: [drm:intel_dp_detect [xe]] [CONNECTOR:189:eD...
<7> [520.319475] xe 0000:00:02.0: [drm:intel_dp_read_dsc_dpcd [xe]] DSC DPCD: ...
<7> [520.319997] xe 0000:00:02.0: [drm:intel_dp_print_rates [xe]] source rates...
<7> [520.320084] xe 0000:00:02.0: [drm:intel_dp_print_rates [xe]] sink rates: ...
<7> [520.320244] xe 0000:00:02.0: [drm:intel_dp_print_rates [xe]] common rates...
<7> [520.320508] xe 0000:00:02.0: [drm:update_display_info.part.0] [CONNECTOR:...
<5> [520.320524] [drm] DisplayID checksum invalid, remainder is 248
<5> [520.320529] [drm] DisplayID checksum invalid, remainder is 248
<7> [520.320533] xe 0000:00:02.0: [drm:update_display_info.part.0] [CONNECTOR:...
<5> [520.320541] [drm] DisplayID checksum invalid, remainder is 248
...
igt@kms_plane@pixel-format-source-clamping@pipe-a-plane-0
igt@kms_plane@pixel-format-source-clamping@pipe-a-plane-0
xe-2899-8f917568adaeea8b649e337e7d0e03bd03332253

Starting subtest: pixel-format-source-clamping
Starting dynamic subtest: pipe-A-plane-0
(kms_plane:4939) WARNING: Warning on condition crc_mismatch_count in function ...
(kms_plane:4939) WARNING: CRC mismatches with format XR4H(0x48345258) on A.0 w...
(kms_plane:4939) WARNING: Warning on condition crc_mismatch_count in function ...
(kms_plane:4939) WARNING: CRC mismatches with format XV36(0x36335658) on A.0 w...
(kms_plane:4939) WARNING: Warning on condition crc_mismatch_count in function ...
(kms_plane:4939) WARNING: CRC mismatches with format XV36(0x36335658) on A.0 w...
(kms_plane:4939) WARNING: Warning on condition crc_mismatch_count in function ...
(kms_plane:4939) WARNING: CRC mismatches with format XV36(0x36335658) on A.0 w...
(kms_plane:4939) WARNING: Warning on condition crc_mismatch_count in function ...
(kms_plane:4939) WARNING: CRC mismatches with format XV36(0x36335658) on A.0 w...
(kms_plane:4939) WARNING: Warning on condition crc_mismatch_count in function ...
(kms_plane:4939) WARNING: CRC mismatches with format XV36(0x36335658) on A.0 w...
(kms_plane:4939) WARNING: Warning on condition crc_mismatch_count in function ...
(kms_plane:4939) WARNING: CRC mismatches with format XV36(0x36335658) on A.0 w...
Dynamic subtest pipe-A-plane-0: SUCCESS (7.314s)
...
igt@kms_universal_plane@cursor-fb-leak
igt@kms_universal_plane@cursor-fb-leak
xe-2899-8f917568adaeea8b649e337e7d0e03bd03332253

Starting subtest: cursor-fb-leak
Starting dynamic subtest: pipe-A-eDP-1
(kms_universal_plane:4688) CRITICAL: Test assertion failure function cursor_le...
(kms_universal_plane:4688) CRITICAL: Failed assertion: count1 == count2
(kms_universal_plane:4688) CRITICAL: Last errno: 9, Bad file descriptor
(kms_universal_plane:4688) CRITICAL: error: 1 != 2
Dynamic subtest pipe-A-eDP-1 failed.
**** DEBUG ****
(kms_universal_plane:4688) igt_kms-DEBUG: display: A.5: plane_set_size (64x64)
(kms_universal_plane:4688) igt_kms-DEBUG: display: A.5: fb_set_position(0,0)
(kms_universal_plane:4688) igt_kms-DEBUG: display: A.5: fb_set_size(64x64)
(kms_universal_plane:4688) igt_kms-DEBUG: display: commit {
(kms_universal_plane:4688) igt_kms-DEBUG: Test requirement passed: plane_idx >...
(kms_universal_plane:4688) igt_kms-DEBUG: Test requirement passed: plane_idx >...
(kms_universal_plane:4688) igt_kms-DEBUG: Test requirement passed: plane_idx >...
(kms_universal_plane:4688) igt_kms-DEBUG: Test requirement passed: plane_idx >...
(kms_universal_plane:4688) igt_kms-DEBUG: Test requirement passed: plane_idx >...
...
igt@kms_universal_plane@cursor-fb-leak
xe-2895-0d2ff6d7ad3b6bf64c5c0e9a921fcfa925029526

Starting subtest: cursor-fb-leak
Starting dynamic subtest: pipe-A-eDP-1
(kms_universal_plane:12731) CRITICAL: Test assertion failure function cursor_l...
(kms_universal_plane:12731) CRITICAL: Failed assertion: count1 == count2
(kms_universal_plane:12731) CRITICAL: Last errno: 9, Bad file descriptor
(kms_universal_plane:12731) CRITICAL: error: 1 != 2
Dynamic subtest pipe-A-eDP-1 failed.
**** DEBUG ****
(kms_universal_plane:12731) igt_kms-DEBUG: display: A.5: plane_set_size (64x64)
(kms_universal_plane:12731) igt_kms-DEBUG: display: A.5: fb_set_position(0,0)
(kms_universal_plane:12731) igt_kms-DEBUG: display: A.5: fb_set_size(64x64)
(kms_universal_plane:12731) igt_kms-DEBUG: display: commit {
(kms_universal_plane:12731) igt_kms-DEBUG: Test requirement passed: plane_idx ...
(kms_universal_plane:12731) igt_kms-DEBUG: Test requirement passed: plane_idx ...
(kms_universal_plane:12731) igt_kms-DEBUG: Test requirement passed: plane_idx ...
(kms_universal_plane:12731) igt_kms-DEBUG: Test requirement passed: plane_idx ...
(kms_universal_plane:12731) igt_kms-DEBUG: Test requirement passed: plane_idx ...
...
igt@kms_plane_cursor@overlay@pipe-c-dp-2-size-64
igt@kms_plane_cursor@overlay@pipe-c-dp-2-size-64
xe-2895-0d2ff6d7ad3b6bf64c5c0e9a921fcfa925029526

Starting dynamic subtest: pipe-C-DP-2-size-64
(kms_plane_cursor:10100) igt_pipe_crc-CRITICAL: Test assertion failure functio...
(kms_plane_cursor:10100) igt_pipe_crc-CRITICAL: Failed assertion: !mismatch ||...
Dynamic subtest pipe-C-DP-2-size-64 failed.
**** DEBUG ****
(kms_plane_cursor:10100) igt_kms-DEBUG: plane C.0: Setting property "CRTC_ID" ...
(kms_plane_cursor:10100) igt_kms-DEBUG: plane C.0: Setting property "rotation"...
(kms_plane_cursor:10100) igt_kms-DEBUG: plane C.0: Setting property "COLOR_ENC...
(kms_plane_cursor:10100) igt_kms-DEBUG: plane C.0: Setting property "COLOR_RAN...
(kms_plane_cursor:10100) igt_kms-DEBUG: plane C.0: Setting property "pixel ble...
(kms_plane_cursor:10100) igt_kms-DEBUG: plane C.0: Setting property "alpha" to...
(kms_plane_cursor:10100) igt_kms-DEBUG: plane C.0: Setting property "FB_DAMAGE...
(kms_plane_cursor:10100) igt_kms-DEBUG: plane C.0: Setting property "SCALING_F...
(kms_plane_cursor:10100) igt_kms-DEBUG: display:     populating plane data: C....
(kms_plane_cursor:10100) igt_kms-DEBUG: plane C.1: Setting property "SRC_X" to...
(kms_plane_cursor:10100) igt_kms-DEBUG: plane C.1: Setting property "SRC_Y" to...
(kms_plane_cursor:10100) igt_kms-DEBUG: plane C.1: Setting property "SRC_W" to...
...
igt@kms_plane_cursor@overlay@pipe-c-dp-2-size-128
igt@kms_plane_cursor@overlay@pipe-c-dp-2-size-128
xe-2895-0d2ff6d7ad3b6bf64c5c0e9a921fcfa925029526

Starting dynamic subtest: pipe-C-DP-2-size-128
(kms_plane_cursor:10100) igt_pipe_crc-CRITICAL: Test assertion failure functio...
(kms_plane_cursor:10100) igt_pipe_crc-CRITICAL: Failed assertion: !mismatch ||...
Dynamic subtest pipe-C-DP-2-size-128 failed.
**** DEBUG ****
(kms_plane_cursor:10100) DEBUG: Test requirement passed: !(size > data->max_cu...
(kms_plane_cursor:10100) igt_fb-DEBUG: igt_create_fb_with_bo_size(width=3840, ...
(kms_plane_cursor:10100) igt_fb-DEBUG: igt_create_fb_with_bo_size(handle=1, pi...
(kms_plane_cursor:10100) ioctl_wrappers-DEBUG: Test requirement passed: igt_ha...
(kms_plane_cursor:10100) intel_allocator_simple-DEBUG: Using simple allocator
(kms_plane_cursor:10100) intel_allocator_simple-DEBUG: <ial: 0x55bf19128930, f...
(kms_plane_cursor:10100) intel_allocator_simple-DEBUG: <ial: 0x55bf19128930, f...
(kms_plane_cursor:10100) intel_allocator_simple-DEBUG: Using simple allocator
(kms_plane_cursor:10100) intel_allocator_simple-DEBUG: <ial: 0x55bf191563d0, f...
(kms_plane_cursor:10100) intel_allocator_simple-DEBUG: <ial: 0x55bf191563d0, f...
(kms_plane_cursor:10100) igt_fb-DEBUG: igt_create_fb_with_bo_size(width=1920, ...
(kms_plane_cursor:10100) igt_fb-DEBUG: igt_create_fb_with_bo_size(handle=2, pi...
...
igt@kms_plane_cursor@overlay@pipe-c-dp-2-size-256
igt@kms_plane_cursor@overlay@pipe-c-dp-2-size-256
xe-2895-0d2ff6d7ad3b6bf64c5c0e9a921fcfa925029526

Starting dynamic subtest: pipe-C-DP-2-size-256
(kms_plane_cursor:10100) igt_pipe_crc-CRITICAL: Test assertion failure functio...
(kms_plane_cursor:10100) igt_pipe_crc-CRITICAL: Failed assertion: !mismatch ||...
Dynamic subtest pipe-C-DP-2-size-256 failed.
**** DEBUG ****
(kms_plane_cursor:10100) DEBUG: Test requirement passed: !(size > data->max_cu...
(kms_plane_cursor:10100) igt_fb-DEBUG: igt_create_fb_with_bo_size(width=3840, ...
(kms_plane_cursor:10100) igt_fb-DEBUG: igt_create_fb_with_bo_size(handle=1, pi...
(kms_plane_cursor:10100) ioctl_wrappers-DEBUG: Test requirement passed: igt_ha...
(kms_plane_cursor:10100) intel_allocator_simple-DEBUG: Using simple allocator
(kms_plane_cursor:10100) intel_allocator_simple-DEBUG: <ial: 0x55bf191563d0, f...
(kms_plane_cursor:10100) intel_allocator_simple-DEBUG: <ial: 0x55bf191563d0, f...
(kms_plane_cursor:10100) intel_allocator_simple-DEBUG: Using simple allocator
(kms_plane_cursor:10100) intel_allocator_simple-DEBUG: <ial: 0x55bf191563d0, f...
(kms_plane_cursor:10100) intel_allocator_simple-DEBUG: <ial: 0x55bf191563d0, f...
(kms_plane_cursor:10100) igt_fb-DEBUG: igt_create_fb_with_bo_size(width=1920, ...
(kms_plane_cursor:10100) igt_fb-DEBUG: igt_create_fb_with_bo_size(handle=2, pi...
...
igt@kms_universal_plane@cursor-fb-leak@pipe-a-edp-1
igt@kms_universal_plane@cursor-fb-leak@pipe-a-edp-1
xe-2899-8f917568adaeea8b649e337e7d0e03bd03332253

Starting subtest: cursor-fb-leak
Starting dynamic subtest: pipe-A-eDP-1
(kms_universal_plane:4688) CRITICAL: Test assertion failure function cursor_le...
(kms_universal_plane:4688) CRITICAL: Failed assertion: count1 == count2
(kms_universal_plane:4688) CRITICAL: Last errno: 9, Bad file descriptor
(kms_universal_plane:4688) CRITICAL: error: 1 != 2
Dynamic subtest pipe-A-eDP-1 failed.
**** DEBUG ****
(kms_universal_plane:4688) igt_kms-DEBUG: display: A.5: plane_set_size (64x64)
(kms_universal_plane:4688) igt_kms-DEBUG: display: A.5: fb_set_position(0,0)
(kms_universal_plane:4688) igt_kms-DEBUG: display: A.5: fb_set_size(64x64)
(kms_universal_plane:4688) igt_kms-DEBUG: display: commit {
(kms_universal_plane:4688) igt_kms-DEBUG: Test requirement passed: plane_idx >...
(kms_universal_plane:4688) igt_kms-DEBUG: Test requirement passed: plane_idx >...
(kms_universal_plane:4688) igt_kms-DEBUG: Test requirement passed: plane_idx >...
(kms_universal_plane:4688) igt_kms-DEBUG: Test requirement passed: plane_idx >...
(kms_universal_plane:4688) igt_kms-DEBUG: Test requirement passed: plane_idx >...
...
igt@kms_universal_plane@cursor-fb-leak@pipe-a-edp-1
xe-2895-0d2ff6d7ad3b6bf64c5c0e9a921fcfa925029526

Starting subtest: cursor-fb-leak
Starting dynamic subtest: pipe-A-eDP-1
(kms_universal_plane:12731) CRITICAL: Test assertion failure function cursor_l...
(kms_universal_plane:12731) CRITICAL: Failed assertion: count1 == count2
(kms_universal_plane:12731) CRITICAL: Last errno: 9, Bad file descriptor
(kms_universal_plane:12731) CRITICAL: error: 1 != 2
Dynamic subtest pipe-A-eDP-1 failed.
**** DEBUG ****
(kms_universal_plane:12731) igt_kms-DEBUG: display: A.5: plane_set_size (64x64)
(kms_universal_plane:12731) igt_kms-DEBUG: display: A.5: fb_set_position(0,0)
(kms_universal_plane:12731) igt_kms-DEBUG: display: A.5: fb_set_size(64x64)
(kms_universal_plane:12731) igt_kms-DEBUG: display: commit {
(kms_universal_plane:12731) igt_kms-DEBUG: Test requirement passed: plane_idx ...
(kms_universal_plane:12731) igt_kms-DEBUG: Test requirement passed: plane_idx ...
(kms_universal_plane:12731) igt_kms-DEBUG: Test requirement passed: plane_idx ...
(kms_universal_plane:12731) igt_kms-DEBUG: Test requirement passed: plane_idx ...
(kms_universal_plane:12731) igt_kms-DEBUG: Test requirement passed: plane_idx ...
...
igt@kms_flip@bo-too-big-interruptible@a-edp1
T igt@kms_flip@bo-too-big-interruptible@a-edp1
xe-2899-8f917568adaeea8b649e337e7d0e03bd03332253

<6> [273.845427] Console: switching to colour dummy device 80x25
<6> [273.845739] [IGT] kms_flip: executing
<7> [273.876779] xe 0000:00:02.0: [drm:drm_helper_probe_single_connector_modes...
<7> [273.876828] xe 0000:00:02.0: [drm:intel_dp_detect [xe]] [CONNECTOR:218:DP...
<7> [273.877187] xe 0000:00:02.0: [drm:intel_tc_port_reset_mode [xe]] Port F/T...
<7> [273.877425] xe 0000:00:02.0: [drm:drm_helper_probe_single_connector_modes...
<7> [273.878320] xe 0000:00:02.0: [drm:drm_helper_probe_single_connector_modes...
<7> [273.878343] xe 0000:00:02.0: [drm:intel_dp_detect [xe]] [CONNECTOR:189:eD...
<7> [273.879298] xe 0000:00:02.0: [drm:intel_dp_read_dsc_dpcd [xe]] DSC DPCD: ...
<7> [273.879992] xe 0000:00:02.0: [drm:intel_dp_print_rates [xe]] source rates...
<7> [273.880368] xe 0000:00:02.0: [drm:intel_dp_print_rates [xe]] sink rates: ...
<7> [273.880832] xe 0000:00:02.0: [drm:intel_dp_print_rates [xe]] common rates...
<7> [273.881128] xe 0000:00:02.0: [drm:update_display_info.part.0] [CONNECTOR:...
<5> [273.881143] [drm] DisplayID checksum invalid, remainder is 248
<5> [273.881146] [drm] DisplayID checksum invalid, remainder is 248
<7> [273.881149] xe 0000:00:02.0: [drm:update_display_info.part.0] [CONNECTOR:...
<5> [273.881154] [drm] DisplayID checksum invalid, remainder is 248
...
T igt@kms_flip@bo-too-big-interruptible@a-edp1
xe-2895-0d2ff6d7ad3b6bf64c5c0e9a921fcfa925029526

<6> [920.667818] Console: switching to colour dummy device 80x25
<6> [920.668091] [IGT] kms_flip: executing
<7> [920.712044] xe 0000:00:02.0: [drm:drm_helper_probe_single_connector_modes...
<7> [920.712091] xe 0000:00:02.0: [drm:intel_dp_detect [xe]] [CONNECTOR:218:DP...
<7> [920.712524] xe 0000:00:02.0: [drm:intel_tc_port_reset_mode [xe]] Port F/T...
<7> [920.712771] xe 0000:00:02.0: [drm:drm_helper_probe_single_connector_modes...
<7> [920.713569] xe 0000:00:02.0: [drm:drm_helper_probe_single_connector_modes...
<7> [920.713591] xe 0000:00:02.0: [drm:intel_dp_detect [xe]] [CONNECTOR:189:eD...
<7> [920.714509] xe 0000:00:02.0: [drm:intel_dp_read_dsc_dpcd [xe]] DSC DPCD: ...
<7> [920.715261] xe 0000:00:02.0: [drm:intel_dp_print_rates [xe]] source rates...
<7> [920.715710] xe 0000:00:02.0: [drm:intel_dp_print_rates [xe]] sink rates: ...
<7> [920.716002] xe 0000:00:02.0: [drm:intel_dp_print_rates [xe]] common rates...
<7> [920.716318] xe 0000:00:02.0: [drm:update_display_info.part.0] [CONNECTOR:...
<5> [920.716336] [drm] DisplayID checksum invalid, remainder is 248
<5> [920.716340] [drm] DisplayID checksum invalid, remainder is 248
<7> [920.716344] xe 0000:00:02.0: [drm:update_display_info.part.0] [CONNECTOR:...
<5> [920.716351] [drm] DisplayID checksum invalid, remainder is 248
...
igt@kms_async_flips@async-flip-with-page-flip-events-atomic@pipe-a-edp-1-linear
igt@kms_async_flips@async-flip-with-page-flip-events-atomic@pipe-a-edp-1-linear
xe-2899-8f917568adaeea8b649e337e7d0e03bd03332253

Starting dynamic subtest: pipe-A-eDP-1-linear
(kms_async_flips:2967) CRITICAL: Test assertion failure function test_async_fl...
(kms_async_flips:2967) CRITICAL: Failed assertion: (fps / 1000) > (data->refre...
(kms_async_flips:2967) CRITICAL: FPS should be significantly higher than the r...
Dynamic subtest pipe-A-eDP-1-linear failed.
**** DEBUG ****
A.0: fb_set_size(2880x1800)
(kms_async_flips:2967) igt_kms-DEBUG: display: commit {
(kms_async_flips:2967) igt_kms-DEBUG: display:     populating plane data: A.0,...
(kms_async_flips:2967) igt_kms-DEBUG: plane A.0: Setting property "SRC_X" to 0...
(kms_async_flips:2967) igt_kms-DEBUG: plane A.0: Setting property "SRC_Y" to 0...
(kms_async_flips:2967) igt_kms-DEBUG: plane A.0: Setting property "SRC_W" to 0...
(kms_async_flips:2967) igt_kms-DEBUG: plane A.0: Setting property "SRC_H" to 0...
(kms_async_flips:2967) igt_kms-DEBUG: plane A.0: Setting property "CRTC_W" to ...
(kms_async_flips:2967) igt_kms-DEBUG: plane A.0: Setting property "CRTC_H" to ...
(kms_async_flips:2967) igt_kms-DEBUG: plane A.0: Setting property "FB_ID" to 0...
(kms_async_flips:2967) igt_kms-DEBUG: plane A.0: Setting property "CRTC_ID" to...
...
igt@kms_async_flips@async-flip-with-page-flip-events-atomic@pipe-a-edp-1-linear
xe-2895-0d2ff6d7ad3b6bf64c5c0e9a921fcfa925029526

Starting dynamic subtest: pipe-A-eDP-1-linear
(kms_async_flips:4361) CRITICAL: Test assertion failure function test_async_fl...
(kms_async_flips:4361) CRITICAL: Failed assertion: (fps / 1000) > (data->refre...
(kms_async_flips:4361) CRITICAL: FPS should be significantly higher than the r...
Dynamic subtest pipe-A-eDP-1-linear failed.
**** DEBUG ****
A.0: fb_set_size(2880x1800)
(kms_async_flips:4361) igt_kms-DEBUG: display: commit {
(kms_async_flips:4361) igt_kms-DEBUG: display:     populating plane data: A.0,...
(kms_async_flips:4361) igt_kms-DEBUG: plane A.0: Setting property "SRC_X" to 0...
(kms_async_flips:4361) igt_kms-DEBUG: plane A.0: Setting property "SRC_Y" to 0...
(kms_async_flips:4361) igt_kms-DEBUG: plane A.0: Setting property "SRC_W" to 0...
(kms_async_flips:4361) igt_kms-DEBUG: plane A.0: Setting property "SRC_H" to 0...
(kms_async_flips:4361) igt_kms-DEBUG: plane A.0: Setting property "CRTC_W" to ...
(kms_async_flips:4361) igt_kms-DEBUG: plane A.0: Setting property "CRTC_H" to ...
(kms_async_flips:4361) igt_kms-DEBUG: plane A.0: Setting property "FB_ID" to 0...
(kms_async_flips:4361) igt_kms-DEBUG: plane A.0: Setting property "CRTC_ID" to...
...
igt@kms_async_flips@async-flip-with-page-flip-events-atomic@pipe-b-edp-1-linear
igt@kms_async_flips@async-flip-with-page-flip-events-atomic@pipe-b-edp-1-linear
xe-2899-8f917568adaeea8b649e337e7d0e03bd03332253

Starting dynamic subtest: pipe-B-eDP-1-linear
(kms_async_flips:2967) CRITICAL: Test assertion failure function test_async_fl...
(kms_async_flips:2967) CRITICAL: Failed assertion: (fps / 1000) > (data->refre...
(kms_async_flips:2967) CRITICAL: FPS should be significantly higher than the r...
Dynamic subtest pipe-B-eDP-1-linear failed.
**** DEBUG ****
B.0: fb_set_size(2880x1800)
(kms_async_flips:2967) igt_kms-DEBUG: display: commit {
(kms_async_flips:2967) igt_kms-DEBUG: display:     populating plane data: B.0,...
(kms_async_flips:2967) igt_kms-DEBUG: plane B.0: Setting property "SRC_X" to 0...
(kms_async_flips:2967) igt_kms-DEBUG: plane B.0: Setting property "SRC_Y" to 0...
(kms_async_flips:2967) igt_kms-DEBUG: plane B.0: Setting property "SRC_W" to 0...
(kms_async_flips:2967) igt_kms-DEBUG: plane B.0: Setting property "SRC_H" to 0...
(kms_async_flips:2967) igt_kms-DEBUG: plane B.0: Setting property "CRTC_W" to ...
(kms_async_flips:2967) igt_kms-DEBUG: plane B.0: Setting property "CRTC_H" to ...
(kms_async_flips:2967) igt_kms-DEBUG: plane B.0: Setting property "FB_ID" to 0...
(kms_async_flips:2967) igt_kms-DEBUG: plane B.0: Setting property "CRTC_ID" to...
...
igt@kms_async_flips@async-flip-with-page-flip-events-atomic@pipe-b-edp-1-linear
xe-2895-0d2ff6d7ad3b6bf64c5c0e9a921fcfa925029526

Starting dynamic subtest: pipe-B-eDP-1-linear
(kms_async_flips:4361) CRITICAL: Test assertion failure function test_async_fl...
(kms_async_flips:4361) CRITICAL: Failed assertion: (fps / 1000) > (data->refre...
(kms_async_flips:4361) CRITICAL: FPS should be significantly higher than the r...
Dynamic subtest pipe-B-eDP-1-linear failed.
**** DEBUG ****
B.0: fb_set_size(2880x1800)
(kms_async_flips:4361) igt_kms-DEBUG: display: commit {
(kms_async_flips:4361) igt_kms-DEBUG: display:     populating plane data: B.0,...
(kms_async_flips:4361) igt_kms-DEBUG: plane B.0: Setting property "SRC_X" to 0...
(kms_async_flips:4361) igt_kms-DEBUG: plane B.0: Setting property "SRC_Y" to 0...
(kms_async_flips:4361) igt_kms-DEBUG: plane B.0: Setting property "SRC_W" to 0...
(kms_async_flips:4361) igt_kms-DEBUG: plane B.0: Setting property "SRC_H" to 0...
(kms_async_flips:4361) igt_kms-DEBUG: plane B.0: Setting property "CRTC_W" to ...
(kms_async_flips:4361) igt_kms-DEBUG: plane B.0: Setting property "CRTC_H" to ...
(kms_async_flips:4361) igt_kms-DEBUG: plane B.0: Setting property "FB_ID" to 0...
(kms_async_flips:4361) igt_kms-DEBUG: plane B.0: Setting property "CRTC_ID" to...
...
igt@kms_async_flips@async-flip-with-page-flip-events-atomic@pipe-c-edp-1-linear
igt@kms_async_flips@async-flip-with-page-flip-events-atomic@pipe-c-edp-1-linear
xe-2899-8f917568adaeea8b649e337e7d0e03bd03332253

Starting dynamic subtest: pipe-C-eDP-1-linear
(kms_async_flips:2967) CRITICAL: Test assertion failure function test_async_fl...
(kms_async_flips:2967) CRITICAL: Failed assertion: (fps / 1000) > (data->refre...
(kms_async_flips:2967) CRITICAL: FPS should be significantly higher than the r...
Dynamic subtest pipe-C-eDP-1-linear failed.
**** DEBUG ****
C.0: fb_set_size(2880x1800)
(kms_async_flips:2967) igt_kms-DEBUG: display: commit {
(kms_async_flips:2967) igt_kms-DEBUG: display:     populating plane data: C.0,...
(kms_async_flips:2967) igt_kms-DEBUG: plane C.0: Setting property "SRC_X" to 0...
(kms_async_flips:2967) igt_kms-DEBUG: plane C.0: Setting property "SRC_Y" to 0...
(kms_async_flips:2967) igt_kms-DEBUG: plane C.0: Setting property "SRC_W" to 0...
(kms_async_flips:2967) igt_kms-DEBUG: plane C.0: Setting property "SRC_H" to 0...
(kms_async_flips:2967) igt_kms-DEBUG: plane C.0: Setting property "CRTC_W" to ...
(kms_async_flips:2967) igt_kms-DEBUG: plane C.0: Setting property "CRTC_H" to ...
(kms_async_flips:2967) igt_kms-DEBUG: plane C.0: Setting property "FB_ID" to 0...
(kms_async_flips:2967) igt_kms-DEBUG: plane C.0: Setting property "CRTC_ID" to...
...
igt@kms_async_flips@async-flip-with-page-flip-events-atomic@pipe-c-edp-1-linear
xe-2895-0d2ff6d7ad3b6bf64c5c0e9a921fcfa925029526

Starting dynamic subtest: pipe-C-eDP-1-linear
(kms_async_flips:4361) CRITICAL: Test assertion failure function test_async_fl...
(kms_async_flips:4361) CRITICAL: Failed assertion: (fps / 1000) > (data->refre...
(kms_async_flips:4361) CRITICAL: FPS should be significantly higher than the r...
Dynamic subtest pipe-C-eDP-1-linear failed.
**** DEBUG ****
C.0: fb_set_size(2880x1800)
(kms_async_flips:4361) igt_kms-DEBUG: display: commit {
(kms_async_flips:4361) igt_kms-DEBUG: display:     populating plane data: C.0,...
(kms_async_flips:4361) igt_kms-DEBUG: plane C.0: Setting property "SRC_X" to 0...
(kms_async_flips:4361) igt_kms-DEBUG: plane C.0: Setting property "SRC_Y" to 0...
(kms_async_flips:4361) igt_kms-DEBUG: plane C.0: Setting property "SRC_W" to 0...
(kms_async_flips:4361) igt_kms-DEBUG: plane C.0: Setting property "SRC_H" to 0...
(kms_async_flips:4361) igt_kms-DEBUG: plane C.0: Setting property "CRTC_W" to ...
(kms_async_flips:4361) igt_kms-DEBUG: plane C.0: Setting property "CRTC_H" to ...
(kms_async_flips:4361) igt_kms-DEBUG: plane C.0: Setting property "FB_ID" to 0...
(kms_async_flips:4361) igt_kms-DEBUG: plane C.0: Setting property "CRTC_ID" to...
...
igt@kms_flip@flip-vs-expired-vblank
igt@kms_flip@flip-vs-expired-vblank
xe-2899-8f917568adaeea8b649e337e7d0e03bd03332253

Starting subtest: flip-vs-expired-vblank
Starting dynamic subtest: A-eDP1
Dynamic subtest A-eDP1: SUCCESS (4.678s)
Starting dynamic subtest: B-eDP1
Dynamic subtest B-eDP1: SUCCESS (4.669s)
Starting dynamic subtest: C-eDP1
Dynamic subtest C-eDP1: SUCCESS (4.648s)
Starting dynamic subtest: A-DP1
Dynamic subtest A-DP1: SUCCESS (3.887s)
Starting dynamic subtest: B-DP1
Dynamic subtest B-DP1: SUCCESS (3.643s)
Starting dynamic subtest: C-DP1
(kms_flip:2658) CRITICAL: Test assertion failure function run_test_step, file ...
(kms_flip:2658) CRITICAL: Failed assertion: end - start < 500
Dynamic subtest C-DP1 failed.
**** DEBUG ****
(kms_flip:2658) igt_fb-DEBUG: igt_create_fb_with_bo_size(width=3840, height=21...
...
igt@kms_flip@flip-vs-expired-vblank
xe-2895-0d2ff6d7ad3b6bf64c5c0e9a921fcfa925029526

Starting subtest: flip-vs-expired-vblank
Starting dynamic subtest: A-eDP1
(kms_flip:2153) CRITICAL: Test assertion failure function run_test_step, file ...
(kms_flip:2153) CRITICAL: Failed assertion: end - start < 500
Dynamic subtest A-eDP1 failed.
**** DEBUG ****
(kms_flip:2153) intel_allocator_simple-DEBUG: Using simple allocator
(kms_flip:2153) intel_allocator_simple-DEBUG: <ial: 0x5c8feb82bf40, fd: 5> obj...
(kms_flip:2153) intel_allocator_simple-DEBUG: <ial: 0x5c8feb82bf40, fd: 5> obj...
(kms_flip:2153) intel_allocator_simple-DEBUG: Using simple allocator
(kms_flip:2153) intel_allocator_simple-DEBUG: <ial: 0x5c8feb872d30, fd: 5> obj...
(kms_flip:2153) intel_allocator_simple-DEBUG: <ial: 0x5c8feb872d30, fd: 5> obj...
(kms_flip:2153) intel_allocator_simple-DEBUG: Using simple allocator
(kms_flip:2153) intel_allocator_simple-DEBUG: <ial: 0x5c8feb872000, fd: 5> obj...
(kms_flip:2153) intel_allocator_simple-DEBUG: <ial: 0x5c8feb872000, fd: 5> obj...
(kms_flip:2153) intel_allocator_simple-DEBUG: Using simple allocator
(kms_flip:2153) intel_allocator_simple-DEBUG: <ial: 0x5c8feb8722d0, fd: 5> obj...
...
igt@kms_flip@flip-vs-expired-vblank@a-edp1
igt@kms_flip@flip-vs-expired-vblank@a-edp1
xe-2895-0d2ff6d7ad3b6bf64c5c0e9a921fcfa925029526

Starting subtest: flip-vs-expired-vblank
Starting dynamic subtest: A-eDP1
(kms_flip:2153) CRITICAL: Test assertion failure function run_test_step, file ...
(kms_flip:2153) CRITICAL: Failed assertion: end - start < 500
Dynamic subtest A-eDP1 failed.
**** DEBUG ****
(kms_flip:2153) intel_allocator_simple-DEBUG: Using simple allocator
(kms_flip:2153) intel_allocator_simple-DEBUG: <ial: 0x5c8feb82bf40, fd: 5> obj...
(kms_flip:2153) intel_allocator_simple-DEBUG: <ial: 0x5c8feb82bf40, fd: 5> obj...
(kms_flip:2153) intel_allocator_simple-DEBUG: Using simple allocator
(kms_flip:2153) intel_allocator_simple-DEBUG: <ial: 0x5c8feb872d30, fd: 5> obj...
(kms_flip:2153) intel_allocator_simple-DEBUG: <ial: 0x5c8feb872d30, fd: 5> obj...
(kms_flip:2153) intel_allocator_simple-DEBUG: Using simple allocator
(kms_flip:2153) intel_allocator_simple-DEBUG: <ial: 0x5c8feb872000, fd: 5> obj...
(kms_flip:2153) intel_allocator_simple-DEBUG: <ial: 0x5c8feb872000, fd: 5> obj...
(kms_flip:2153) intel_allocator_simple-DEBUG: Using simple allocator
(kms_flip:2153) intel_allocator_simple-DEBUG: <ial: 0x5c8feb8722d0, fd: 5> obj...
...
igt@kms_plane_multiple@tiling-x
D igt@kms_plane_multiple@tiling-x
xe-2899-8f917568adaeea8b649e337e7d0e03bd03332253

<3> [466.979542] [drm:drm_crtc_add_crc_entry] *ERROR* Overflow of CRC buffer, ...
<3> [479.095685] [drm:drm_crtc_add_crc_entry] *ERROR* Overflow of CRC buffer, ...
<3> [490.437967] [drm:drm_crtc_add_crc_entry] *ERROR* Overflow of CRC buffer, ...
igt@kms_plane_cursor@viewport@pipe-c-dp-2-size-64
igt@kms_plane_cursor@viewport@pipe-c-dp-2-size-64
xe-2895-0d2ff6d7ad3b6bf64c5c0e9a921fcfa925029526

Starting dynamic subtest: pipe-C-DP-2-size-64
(kms_plane_cursor:11186) igt_pipe_crc-CRITICAL: Test assertion failure functio...
(kms_plane_cursor:11186) igt_pipe_crc-CRITICAL: Failed assertion: !mismatch ||...
Dynamic subtest pipe-C-DP-2-size-64 failed.
**** DEBUG ****
(kms_plane_cursor:11186) igt_kms-DEBUG: plane C.0: Setting property "CRTC_ID" ...
(kms_plane_cursor:11186) igt_kms-DEBUG: plane C.0: Setting property "rotation"...
(kms_plane_cursor:11186) igt_kms-DEBUG: plane C.0: Setting property "COLOR_ENC...
(kms_plane_cursor:11186) igt_kms-DEBUG: plane C.0: Setting property "COLOR_RAN...
(kms_plane_cursor:11186) igt_kms-DEBUG: plane C.0: Setting property "pixel ble...
(kms_plane_cursor:11186) igt_kms-DEBUG: plane C.0: Setting property "alpha" to...
(kms_plane_cursor:11186) igt_kms-DEBUG: plane C.0: Setting property "FB_DAMAGE...
(kms_plane_cursor:11186) igt_kms-DEBUG: plane C.0: Setting property "SCALING_F...
(kms_plane_cursor:11186) igt_kms-DEBUG: display:     populating plane data: C....
(kms_plane_cursor:11186) igt_kms-DEBUG: plane C.1: Setting property "SRC_X" to...
(kms_plane_cursor:11186) igt_kms-DEBUG: plane C.1: Setting property "SRC_Y" to...
(kms_plane_cursor:11186) igt_kms-DEBUG: plane C.1: Setting property "SRC_W" to...
...
igt@kms_plane_cursor@viewport@pipe-c-dp-2-size-128
igt@kms_plane_cursor@viewport@pipe-c-dp-2-size-128
xe-2895-0d2ff6d7ad3b6bf64c5c0e9a921fcfa925029526

Starting dynamic subtest: pipe-C-DP-2-size-128
(kms_plane_cursor:11186) igt_pipe_crc-CRITICAL: Test assertion failure functio...
(kms_plane_cursor:11186) igt_pipe_crc-CRITICAL: Failed assertion: !mismatch ||...
Dynamic subtest pipe-C-DP-2-size-128 failed.
**** DEBUG ****
(kms_plane_cursor:11186) DEBUG: Test requirement passed: !(size > data->max_cu...
(kms_plane_cursor:11186) igt_fb-DEBUG: igt_create_fb_with_bo_size(width=3840, ...
(kms_plane_cursor:11186) igt_fb-DEBUG: igt_create_fb_with_bo_size(handle=1, pi...
(kms_plane_cursor:11186) ioctl_wrappers-DEBUG: Test requirement passed: igt_ha...
(kms_plane_cursor:11186) intel_allocator_simple-DEBUG: Using simple allocator
(kms_plane_cursor:11186) intel_allocator_simple-DEBUG: <ial: 0x56ad825c1780, f...
(kms_plane_cursor:11186) intel_allocator_simple-DEBUG: <ial: 0x56ad825c1780, f...
(kms_plane_cursor:11186) intel_allocator_simple-DEBUG: Using simple allocator
(kms_plane_cursor:11186) intel_allocator_simple-DEBUG: <ial: 0x56ad825e03a0, f...
(kms_plane_cursor:11186) intel_allocator_simple-DEBUG: <ial: 0x56ad825e03a0, f...
(kms_plane_cursor:11186) igt_fb-DEBUG: igt_create_fb_with_bo_size(width=2048, ...
(kms_plane_cursor:11186) igt_fb-DEBUG: igt_create_fb_with_bo_size(handle=2, pi...
...
igt@kms_plane_cursor@viewport@pipe-c-dp-2-size-256
igt@kms_plane_cursor@viewport@pipe-c-dp-2-size-256
xe-2895-0d2ff6d7ad3b6bf64c5c0e9a921fcfa925029526

Starting dynamic subtest: pipe-C-DP-2-size-256
(kms_plane_cursor:11186) igt_pipe_crc-CRITICAL: Test assertion failure functio...
(kms_plane_cursor:11186) igt_pipe_crc-CRITICAL: Failed assertion: !mismatch ||...
Dynamic subtest pipe-C-DP-2-size-256 failed.
**** DEBUG ****
(kms_plane_cursor:11186) DEBUG: Test requirement passed: !(size > data->max_cu...
(kms_plane_cursor:11186) igt_fb-DEBUG: igt_create_fb_with_bo_size(width=3840, ...
(kms_plane_cursor:11186) igt_fb-DEBUG: igt_create_fb_with_bo_size(handle=1, pi...
(kms_plane_cursor:11186) ioctl_wrappers-DEBUG: Test requirement passed: igt_ha...
(kms_plane_cursor:11186) intel_allocator_simple-DEBUG: Using simple allocator
(kms_plane_cursor:11186) intel_allocator_simple-DEBUG: <ial: 0x56ad825e4210, f...
(kms_plane_cursor:11186) intel_allocator_simple-DEBUG: <ial: 0x56ad825e4210, f...
(kms_plane_cursor:11186) intel_allocator_simple-DEBUG: Using simple allocator
(kms_plane_cursor:11186) intel_allocator_simple-DEBUG: <ial: 0x56ad825e0360, f...
(kms_plane_cursor:11186) intel_allocator_simple-DEBUG: <ial: 0x56ad825e0360, f...
(kms_plane_cursor:11186) igt_fb-DEBUG: igt_create_fb_with_bo_size(width=2048, ...
(kms_plane_cursor:11186) igt_fb-DEBUG: igt_create_fb_with_bo_size(handle=2, pi...
...
igt@kms_rotation_crc@primary-x-tiled-reflect-x-0
igt@kms_rotation_crc@primary-x-tiled-reflect-x-0
xe-2899-8f917568adaeea8b649e337e7d0e03bd03332253

Starting subtest: primary-x-tiled-reflect-x-0
(kms_rotation_crc:4235) igt_pipe_crc-CRITICAL: Test assertion failure function...
(kms_rotation_crc:4235) igt_pipe_crc-CRITICAL: Failed assertion: !mismatch || ...
Subtest primary-x-tiled-reflect-x-0 failed.
**** DEBUG ****
    populating plane data: C.1, fb 0
(kms_rotation_crc:4235) igt_kms-DEBUG: plane C.1: Setting property "SRC_X" to ...
(kms_rotation_crc:4235) igt_kms-DEBUG: plane C.1: Setting property "SRC_Y" to ...
(kms_rotation_crc:4235) igt_kms-DEBUG: plane C.1: Setting property "SRC_W" to ...
(kms_rotation_crc:4235) igt_kms-DEBUG: plane C.1: Setting property "SRC_H" to ...
(kms_rotation_crc:4235) igt_kms-DEBUG: plane C.1: Setting property "CRTC_X" to...
(kms_rotation_crc:4235) igt_kms-DEBUG: plane C.1: Setting property "CRTC_Y" to...
(kms_rotation_crc:4235) igt_kms-DEBUG: plane C.1: Setting property "CRTC_W" to...
(kms_rotation_crc:4235) igt_kms-DEBUG: plane C.1: Setting property "CRTC_H" to...
(kms_rotation_crc:4235) igt_kms-DEBUG: plane C.1: Setting property "FB_ID" to ...
(kms_rotation_crc:4235) igt_kms-DEBUG: plane C.1: Setting property "CRTC_ID" t...
(kms_rotation_crc:4235) igt_kms-DEBUG: plane C.1: Setting property "rotation" ...
...
igt@kms_universal_plane@cursor-fb-leak@pipe-c-dp-2
igt@kms_universal_plane@cursor-fb-leak@pipe-c-dp-2
xe-2899-8f917568adaeea8b649e337e7d0e03bd03332253

Starting dynamic subtest: pipe-C-DP-2
(kms_universal_plane:4688) CRITICAL: Test assertion failure function cursor_le...
(kms_universal_plane:4688) CRITICAL: Failed assertion: count1 == count2
(kms_universal_plane:4688) CRITICAL: Last errno: 9, Bad file descriptor
(kms_universal_plane:4688) CRITICAL: error: 1 != 3
Dynamic subtest pipe-C-DP-2 failed.
**** DEBUG ****
(kms_universal_plane:4688) igt_kms-DEBUG: display: C.5: plane_set_size (64x64)
(kms_universal_plane:4688) igt_kms-DEBUG: display: C.5: fb_set_position(0,0)
(kms_universal_plane:4688) igt_kms-DEBUG: display: C.5: fb_set_size(64x64)
(kms_universal_plane:4688) igt_kms-DEBUG: display: commit {
(kms_universal_plane:4688) igt_kms-DEBUG: Test requirement passed: plane_idx >...
(kms_universal_plane:4688) igt_kms-DEBUG: Test requirement passed: plane_idx >...
(kms_universal_plane:4688) igt_kms-DEBUG: Test requirement passed: plane_idx >...
(kms_universal_plane:4688) igt_kms-DEBUG: Test requirement passed: plane_idx >...
(kms_universal_plane:4688) igt_kms-DEBUG: Test requirement passed: plane_idx >...
(kms_universal_plane:4688) igt_kms-DEBUG: Test requirement passed: plane_idx >...
...
igt@kms_universal_plane@cursor-fb-leak@pipe-c-dp-2
xe-2895-0d2ff6d7ad3b6bf64c5c0e9a921fcfa925029526

Starting dynamic subtest: pipe-C-DP-2
(kms_universal_plane:12731) CRITICAL: Test assertion failure function cursor_l...
(kms_universal_plane:12731) CRITICAL: Failed assertion: count1 == count2
(kms_universal_plane:12731) CRITICAL: Last errno: 9, Bad file descriptor
(kms_universal_plane:12731) CRITICAL: error: 1 != 2
Dynamic subtest pipe-C-DP-2 failed.
**** DEBUG ****
(kms_universal_plane:12731) igt_kms-DEBUG: display: C.5: plane_set_size (64x64)
(kms_universal_plane:12731) igt_kms-DEBUG: display: C.5: fb_set_position(0,0)
(kms_universal_plane:12731) igt_kms-DEBUG: display: C.5: fb_set_size(64x64)
(kms_universal_plane:12731) igt_kms-DEBUG: display: commit {
(kms_universal_plane:12731) igt_kms-DEBUG: Test requirement passed: plane_idx ...
(kms_universal_plane:12731) igt_kms-DEBUG: Test requirement passed: plane_idx ...
(kms_universal_plane:12731) igt_kms-DEBUG: Test requirement passed: plane_idx ...
(kms_universal_plane:12731) igt_kms-DEBUG: Test requirement passed: plane_idx ...
(kms_universal_plane:12731) igt_kms-DEBUG: Test requirement passed: plane_idx ...
(kms_universal_plane:12731) igt_kms-DEBUG: Test requirement passed: plane_idx ...
...
igt@kms_plane_multiple@tiling-x@pipe-a-dp-2
igt@kms_plane_multiple@tiling-x@pipe-a-dp-2
xe-2899-8f917568adaeea8b649e337e7d0e03bd03332253

Starting dynamic subtest: pipe-A-DP-2
(kms_plane_multiple:4473) igt_pipe_crc-CRITICAL: Test assertion failure functi...
(kms_plane_multiple:4473) igt_pipe_crc-CRITICAL: Failed assertion: write(pipe_...
(kms_plane_multiple:4473) igt_pipe_crc-CRITICAL: Last errno: 16, Device or res...
(kms_plane_multiple:4473) igt_pipe_crc-CRITICAL: error: -1 != 4
Dynamic subtest pipe-A-DP-2 failed.
**** DEBUG ****
(kms_plane_multiple:4473) igt_kms-DEBUG: plane B.1: Setting property "SRC_H" t...
(kms_plane_multiple:4473) igt_kms-DEBUG: plane B.1: Setting property "CRTC_X" ...
(kms_plane_multiple:4473) igt_kms-DEBUG: plane B.1: Setting property "CRTC_Y" ...
(kms_plane_multiple:4473) igt_kms-DEBUG: plane B.1: Setting property "CRTC_W" ...
(kms_plane_multiple:4473) igt_kms-DEBUG: plane B.1: Setting property "CRTC_H" ...
(kms_plane_multiple:4473) igt_kms-DEBUG: plane B.1: Setting property "FB_ID" t...
(kms_plane_multiple:4473) igt_kms-DEBUG: plane B.1: Setting property "CRTC_ID"...
(kms_plane_multiple:4473) igt_kms-DEBUG: plane B.1: Setting property "rotation...
(kms_plane_multiple:4473) igt_kms-DEBUG: plane B.1: Setting property "COLOR_EN...
(kms_plane_multiple:4473) igt_kms-DEBUG: plane B.1: Setting property "COLOR_RA...
...
igt@kms_plane_multiple@tiling-x@pipe-b-dp-2
igt@kms_plane_multiple@tiling-x@pipe-b-dp-2
xe-2899-8f917568adaeea8b649e337e7d0e03bd03332253

Starting dynamic subtest: pipe-B-DP-2
(kms_plane_multiple:4473) igt_pipe_crc-CRITICAL: Test assertion failure functi...
(kms_plane_multiple:4473) igt_pipe_crc-CRITICAL: Failed assertion: write(pipe_...
(kms_plane_multiple:4473) igt_pipe_crc-CRITICAL: Last errno: 16, Device or res...
(kms_plane_multiple:4473) igt_pipe_crc-CRITICAL: error: -1 != 4
Dynamic subtest pipe-B-DP-2 failed.
**** DEBUG ****
(kms_plane_multiple:4473) igt_kms-DEBUG: plane B.1: Setting property "SRC_H" t...
(kms_plane_multiple:4473) igt_kms-DEBUG: plane B.1: Setting property "CRTC_X" ...
(kms_plane_multiple:4473) igt_kms-DEBUG: plane B.1: Setting property "CRTC_Y" ...
(kms_plane_multiple:4473) igt_kms-DEBUG: plane B.1: Setting property "CRTC_W" ...
(kms_plane_multiple:4473) igt_kms-DEBUG: plane B.1: Setting property "CRTC_H" ...
(kms_plane_multiple:4473) igt_kms-DEBUG: plane B.1: Setting property "FB_ID" t...
(kms_plane_multiple:4473) igt_kms-DEBUG: plane B.1: Setting property "CRTC_ID"...
(kms_plane_multiple:4473) igt_kms-DEBUG: plane B.1: Setting property "rotation...
(kms_plane_multiple:4473) igt_kms-DEBUG: plane B.1: Setting property "COLOR_EN...
(kms_plane_multiple:4473) igt_kms-DEBUG: plane B.1: Setting property "COLOR_RA...
...
igt@kms_plane_multiple@tiling-x@pipe-c-dp-2
igt@kms_plane_multiple@tiling-x@pipe-c-dp-2
xe-2899-8f917568adaeea8b649e337e7d0e03bd03332253

Starting dynamic subtest: pipe-C-DP-2
(kms_plane_multiple:4473) igt_pipe_crc-CRITICAL: Test assertion failure functi...
(kms_plane_multiple:4473) igt_pipe_crc-CRITICAL: Failed assertion: write(pipe_...
(kms_plane_multiple:4473) igt_pipe_crc-CRITICAL: Last errno: 16, Device or res...
(kms_plane_multiple:4473) igt_pipe_crc-CRITICAL: error: -1 != 4
Dynamic subtest pipe-C-DP-2 failed.
**** DEBUG ****
(kms_plane_multiple:4473) igt_kms-DEBUG: plane B.1: Setting property "SRC_H" t...
(kms_plane_multiple:4473) igt_kms-DEBUG: plane B.1: Setting property "CRTC_X" ...
(kms_plane_multiple:4473) igt_kms-DEBUG: plane B.1: Setting property "CRTC_Y" ...
(kms_plane_multiple:4473) igt_kms-DEBUG: plane B.1: Setting property "CRTC_W" ...
(kms_plane_multiple:4473) igt_kms-DEBUG: plane B.1: Setting property "CRTC_H" ...
(kms_plane_multiple:4473) igt_kms-DEBUG: plane B.1: Setting property "FB_ID" t...
(kms_plane_multiple:4473) igt_kms-DEBUG: plane B.1: Setting property "CRTC_ID"...
(kms_plane_multiple:4473) igt_kms-DEBUG: plane B.1: Setting property "rotation...
(kms_plane_multiple:4473) igt_kms-DEBUG: plane B.1: Setting property "COLOR_EN...
(kms_plane_multiple:4473) igt_kms-DEBUG: plane B.1: Setting property "COLOR_RA...
...
igt@kms_flip@flip-vs-expired-vblank@a-dp2
igt@kms_flip@flip-vs-expired-vblank@a-dp2
xe-2899-8f917568adaeea8b649e337e7d0e03bd03332253

Starting dynamic subtest: A-DP2
(kms_flip:2658) CRITICAL: Test assertion failure function run_test_step, file ...
(kms_flip:2658) CRITICAL: Failed assertion: end - start < 500
Dynamic subtest A-DP2 failed.
**** DEBUG ****
(kms_flip:2658) igt_fb-DEBUG: igt_create_fb_with_bo_size(width=3840, height=21...
(kms_flip:2658) igt_fb-DEBUG: igt_create_fb_with_bo_size(handle=3, pitch=15360)
(kms_flip:2658) ioctl_wrappers-DEBUG: Test requirement passed: igt_has_fb_modi...
(kms_flip:2658) igt_fb-DEBUG: igt_create_fb_with_bo_size(width=3840, height=21...
(kms_flip:2658) igt_fb-DEBUG: igt_create_fb_with_bo_size(handle=4, pitch=15360)
(kms_flip:2658) ioctl_wrappers-DEBUG: Test requirement passed: igt_has_fb_modi...
(kms_flip:2658) igt_fb-DEBUG: Test requirement passed: cairo_surface_status(fb...
(kms_flip:2658) igt_fb-DEBUG: Test requirement passed: cairo_surface_status(fb...
(kms_flip:2658) igt_kms-INFO:   3840x2160: 30 297000 3840 4016 4104 4400 2160 ...
(kms_flip:2658) DEBUG: No stale events found
(kms_flip:2658) i915/intel_drrs-DEBUG: Manually disabling DRRS. 0
(kms_flip:2658) i915/intel_drrs-DEBUG: Test requirement passed: dir >= 0
...
igt@kms_flip@flip-vs-expired-vblank@b-dp2
igt@kms_flip@flip-vs-expired-vblank@b-dp2
xe-2899-8f917568adaeea8b649e337e7d0e03bd03332253

Starting dynamic subtest: B-DP2
(kms_flip:2658) CRITICAL: Test assertion failure function run_test_step, file ...
(kms_flip:2658) CRITICAL: Failed assertion: end - start < 500
Dynamic subtest B-DP2 failed.
**** DEBUG ****
(kms_flip:2658) igt_fb-DEBUG: igt_create_fb_with_bo_size(width=3840, height=21...
(kms_flip:2658) igt_fb-DEBUG: igt_create_fb_with_bo_size(handle=5, pitch=15360)
(kms_flip:2658) ioctl_wrappers-DEBUG: Test requirement passed: igt_has_fb_modi...
(kms_flip:2658) igt_fb-DEBUG: igt_create_fb_with_bo_size(width=3840, height=21...
(kms_flip:2658) igt_fb-DEBUG: igt_create_fb_with_bo_size(handle=6, pitch=15360)
(kms_flip:2658) ioctl_wrappers-DEBUG: Test requirement passed: igt_has_fb_modi...
(kms_flip:2658) igt_fb-DEBUG: Test requirement passed: cairo_surface_status(fb...
(kms_flip:2658) igt_fb-DEBUG: Test requirement passed: cairo_surface_status(fb...
(kms_flip:2658) igt_kms-INFO:   3840x2160: 30 297000 3840 4016 4104 4400 2160 ...
(kms_flip:2658) DEBUG: No stale events found
(kms_flip:2658) i915/intel_drrs-DEBUG: Manually disabling DRRS. 0
(kms_flip:2658) i915/intel_drrs-DEBUG: Test requirement passed: dir >= 0
...
igt@kms_plane_multiple@tiling-x@pipe-a-edp-1
igt@kms_plane_multiple@tiling-x@pipe-a-edp-1
xe-2899-8f917568adaeea8b649e337e7d0e03bd03332253

Starting subtest: tiling-x
Starting dynamic subtest: pipe-A-eDP-1
(kms_plane_multiple:4473) igt_pipe_crc-CRITICAL: Test assertion failure functi...
(kms_plane_multiple:4473) igt_pipe_crc-CRITICAL: Failed assertion: !mismatch |...
Dynamic subtest pipe-A-eDP-1 failed.
**** DEBUG ****
eDP-1: preparing atomic, pipe: A
(kms_plane_multiple:4473) igt_kms-DEBUG: eDP-1: Setting property "CRTC_ID" to ...
(kms_plane_multiple:4473) igt_kms-DEBUG: display: }
(kms_plane_multiple:4473) igt_kms-DEBUG: display: A.0: plane_set_fb(0)
(kms_plane_multiple:4473) igt_kms-DEBUG: display: A.0: plane_set_size (0x0)
(kms_plane_multiple:4473) igt_kms-DEBUG: display: A.0: fb_set_position(0,0)
(kms_plane_multiple:4473) igt_kms-DEBUG: display: A.0: fb_set_size(0x0)
(kms_plane_multiple:4473) igt_kms-DEBUG: display: A.1: plane_set_fb(0)
(kms_plane_multiple:4473) igt_kms-DEBUG: display: A.1: plane_set_size (0x0)
(kms_plane_multiple:4473) igt_kms-DEBUG: display: A.1: fb_set_position(0,0)
(kms_plane_multiple:4473) igt_kms-DEBUG: display: A.1: fb_set_size(0x0)
...
igt@kms_plane_multiple@tiling-x@pipe-b-edp-1
igt@kms_plane_multiple@tiling-x@pipe-b-edp-1
xe-2899-8f917568adaeea8b649e337e7d0e03bd03332253

Starting dynamic subtest: pipe-B-eDP-1
(kms_plane_multiple:4473) igt_pipe_crc-CRITICAL: Test assertion failure functi...
(kms_plane_multiple:4473) igt_pipe_crc-CRITICAL: Failed assertion: !mismatch |...
Dynamic subtest pipe-B-eDP-1 failed.
**** DEBUG ****
eDP-1: preparing atomic, pipe: B
(kms_plane_multiple:4473) igt_kms-DEBUG: eDP-1: Setting property "CRTC_ID" to ...
(kms_plane_multiple:4473) igt_kms-DEBUG: display: }
(kms_plane_multiple:4473) igt_kms-DEBUG: display: B.0: plane_set_fb(0)
(kms_plane_multiple:4473) igt_kms-DEBUG: display: B.0: plane_set_size (0x0)
(kms_plane_multiple:4473) igt_kms-DEBUG: display: B.0: fb_set_position(0,0)
(kms_plane_multiple:4473) igt_kms-DEBUG: display: B.0: fb_set_size(0x0)
(kms_plane_multiple:4473) igt_kms-DEBUG: display: B.1: plane_set_fb(0)
(kms_plane_multiple:4473) igt_kms-DEBUG: display: B.1: plane_set_size (0x0)
(kms_plane_multiple:4473) igt_kms-DEBUG: display: B.1: fb_set_position(0,0)
(kms_plane_multiple:4473) igt_kms-DEBUG: display: B.1: fb_set_size(0x0)
(kms_plane_multiple:4473) igt_kms-DEBUG: display: B.2: plane_set_fb(0)
...
igt@kms_plane_multiple@tiling-x@pipe-c-edp-1
igt@kms_plane_multiple@tiling-x@pipe-c-edp-1
xe-2899-8f917568adaeea8b649e337e7d0e03bd03332253

Starting dynamic subtest: pipe-C-eDP-1
(kms_plane_multiple:4473) igt_pipe_crc-CRITICAL: Test assertion failure functi...
(kms_plane_multiple:4473) igt_pipe_crc-CRITICAL: Failed assertion: !mismatch |...
Dynamic subtest pipe-C-eDP-1 failed.
**** DEBUG ****
eDP-1: preparing atomic, pipe: C
(kms_plane_multiple:4473) igt_kms-DEBUG: eDP-1: Setting property "CRTC_ID" to ...
(kms_plane_multiple:4473) igt_kms-DEBUG: display: }
(kms_plane_multiple:4473) igt_kms-DEBUG: display: C.0: plane_set_fb(0)
(kms_plane_multiple:4473) igt_kms-DEBUG: display: C.0: plane_set_size (0x0)
(kms_plane_multiple:4473) igt_kms-DEBUG: display: C.0: fb_set_position(0,0)
(kms_plane_multiple:4473) igt_kms-DEBUG: display: C.0: fb_set_size(0x0)
(kms_plane_multiple:4473) igt_kms-DEBUG: display: C.1: plane_set_fb(0)
(kms_plane_multiple:4473) igt_kms-DEBUG: display: C.1: plane_set_size (0x0)
(kms_plane_multiple:4473) igt_kms-DEBUG: display: C.1: fb_set_position(0,0)
(kms_plane_multiple:4473) igt_kms-DEBUG: display: C.1: fb_set_size(0x0)
(kms_plane_multiple:4473) igt_kms-DEBUG: display: C.2: plane_set_fb(0)
...
igt@kms_async_flips@async-flip-with-page-flip-events@pipe-a-edp-1-linear
igt@kms_async_flips@async-flip-with-page-flip-events@pipe-a-edp-1-linear
xe-2899-8f917568adaeea8b649e337e7d0e03bd03332253

Starting dynamic subtest: pipe-A-eDP-1-linear
(kms_async_flips:2328) CRITICAL: Test assertion failure function test_async_fl...
(kms_async_flips:2328) CRITICAL: Failed assertion: (fps / 1000) > (data->refre...
(kms_async_flips:2328) CRITICAL: FPS should be significantly higher than the r...
Dynamic subtest pipe-A-eDP-1-linear failed.
**** DEBUG ****
(kms_async_flips:2328) igt_kms-DEBUG: Test requirement passed: dir != -1
(kms_async_flips:2328) igt_kms-DEBUG: Test requirement passed: res > 0
(kms_async_flips:2328) DEBUG: Test requirement passed: !(is_joiner_mode(data->...
(kms_async_flips:2328) igt_fb-DEBUG: igt_create_fb_with_bo_size(width=2880, he...
(kms_async_flips:2328) igt_fb-DEBUG: igt_create_fb_with_bo_size(handle=1, pitc...
(kms_async_flips:2328) ioctl_wrappers-DEBUG: Test requirement passed: igt_has_...
(kms_async_flips:2328) igt_fb-DEBUG: Test requirement passed: cairo_surface_st...
(kms_async_flips:2328) igt_fb-DEBUG: Test requirement passed: cairo_surface_st...
(kms_async_flips:2328) igt_fb-DEBUG: igt_create_fb_with_bo_size(width=2880, he...
(kms_async_flips:2328) igt_fb-DEBUG: igt_create_fb_with_bo_size(handle=2, pitc...
(kms_async_flips:2328) ioctl_wrappers-DEBUG: Test requirement passed: igt_has_...
...
igt@kms_async_flips@async-flip-with-page-flip-events@pipe-a-edp-1-linear
xe-2895-0d2ff6d7ad3b6bf64c5c0e9a921fcfa925029526

Starting dynamic subtest: pipe-A-eDP-1-linear
(kms_async_flips:3146) CRITICAL: Test assertion failure function test_async_fl...
(kms_async_flips:3146) CRITICAL: Failed assertion: (fps / 1000) > (data->refre...
(kms_async_flips:3146) CRITICAL: FPS should be significantly higher than the r...
Dynamic subtest pipe-A-eDP-1-linear failed.
**** DEBUG ****
(kms_async_flips:3146) igt_kms-DEBUG: Test requirement passed: dir != -1
(kms_async_flips:3146) igt_kms-DEBUG: Test requirement passed: res > 0
(kms_async_flips:3146) DEBUG: Test requirement passed: !(is_joiner_mode(data->...
(kms_async_flips:3146) igt_fb-DEBUG: igt_create_fb_with_bo_size(width=2880, he...
(kms_async_flips:3146) igt_fb-DEBUG: igt_create_fb_with_bo_size(handle=1, pitc...
(kms_async_flips:3146) ioctl_wrappers-DEBUG: Test requirement passed: igt_has_...
(kms_async_flips:3146) intel_allocator_simple-DEBUG: Using simple allocator
(kms_async_flips:3146) intel_allocator_simple-DEBUG: <ial: 0x6438aeef1650, fd:...
(kms_async_flips:3146) intel_allocator_simple-DEBUG: <ial: 0x6438aeef1650, fd:...
(kms_async_flips:3146) intel_allocator_simple-DEBUG: Using simple allocator
(kms_async_flips:3146) intel_allocator_simple-DEBUG: <ial: 0x6438aeef1440, fd:...
...
igt@kms_async_flips@async-flip-with-page-flip-events@pipe-b-edp-1-linear
igt@kms_async_flips@async-flip-with-page-flip-events@pipe-b-edp-1-linear
xe-2899-8f917568adaeea8b649e337e7d0e03bd03332253

Starting dynamic subtest: pipe-B-eDP-1-linear
(kms_async_flips:2328) CRITICAL: Test assertion failure function test_async_fl...
(kms_async_flips:2328) CRITICAL: Failed assertion: (fps / 1000) > (data->refre...
(kms_async_flips:2328) CRITICAL: FPS should be significantly higher than the r...
Dynamic subtest pipe-B-eDP-1-linear failed.
**** DEBUG ****
(kms_async_flips:2328) igt_kms-DEBUG: Test requirement passed: dir != -1
(kms_async_flips:2328) igt_kms-DEBUG: Test requirement passed: res > 0
(kms_async_flips:2328) DEBUG: Test requirement passed: !(is_joiner_mode(data->...
(kms_async_flips:2328) igt_fb-DEBUG: igt_create_fb_with_bo_size(width=2880, he...
(kms_async_flips:2328) igt_fb-DEBUG: igt_create_fb_with_bo_size(handle=1, pitc...
(kms_async_flips:2328) ioctl_wrappers-DEBUG: Test requirement passed: igt_has_...
(kms_async_flips:2328) igt_fb-DEBUG: Test requirement passed: cairo_surface_st...
(kms_async_flips:2328) igt_fb-DEBUG: Test requirement passed: cairo_surface_st...
(kms_async_flips:2328) igt_fb-DEBUG: igt_create_fb_with_bo_size(width=2880, he...
(kms_async_flips:2328) igt_fb-DEBUG: igt_create_fb_with_bo_size(handle=2, pitc...
(kms_async_flips:2328) ioctl_wrappers-DEBUG: Test requirement passed: igt_has_...
...
igt@kms_async_flips@async-flip-with-page-flip-events@pipe-b-edp-1-linear
xe-2895-0d2ff6d7ad3b6bf64c5c0e9a921fcfa925029526

Starting dynamic subtest: pipe-B-eDP-1-linear
(kms_async_flips:3146) CRITICAL: Test assertion failure function test_async_fl...
(kms_async_flips:3146) CRITICAL: Failed assertion: (fps / 1000) > (data->refre...
(kms_async_flips:3146) CRITICAL: FPS should be significantly higher than the r...
Dynamic subtest pipe-B-eDP-1-linear failed.
**** DEBUG ****
(kms_async_flips:3146) igt_kms-DEBUG: Test requirement passed: dir != -1
(kms_async_flips:3146) igt_kms-DEBUG: Test requirement passed: res > 0
(kms_async_flips:3146) DEBUG: Test requirement passed: !(is_joiner_mode(data->...
(kms_async_flips:3146) igt_fb-DEBUG: igt_create_fb_with_bo_size(width=2880, he...
(kms_async_flips:3146) igt_fb-DEBUG: igt_create_fb_with_bo_size(handle=1, pitc...
(kms_async_flips:3146) ioctl_wrappers-DEBUG: Test requirement passed: igt_has_...
(kms_async_flips:3146) intel_allocator_simple-DEBUG: Using simple allocator
(kms_async_flips:3146) intel_allocator_simple-DEBUG: <ial: 0x6438aeef6530, fd:...
(kms_async_flips:3146) intel_allocator_simple-DEBUG: <ial: 0x6438aeef6530, fd:...
(kms_async_flips:3146) intel_allocator_simple-DEBUG: Using simple allocator
(kms_async_flips:3146) intel_allocator_simple-DEBUG: <ial: 0x6438aeef66f0, fd:...
...
igt@kms_async_flips@async-flip-with-page-flip-events@pipe-c-edp-1-linear
igt@kms_async_flips@async-flip-with-page-flip-events@pipe-c-edp-1-linear
xe-2899-8f917568adaeea8b649e337e7d0e03bd03332253

Starting dynamic subtest: pipe-C-eDP-1-linear
(kms_async_flips:2328) CRITICAL: Test assertion failure function test_async_fl...
(kms_async_flips:2328) CRITICAL: Failed assertion: (fps / 1000) > (data->refre...
(kms_async_flips:2328) CRITICAL: FPS should be significantly higher than the r...
Dynamic subtest pipe-C-eDP-1-linear failed.
**** DEBUG ****
(kms_async_flips:2328) igt_kms-DEBUG: Test requirement passed: dir != -1
(kms_async_flips:2328) igt_kms-DEBUG: Test requirement passed: res > 0
(kms_async_flips:2328) DEBUG: Test requirement passed: !(is_joiner_mode(data->...
(kms_async_flips:2328) igt_fb-DEBUG: igt_create_fb_with_bo_size(width=2880, he...
(kms_async_flips:2328) igt_fb-DEBUG: igt_create_fb_with_bo_size(handle=1, pitc...
(kms_async_flips:2328) ioctl_wrappers-DEBUG: Test requirement passed: igt_has_...
(kms_async_flips:2328) igt_fb-DEBUG: Test requirement passed: cairo_surface_st...
(kms_async_flips:2328) igt_fb-DEBUG: Test requirement passed: cairo_surface_st...
(kms_async_flips:2328) igt_fb-DEBUG: igt_create_fb_with_bo_size(width=2880, he...
(kms_async_flips:2328) igt_fb-DEBUG: igt_create_fb_with_bo_size(handle=2, pitc...
(kms_async_flips:2328) ioctl_wrappers-DEBUG: Test requirement passed: igt_has_...
...
igt@kms_async_flips@async-flip-with-page-flip-events@pipe-c-edp-1-linear
xe-2895-0d2ff6d7ad3b6bf64c5c0e9a921fcfa925029526

Starting dynamic subtest: pipe-C-eDP-1-linear
(kms_async_flips:3146) CRITICAL: Test assertion failure function test_async_fl...
(kms_async_flips:3146) CRITICAL: Failed assertion: (fps / 1000) > (data->refre...
(kms_async_flips:3146) CRITICAL: FPS should be significantly higher than the r...
Dynamic subtest pipe-C-eDP-1-linear failed.
**** DEBUG ****
(kms_async_flips:3146) igt_kms-DEBUG: Test requirement passed: dir != -1
(kms_async_flips:3146) igt_kms-DEBUG: Test requirement passed: res > 0
(kms_async_flips:3146) DEBUG: Test requirement passed: !(is_joiner_mode(data->...
(kms_async_flips:3146) igt_fb-DEBUG: igt_create_fb_with_bo_size(width=2880, he...
(kms_async_flips:3146) igt_fb-DEBUG: igt_create_fb_with_bo_size(handle=1, pitc...
(kms_async_flips:3146) ioctl_wrappers-DEBUG: Test requirement passed: igt_has_...
(kms_async_flips:3146) intel_allocator_simple-DEBUG: Using simple allocator
(kms_async_flips:3146) intel_allocator_simple-DEBUG: <ial: 0x6438aef48630, fd:...
(kms_async_flips:3146) intel_allocator_simple-DEBUG: <ial: 0x6438aef48630, fd:...
(kms_async_flips:3146) intel_allocator_simple-DEBUG: Using simple allocator
(kms_async_flips:3146) intel_allocator_simple-DEBUG: <ial: 0x6438aef48790, fd:...
...
igt@kms_vrr@cmrr@pipe-a-edp-1
igt@kms_vrr@cmrr@pipe-a-edp-1
xe-2899-8f917568adaeea8b649e337e7d0e03bd03332253

Starting subtest: cmrr
Starting dynamic subtest: pipe-A-eDP-1
(kms_vrr:2706) CRITICAL: Test assertion failure function test_cmrr, file ../te...
(kms_vrr:2706) CRITICAL: Failed assertion: result > 75
(kms_vrr:2706) CRITICAL: Refresh rate (60 Hz) 16666666ns: Target CMRR on thres...
Dynamic subtest pipe-A-eDP-1 failed.
**** DEBUG ****
(kms_vrr:2706) igt_kms-DEBUG: plane A.0: Setting property "CRTC_H" to 0x708/1800
(kms_vrr:2706) igt_kms-DEBUG: plane A.0: Setting property "FB_ID" to 0xe1/225
(kms_vrr:2706) igt_kms-DEBUG: plane A.0: Setting property "CRTC_ID" to 0x52/82
(kms_vrr:2706) igt_kms-DEBUG: plane A.0: Setting property "COLOR_ENCODING" to ...
(kms_vrr:2706) igt_kms-DEBUG: plane A.0: Setting property "COLOR_RANGE" to 0x0/0
(kms_vrr:2706) igt_kms-DEBUG: display: }
(kms_vrr:2706) DEBUG: event_ns - last_event_ns: 33337000 ns (30.00 Hz)
(kms_vrr:2706) igt_kms-DEBUG: display: A.0: plane_set_fb(226)
(kms_vrr:2706) igt_kms-DEBUG: display: A.0: plane_set_size (2880x1800)
(kms_vrr:2706) igt_kms-DEBUG: display: A.0: fb_set_position(0,0)
...
igt@kms_async_flips@async-flip-with-page-flip-events@pipe-a-dp-1-linear
igt@kms_async_flips@async-flip-with-page-flip-events@pipe-a-dp-1-linear
xe-2899-8f917568adaeea8b649e337e7d0e03bd03332253

Starting dynamic subtest: pipe-A-DP-1-linear
(kms_async_flips:2328) CRITICAL: Test assertion failure function test_async_fl...
(kms_async_flips:2328) CRITICAL: Failed assertion: (fps / 1000) > (data->refre...
(kms_async_flips:2328) CRITICAL: FPS should be significantly higher than the r...
Dynamic subtest pipe-A-DP-1-linear failed.
**** DEBUG ****
(kms_async_flips:2328) igt_kms-DEBUG: Test requirement passed: dir != -1
(kms_async_flips:2328) igt_kms-DEBUG: Test requirement passed: res > 0
(kms_async_flips:2328) DEBUG: Test requirement passed: !(is_joiner_mode(data->...
(kms_async_flips:2328) igt_fb-DEBUG: igt_create_fb_with_bo_size(width=3840, he...
(kms_async_flips:2328) igt_fb-DEBUG: igt_create_fb_with_bo_size(handle=1, pitc...
(kms_async_flips:2328) ioctl_wrappers-DEBUG: Test requirement passed: igt_has_...
(kms_async_flips:2328) igt_fb-DEBUG: Test requirement passed: cairo_surface_st...
(kms_async_flips:2328) igt_fb-DEBUG: Test requirement passed: cairo_surface_st...
(kms_async_flips:2328) igt_fb-DEBUG: igt_create_fb_with_bo_size(width=3840, he...
(kms_async_flips:2328) igt_fb-DEBUG: igt_create_fb_with_bo_size(handle=2, pitc...
(kms_async_flips:2328) ioctl_wrappers-DEBUG: Test requirement passed: igt_has_...
...
igt@kms_async_flips@async-flip-with-page-flip-events@pipe-a-dp-1-linear
xe-2895-0d2ff6d7ad3b6bf64c5c0e9a921fcfa925029526

Starting dynamic subtest: pipe-A-DP-1-linear
(kms_async_flips:3146) CRITICAL: Test assertion failure function test_async_fl...
(kms_async_flips:3146) CRITICAL: Failed assertion: (fps / 1000) > (data->refre...
(kms_async_flips:3146) CRITICAL: FPS should be significantly higher than the r...
Dynamic subtest pipe-A-DP-1-linear failed.
**** DEBUG ****
(kms_async_flips:3146) igt_kms-DEBUG: Test requirement passed: dir != -1
(kms_async_flips:3146) igt_kms-DEBUG: Test requirement passed: res > 0
(kms_async_flips:3146) DEBUG: Test requirement passed: !(is_joiner_mode(data->...
(kms_async_flips:3146) igt_fb-DEBUG: igt_create_fb_with_bo_size(width=3840, he...
(kms_async_flips:3146) igt_fb-DEBUG: igt_create_fb_with_bo_size(handle=1, pitc...
(kms_async_flips:3146) ioctl_wrappers-DEBUG: Test requirement passed: igt_has_...
(kms_async_flips:3146) intel_allocator_simple-DEBUG: Using simple allocator
(kms_async_flips:3146) intel_allocator_simple-DEBUG: <ial: 0x6438aef0ce10, fd:...
(kms_async_flips:3146) intel_allocator_simple-DEBUG: <ial: 0x6438aef0ce10, fd:...
(kms_async_flips:3146) intel_allocator_simple-DEBUG: Using simple allocator
(kms_async_flips:3146) intel_allocator_simple-DEBUG: <ial: 0x6438aef0cef0, fd:...
...
igt@kms_async_flips@async-flip-with-page-flip-events@pipe-b-dp-1-linear
igt@kms_async_flips@async-flip-with-page-flip-events@pipe-b-dp-1-linear
xe-2899-8f917568adaeea8b649e337e7d0e03bd03332253

Starting dynamic subtest: pipe-B-DP-1-linear
(kms_async_flips:2328) CRITICAL: Test assertion failure function test_async_fl...
(kms_async_flips:2328) CRITICAL: Failed assertion: (fps / 1000) > (data->refre...
(kms_async_flips:2328) CRITICAL: FPS should be significantly higher than the r...
Dynamic subtest pipe-B-DP-1-linear failed.
**** DEBUG ****
(kms_async_flips:2328) igt_kms-DEBUG: Test requirement passed: dir != -1
(kms_async_flips:2328) igt_kms-DEBUG: Test requirement passed: res > 0
(kms_async_flips:2328) DEBUG: Test requirement passed: !(is_joiner_mode(data->...
(kms_async_flips:2328) igt_fb-DEBUG: igt_create_fb_with_bo_size(width=3840, he...
(kms_async_flips:2328) igt_fb-DEBUG: igt_create_fb_with_bo_size(handle=1, pitc...
(kms_async_flips:2328) ioctl_wrappers-DEBUG: Test requirement passed: igt_has_...
(kms_async_flips:2328) igt_fb-DEBUG: Test requirement passed: cairo_surface_st...
(kms_async_flips:2328) igt_fb-DEBUG: Test requirement passed: cairo_surface_st...
(kms_async_flips:2328) igt_fb-DEBUG: igt_create_fb_with_bo_size(width=3840, he...
(kms_async_flips:2328) igt_fb-DEBUG: igt_create_fb_with_bo_size(handle=2, pitc...
(kms_async_flips:2328) ioctl_wrappers-DEBUG: Test requirement passed: igt_has_...
...
igt@kms_async_flips@async-flip-with-page-flip-events@pipe-b-dp-1-linear
xe-2895-0d2ff6d7ad3b6bf64c5c0e9a921fcfa925029526

Starting dynamic subtest: pipe-B-DP-1-linear
(kms_async_flips:3146) CRITICAL: Test assertion failure function test_async_fl...
(kms_async_flips:3146) CRITICAL: Failed assertion: (fps / 1000) > (data->refre...
(kms_async_flips:3146) CRITICAL: FPS should be significantly higher than the r...
Dynamic subtest pipe-B-DP-1-linear failed.
**** DEBUG ****
(kms_async_flips:3146) igt_kms-DEBUG: Test requirement passed: dir != -1
(kms_async_flips:3146) igt_kms-DEBUG: Test requirement passed: res > 0
(kms_async_flips:3146) DEBUG: Test requirement passed: !(is_joiner_mode(data->...
(kms_async_flips:3146) igt_fb-DEBUG: igt_create_fb_with_bo_size(width=3840, he...
(kms_async_flips:3146) igt_fb-DEBUG: igt_create_fb_with_bo_size(handle=1, pitc...
(kms_async_flips:3146) ioctl_wrappers-DEBUG: Test requirement passed: igt_has_...
(kms_async_flips:3146) intel_allocator_simple-DEBUG: Using simple allocator
(kms_async_flips:3146) intel_allocator_simple-DEBUG: <ial: 0x6438aef03810, fd:...
(kms_async_flips:3146) intel_allocator_simple-DEBUG: <ial: 0x6438aef03810, fd:...
(kms_async_flips:3146) intel_allocator_simple-DEBUG: Using simple allocator
(kms_async_flips:3146) intel_allocator_simple-DEBUG: <ial: 0x6438aef03810, fd:...
...
igt@kms_async_flips@async-flip-with-page-flip-events@pipe-c-dp-1-linear
igt@kms_async_flips@async-flip-with-page-flip-events@pipe-c-dp-1-linear
xe-2899-8f917568adaeea8b649e337e7d0e03bd03332253

Starting dynamic subtest: pipe-C-DP-1-linear
(kms_async_flips:2328) CRITICAL: Test assertion failure function test_async_fl...
(kms_async_flips:2328) CRITICAL: Failed assertion: (fps / 1000) > (data->refre...
(kms_async_flips:2328) CRITICAL: FPS should be significantly higher than the r...
Dynamic subtest pipe-C-DP-1-linear failed.
**** DEBUG ****
(kms_async_flips:2328) igt_kms-DEBUG: Test requirement passed: dir != -1
(kms_async_flips:2328) igt_kms-DEBUG: Test requirement passed: res > 0
(kms_async_flips:2328) DEBUG: Test requirement passed: !(is_joiner_mode(data->...
(kms_async_flips:2328) igt_fb-DEBUG: igt_create_fb_with_bo_size(width=3840, he...
(kms_async_flips:2328) igt_fb-DEBUG: igt_create_fb_with_bo_size(handle=1, pitc...
(kms_async_flips:2328) ioctl_wrappers-DEBUG: Test requirement passed: igt_has_...
(kms_async_flips:2328) igt_fb-DEBUG: Test requirement passed: cairo_surface_st...
(kms_async_flips:2328) igt_fb-DEBUG: Test requirement passed: cairo_surface_st...
(kms_async_flips:2328) igt_fb-DEBUG: igt_create_fb_with_bo_size(width=3840, he...
(kms_async_flips:2328) igt_fb-DEBUG: igt_create_fb_with_bo_size(handle=2, pitc...
(kms_async_flips:2328) ioctl_wrappers-DEBUG: Test requirement passed: igt_has_...
...
igt@kms_async_flips@async-flip-with-page-flip-events@pipe-c-dp-1-linear
xe-2895-0d2ff6d7ad3b6bf64c5c0e9a921fcfa925029526

Starting dynamic subtest: pipe-C-DP-1-linear
(kms_async_flips:3146) CRITICAL: Test assertion failure function test_async_fl...
(kms_async_flips:3146) CRITICAL: Failed assertion: (fps / 1000) > (data->refre...
(kms_async_flips:3146) CRITICAL: FPS should be significantly higher than the r...
Dynamic subtest pipe-C-DP-1-linear failed.
**** DEBUG ****
(kms_async_flips:3146) igt_kms-DEBUG: Test requirement passed: dir != -1
(kms_async_flips:3146) igt_kms-DEBUG: Test requirement passed: res > 0
(kms_async_flips:3146) DEBUG: Test requirement passed: !(is_joiner_mode(data->...
(kms_async_flips:3146) igt_fb-DEBUG: igt_create_fb_with_bo_size(width=3840, he...
(kms_async_flips:3146) igt_fb-DEBUG: igt_create_fb_with_bo_size(handle=1, pitc...
(kms_async_flips:3146) ioctl_wrappers-DEBUG: Test requirement passed: igt_has_...
(kms_async_flips:3146) intel_allocator_simple-DEBUG: Using simple allocator
(kms_async_flips:3146) intel_allocator_simple-DEBUG: <ial: 0x6438aef27580, fd:...
(kms_async_flips:3146) intel_allocator_simple-DEBUG: <ial: 0x6438aef27580, fd:...
(kms_async_flips:3146) intel_allocator_simple-DEBUG: Using simple allocator
(kms_async_flips:3146) intel_allocator_simple-DEBUG: <ial: 0x6438aef27580, fd:...
...
igt@kms_async_flips@async-flip-with-page-flip-events-atomic@pipe-a-dp-1-linear
igt@kms_async_flips@async-flip-with-page-flip-events-atomic@pipe-a-dp-1-linear
xe-2899-8f917568adaeea8b649e337e7d0e03bd03332253

Starting dynamic subtest: pipe-A-DP-1-linear
(kms_async_flips:2967) CRITICAL: Test assertion failure function test_async_fl...
(kms_async_flips:2967) CRITICAL: Failed assertion: (fps / 1000) > (data->refre...
(kms_async_flips:2967) CRITICAL: FPS should be significantly higher than the r...
Dynamic subtest pipe-A-DP-1-linear failed.
**** DEBUG ****
A.0: fb_set_size(3840x2160)
(kms_async_flips:2967) igt_kms-DEBUG: display: commit {
(kms_async_flips:2967) igt_kms-DEBUG: display:     populating plane data: A.0,...
(kms_async_flips:2967) igt_kms-DEBUG: plane A.0: Setting property "SRC_X" to 0...
(kms_async_flips:2967) igt_kms-DEBUG: plane A.0: Setting property "SRC_Y" to 0...
(kms_async_flips:2967) igt_kms-DEBUG: plane A.0: Setting property "SRC_W" to 0...
(kms_async_flips:2967) igt_kms-DEBUG: plane A.0: Setting property "SRC_H" to 0...
(kms_async_flips:2967) igt_kms-DEBUG: plane A.0: Setting property "CRTC_W" to ...
(kms_async_flips:2967) igt_kms-DEBUG: plane A.0: Setting property "CRTC_H" to ...
(kms_async_flips:2967) igt_kms-DEBUG: plane A.0: Setting property "FB_ID" to 0...
(kms_async_flips:2967) igt_kms-DEBUG: plane A.0: Setting property "CRTC_ID" to...
...
igt@kms_async_flips@async-flip-with-page-flip-events-atomic@pipe-a-dp-1-linear
xe-2895-0d2ff6d7ad3b6bf64c5c0e9a921fcfa925029526

Starting dynamic subtest: pipe-A-DP-1-linear
(kms_async_flips:4361) CRITICAL: Test assertion failure function test_async_fl...
(kms_async_flips:4361) CRITICAL: Failed assertion: (fps / 1000) > (data->refre...
(kms_async_flips:4361) CRITICAL: FPS should be significantly higher than the r...
Dynamic subtest pipe-A-DP-1-linear failed.
**** DEBUG ****
A.0: fb_set_size(3840x2160)
(kms_async_flips:4361) igt_kms-DEBUG: display: commit {
(kms_async_flips:4361) igt_kms-DEBUG: display:     populating plane data: A.0,...
(kms_async_flips:4361) igt_kms-DEBUG: plane A.0: Setting property "SRC_X" to 0...
(kms_async_flips:4361) igt_kms-DEBUG: plane A.0: Setting property "SRC_Y" to 0...
(kms_async_flips:4361) igt_kms-DEBUG: plane A.0: Setting property "SRC_W" to 0...
(kms_async_flips:4361) igt_kms-DEBUG: plane A.0: Setting property "SRC_H" to 0...
(kms_async_flips:4361) igt_kms-DEBUG: plane A.0: Setting property "CRTC_W" to ...
(kms_async_flips:4361) igt_kms-DEBUG: plane A.0: Setting property "CRTC_H" to ...
(kms_async_flips:4361) igt_kms-DEBUG: plane A.0: Setting property "FB_ID" to 0...
(kms_async_flips:4361) igt_kms-DEBUG: plane A.0: Setting property "CRTC_ID" to...
...
igt@kms_async_flips@async-flip-with-page-flip-events-atomic@pipe-b-dp-1-linear
igt@kms_async_flips@async-flip-with-page-flip-events-atomic@pipe-b-dp-1-linear
xe-2899-8f917568adaeea8b649e337e7d0e03bd03332253

Starting dynamic subtest: pipe-B-DP-1-linear
(kms_async_flips:2967) CRITICAL: Test assertion failure function test_async_fl...
(kms_async_flips:2967) CRITICAL: Failed assertion: (fps / 1000) > (data->refre...
(kms_async_flips:2967) CRITICAL: FPS should be significantly higher than the r...
Dynamic subtest pipe-B-DP-1-linear failed.
**** DEBUG ****
B.0: fb_set_size(3840x2160)
(kms_async_flips:2967) igt_kms-DEBUG: display: commit {
(kms_async_flips:2967) igt_kms-DEBUG: display:     populating plane data: B.0,...
(kms_async_flips:2967) igt_kms-DEBUG: plane B.0: Setting property "SRC_X" to 0...
(kms_async_flips:2967) igt_kms-DEBUG: plane B.0: Setting property "SRC_Y" to 0...
(kms_async_flips:2967) igt_kms-DEBUG: plane B.0: Setting property "SRC_W" to 0...
(kms_async_flips:2967) igt_kms-DEBUG: plane B.0: Setting property "SRC_H" to 0...
(kms_async_flips:2967) igt_kms-DEBUG: plane B.0: Setting property "CRTC_W" to ...
(kms_async_flips:2967) igt_kms-DEBUG: plane B.0: Setting property "CRTC_H" to ...
(kms_async_flips:2967) igt_kms-DEBUG: plane B.0: Setting property "FB_ID" to 0...
(kms_async_flips:2967) igt_kms-DEBUG: plane B.0: Setting property "CRTC_ID" to...
...
igt@kms_async_flips@async-flip-with-page-flip-events-atomic@pipe-b-dp-1-linear
xe-2895-0d2ff6d7ad3b6bf64c5c0e9a921fcfa925029526

Starting dynamic subtest: pipe-B-DP-1-linear
(kms_async_flips:4361) CRITICAL: Test assertion failure function test_async_fl...
(kms_async_flips:4361) CRITICAL: Failed assertion: (fps / 1000) > (data->refre...
(kms_async_flips:4361) CRITICAL: FPS should be significantly higher than the r...
Dynamic subtest pipe-B-DP-1-linear failed.
**** DEBUG ****
B.0: fb_set_size(3840x2160)
(kms_async_flips:4361) igt_kms-DEBUG: display: commit {
(kms_async_flips:4361) igt_kms-DEBUG: display:     populating plane data: B.0,...
(kms_async_flips:4361) igt_kms-DEBUG: plane B.0: Setting property "SRC_X" to 0...
(kms_async_flips:4361) igt_kms-DEBUG: plane B.0: Setting property "SRC_Y" to 0...
(kms_async_flips:4361) igt_kms-DEBUG: plane B.0: Setting property "SRC_W" to 0...
(kms_async_flips:4361) igt_kms-DEBUG: plane B.0: Setting property "SRC_H" to 0...
(kms_async_flips:4361) igt_kms-DEBUG: plane B.0: Setting property "CRTC_W" to ...
(kms_async_flips:4361) igt_kms-DEBUG: plane B.0: Setting property "CRTC_H" to ...
(kms_async_flips:4361) igt_kms-DEBUG: plane B.0: Setting property "FB_ID" to 0...
(kms_async_flips:4361) igt_kms-DEBUG: plane B.0: Setting property "CRTC_ID" to...
...
igt@kms_async_flips@async-flip-with-page-flip-events-atomic@pipe-c-dp-1-linear
igt@kms_async_flips@async-flip-with-page-flip-events-atomic@pipe-c-dp-1-linear
xe-2899-8f917568adaeea8b649e337e7d0e03bd03332253

Starting dynamic subtest: pipe-C-DP-1-linear
(kms_async_flips:2967) CRITICAL: Test assertion failure function test_async_fl...
(kms_async_flips:2967) CRITICAL: Failed assertion: (fps / 1000) > (data->refre...
(kms_async_flips:2967) CRITICAL: FPS should be significantly higher than the r...
Dynamic subtest pipe-C-DP-1-linear failed.
**** DEBUG ****
C.0: fb_set_size(3840x2160)
(kms_async_flips:2967) igt_kms-DEBUG: display: commit {
(kms_async_flips:2967) igt_kms-DEBUG: display:     populating plane data: C.0,...
(kms_async_flips:2967) igt_kms-DEBUG: plane C.0: Setting property "SRC_X" to 0...
(kms_async_flips:2967) igt_kms-DEBUG: plane C.0: Setting property "SRC_Y" to 0...
(kms_async_flips:2967) igt_kms-DEBUG: plane C.0: Setting property "SRC_W" to 0...
(kms_async_flips:2967) igt_kms-DEBUG: plane C.0: Setting property "SRC_H" to 0...
(kms_async_flips:2967) igt_kms-DEBUG: plane C.0: Setting property "CRTC_W" to ...
(kms_async_flips:2967) igt_kms-DEBUG: plane C.0: Setting property "CRTC_H" to ...
(kms_async_flips:2967) igt_kms-DEBUG: plane C.0: Setting property "FB_ID" to 0...
(kms_async_flips:2967) igt_kms-DEBUG: plane C.0: Setting property "CRTC_ID" to...
...
igt@kms_async_flips@async-flip-with-page-flip-events-atomic@pipe-c-dp-1-linear
xe-2895-0d2ff6d7ad3b6bf64c5c0e9a921fcfa925029526

Starting dynamic subtest: pipe-C-DP-1-linear
(kms_async_flips:4361) CRITICAL: Test assertion failure function test_async_fl...
(kms_async_flips:4361) CRITICAL: Failed assertion: (fps / 1000) > (data->refre...
(kms_async_flips:4361) CRITICAL: FPS should be significantly higher than the r...
Dynamic subtest pipe-C-DP-1-linear failed.
**** DEBUG ****
C.0: fb_set_size(3840x2160)
(kms_async_flips:4361) igt_kms-DEBUG: display: commit {
(kms_async_flips:4361) igt_kms-DEBUG: display:     populating plane data: C.0,...
(kms_async_flips:4361) igt_kms-DEBUG: plane C.0: Setting property "SRC_X" to 0...
(kms_async_flips:4361) igt_kms-DEBUG: plane C.0: Setting property "SRC_Y" to 0...
(kms_async_flips:4361) igt_kms-DEBUG: plane C.0: Setting property "SRC_W" to 0...
(kms_async_flips:4361) igt_kms-DEBUG: plane C.0: Setting property "SRC_H" to 0...
(kms_async_flips:4361) igt_kms-DEBUG: plane C.0: Setting property "CRTC_W" to ...
(kms_async_flips:4361) igt_kms-DEBUG: plane C.0: Setting property "CRTC_H" to ...
(kms_async_flips:4361) igt_kms-DEBUG: plane C.0: Setting property "FB_ID" to 0...
(kms_async_flips:4361) igt_kms-DEBUG: plane C.0: Setting property "CRTC_ID" to...
...
igt@kms_content_protection@lic-type-1@pipe-a-dp-1
igt@kms_content_protection@lic-type-1@pipe-a-dp-1
xe-2899-8f917568adaeea8b649e337e7d0e03bd03332253

Starting subtest: lic-type-1
Starting dynamic subtest: pipe-A-DP-1
(kms_content_protection:2227) CRITICAL: Test assertion failure function test_c...
(kms_content_protection:2227) CRITICAL: Failed assertion: !ret
(kms_content_protection:2227) CRITICAL: Content Protection LIC Failed
Dynamic subtest pipe-A-DP-1 failed.
**** DEBUG ****
(kms_content_protection:2227) igt_kms-DEBUG: Test requirement passed: plane_id...
(kms_content_protection:2227) igt_kms-DEBUG: display: A.0: plane_set_fb(231)
(kms_content_protection:2227) igt_kms-DEBUG: display: A.0: plane_set_size (384...
(kms_content_protection:2227) igt_kms-DEBUG: display: A.0: fb_set_position(0,0)
(kms_content_protection:2227) igt_kms-DEBUG: display: A.0: fb_set_size(3840x21...
(kms_content_protection:2227) igt_kms-DEBUG: display: commit {
(kms_content_protection:2227) igt_kms-DEBUG: display:     populating plane dat...
(kms_content_protection:2227) igt_kms-DEBUG: plane A.0: Setting property "SRC_...
(kms_content_protection:2227) igt_kms-DEBUG: plane A.0: Setting property "SRC_...
(kms_content_protection:2227) igt_kms-DEBUG: plane A.0: Setting property "SRC_...
...
igt@kms_content_protection@lic-type-1@pipe-a-dp-1
xe-2895-0d2ff6d7ad3b6bf64c5c0e9a921fcfa925029526

Starting subtest: lic-type-1
Starting dynamic subtest: pipe-A-DP-1
(kms_content_protection:5560) CRITICAL: Test assertion failure function test_c...
(kms_content_protection:5560) CRITICAL: Failed assertion: !ret
(kms_content_protection:5560) CRITICAL: Content Protection LIC Failed
Dynamic subtest pipe-A-DP-1 failed.
**** DEBUG ****
(kms_content_protection:5560) igt_kms-DEBUG: Test requirement passed: plane_id...
(kms_content_protection:5560) igt_kms-DEBUG: display: A.0: plane_set_fb(227)
(kms_content_protection:5560) igt_kms-DEBUG: display: A.0: plane_set_size (384...
(kms_content_protection:5560) igt_kms-DEBUG: display: A.0: fb_set_position(0,0)
(kms_content_protection:5560) igt_kms-DEBUG: display: A.0: fb_set_size(3840x21...
(kms_content_protection:5560) igt_kms-DEBUG: display: commit {
(kms_content_protection:5560) igt_kms-DEBUG: display:     populating plane dat...
(kms_content_protection:5560) igt_kms-DEBUG: plane A.0: Setting property "SRC_...
(kms_content_protection:5560) igt_kms-DEBUG: plane A.0: Setting property "SRC_...
(kms_content_protection:5560) igt_kms-DEBUG: plane A.0: Setting property "SRC_...
...
igt@kms_content_protection@uevent@pipe-a-dp-1
igt@kms_content_protection@uevent@pipe-a-dp-1
xe-2895-0d2ff6d7ad3b6bf64c5c0e9a921fcfa925029526

Starting subtest: uevent
Starting dynamic subtest: pipe-A-DP-1
(kms_content_protection:5628) CRITICAL: Test assertion failure function wait_f...
(kms_content_protection:5628) CRITICAL: Failed assertion: igt_connector_event_...
(kms_content_protection:5628) CRITICAL: uevent is not receivedDynamic subtest ...
**** DEBUG ****
(kms_content_protection:5628) igt_kms-DEBUG: Test requirement passed: plane_id...
(kms_content_protection:5628) igt_kms-DEBUG: display: A.0: plane_set_fb(227)
(kms_content_protection:5628) igt_kms-DEBUG: display: A.0: plane_set_size (384...
(kms_content_protection:5628) igt_kms-DEBUG: display: A.0: fb_set_position(0,0)
(kms_content_protection:5628) igt_kms-DEBUG: display: A.0: fb_set_size(3840x21...
(kms_content_protection:5628) igt_kms-DEBUG: display: commit {
(kms_content_protection:5628) igt_kms-DEBUG: display:     populating plane dat...
(kms_content_protection:5628) igt_kms-DEBUG: plane A.0: Setting property "SRC_...
(kms_content_protection:5628) igt_kms-DEBUG: plane A.0: Setting property "SRC_...
(kms_content_protection:5628) igt_kms-DEBUG: plane A.0: Setting property "SRC_...
(kms_content_protection:5628) igt_kms-DEBUG: plane A.0: Setting property "SRC_...
...
igt@kms_plane_cursor@overlay@pipe-b-dp-1-size-64
igt@kms_plane_cursor@overlay@pipe-b-dp-1-size-64
xe-2895-0d2ff6d7ad3b6bf64c5c0e9a921fcfa925029526

Starting dynamic subtest: pipe-B-DP-1-size-64
(kms_plane_cursor:10100) igt_pipe_crc-CRITICAL: Test assertion failure functio...
(kms_plane_cursor:10100) igt_pipe_crc-CRITICAL: Failed assertion: !mismatch ||...
Dynamic subtest pipe-B-DP-1-size-64 failed.
**** DEBUG ****
(kms_plane_cursor:10100) igt_kms-DEBUG: plane C.0: Setting property "CRTC_ID" ...
(kms_plane_cursor:10100) igt_kms-DEBUG: plane C.0: Setting property "rotation"...
(kms_plane_cursor:10100) igt_kms-DEBUG: plane C.0: Setting property "COLOR_ENC...
(kms_plane_cursor:10100) igt_kms-DEBUG: plane C.0: Setting property "COLOR_RAN...
(kms_plane_cursor:10100) igt_kms-DEBUG: plane C.0: Setting property "pixel ble...
(kms_plane_cursor:10100) igt_kms-DEBUG: plane C.0: Setting property "alpha" to...
(kms_plane_cursor:10100) igt_kms-DEBUG: plane C.0: Setting property "FB_DAMAGE...
(kms_plane_cursor:10100) igt_kms-DEBUG: plane C.0: Setting property "SCALING_F...
(kms_plane_cursor:10100) igt_kms-DEBUG: display:     populating plane data: C....
(kms_plane_cursor:10100) igt_kms-DEBUG: plane C.1: Setting property "SRC_X" to...
(kms_plane_cursor:10100) igt_kms-DEBUG: plane C.1: Setting property "SRC_Y" to...
(kms_plane_cursor:10100) igt_kms-DEBUG: plane C.1: Setting property "SRC_W" to...
...
igt@kms_plane_cursor@overlay@pipe-b-dp-1-size-128
igt@kms_plane_cursor@overlay@pipe-b-dp-1-size-128
xe-2895-0d2ff6d7ad3b6bf64c5c0e9a921fcfa925029526

Starting dynamic subtest: pipe-B-DP-1-size-128
(kms_plane_cursor:10100) igt_pipe_crc-CRITICAL: Test assertion failure functio...
(kms_plane_cursor:10100) igt_pipe_crc-CRITICAL: Failed assertion: !mismatch ||...
Dynamic subtest pipe-B-DP-1-size-128 failed.
**** DEBUG ****
(kms_plane_cursor:10100) DEBUG: Test requirement passed: !(size > data->max_cu...
(kms_plane_cursor:10100) igt_fb-DEBUG: igt_create_fb_with_bo_size(width=3840, ...
(kms_plane_cursor:10100) igt_fb-DEBUG: igt_create_fb_with_bo_size(handle=1, pi...
(kms_plane_cursor:10100) ioctl_wrappers-DEBUG: Test requirement passed: igt_ha...
(kms_plane_cursor:10100) intel_allocator_simple-DEBUG: Using simple allocator
(kms_plane_cursor:10100) intel_allocator_simple-DEBUG: <ial: 0x55bf19145a80, f...
(kms_plane_cursor:10100) intel_allocator_simple-DEBUG: <ial: 0x55bf19145a80, f...
(kms_plane_cursor:10100) intel_allocator_simple-DEBUG: Using simple allocator
(kms_plane_cursor:10100) intel_allocator_simple-DEBUG: <ial: 0x55bf19145a80, f...
(kms_plane_cursor:10100) intel_allocator_simple-DEBUG: <ial: 0x55bf19145a80, f...
(kms_plane_cursor:10100) igt_fb-DEBUG: igt_create_fb_with_bo_size(width=1920, ...
(kms_plane_cursor:10100) igt_fb-DEBUG: igt_create_fb_with_bo_size(handle=2, pi...
...
igt@kms_plane_cursor@overlay@pipe-b-dp-1-size-256
igt@kms_plane_cursor@overlay@pipe-b-dp-1-size-256
xe-2895-0d2ff6d7ad3b6bf64c5c0e9a921fcfa925029526

Starting dynamic subtest: pipe-B-DP-1-size-256
(kms_plane_cursor:10100) igt_pipe_crc-CRITICAL: Test assertion failure functio...
(kms_plane_cursor:10100) igt_pipe_crc-CRITICAL: Failed assertion: !mismatch ||...
Dynamic subtest pipe-B-DP-1-size-256 failed.
**** DEBUG ****
(kms_plane_cursor:10100) DEBUG: Test requirement passed: !(size > data->max_cu...
(kms_plane_cursor:10100) igt_fb-DEBUG: igt_create_fb_with_bo_size(width=3840, ...
(kms_plane_cursor:10100) igt_fb-DEBUG: igt_create_fb_with_bo_size(handle=1, pi...
(kms_plane_cursor:10100) ioctl_wrappers-DEBUG: Test requirement passed: igt_ha...
(kms_plane_cursor:10100) intel_allocator_simple-DEBUG: Using simple allocator
(kms_plane_cursor:10100) intel_allocator_simple-DEBUG: <ial: 0x55bf19145a80, f...
(kms_plane_cursor:10100) intel_allocator_simple-DEBUG: <ial: 0x55bf19145a80, f...
(kms_plane_cursor:10100) intel_allocator_simple-DEBUG: Using simple allocator
(kms_plane_cursor:10100) intel_allocator_simple-DEBUG: <ial: 0x55bf19145a80, f...
(kms_plane_cursor:10100) intel_allocator_simple-DEBUG: <ial: 0x55bf19145a80, f...
(kms_plane_cursor:10100) igt_fb-DEBUG: igt_create_fb_with_bo_size(width=1920, ...
(kms_plane_cursor:10100) igt_fb-DEBUG: igt_create_fb_with_bo_size(handle=2, pi...
...
igt@kms_plane_cursor@primary@pipe-b-dp-1-size-64
igt@kms_plane_cursor@primary@pipe-b-dp-1-size-64
xe-2895-0d2ff6d7ad3b6bf64c5c0e9a921fcfa925029526

Starting dynamic subtest: pipe-B-DP-1-size-64
(kms_plane_cursor:10661) igt_pipe_crc-CRITICAL: Test assertion failure functio...
(kms_plane_cursor:10661) igt_pipe_crc-CRITICAL: Failed assertion: !mismatch ||...
Dynamic subtest pipe-B-DP-1-size-64 failed.
**** DEBUG ****
(kms_plane_cursor:10661) igt_kms-DEBUG: plane B.4: Setting property "SRC_Y" to...
(kms_plane_cursor:10661) igt_kms-DEBUG: plane B.4: Setting property "SRC_W" to...
(kms_plane_cursor:10661) igt_kms-DEBUG: plane B.4: Setting property "SRC_H" to...
(kms_plane_cursor:10661) igt_kms-DEBUG: plane B.4: Setting property "CRTC_X" t...
(kms_plane_cursor:10661) igt_kms-DEBUG: plane B.4: Setting property "CRTC_Y" t...
(kms_plane_cursor:10661) igt_kms-DEBUG: plane B.4: Setting property "CRTC_W" t...
(kms_plane_cursor:10661) igt_kms-DEBUG: plane B.4: Setting property "CRTC_H" t...
(kms_plane_cursor:10661) igt_kms-DEBUG: plane B.4: Setting property "FB_ID" to...
(kms_plane_cursor:10661) igt_kms-DEBUG: plane B.4: Setting property "CRTC_ID" ...
(kms_plane_cursor:10661) igt_kms-DEBUG: plane B.4: Setting property "rotation"...
(kms_plane_cursor:10661) igt_kms-DEBUG: plane B.4: Setting property "COLOR_ENC...
(kms_plane_cursor:10661) igt_kms-DEBUG: plane B.4: Setting property "COLOR_RAN...
...
igt@kms_plane_cursor@primary@pipe-b-dp-1-size-128
igt@kms_plane_cursor@primary@pipe-b-dp-1-size-128
xe-2895-0d2ff6d7ad3b6bf64c5c0e9a921fcfa925029526

Starting dynamic subtest: pipe-B-DP-1-size-128
(kms_plane_cursor:10661) igt_pipe_crc-CRITICAL: Test assertion failure functio...
(kms_plane_cursor:10661) igt_pipe_crc-CRITICAL: Failed assertion: !mismatch ||...
Dynamic subtest pipe-B-DP-1-size-128 failed.
**** DEBUG ****
(kms_plane_cursor:10661) DEBUG: Test requirement passed: !(size > data->max_cu...
(kms_plane_cursor:10661) igt_fb-DEBUG: igt_create_fb_with_bo_size(width=3840, ...
(kms_plane_cursor:10661) igt_fb-DEBUG: igt_create_fb_with_bo_size(handle=1, pi...
(kms_plane_cursor:10661) ioctl_wrappers-DEBUG: Test requirement passed: igt_ha...
(kms_plane_cursor:10661) intel_allocator_simple-DEBUG: Using simple allocator
(kms_plane_cursor:10661) intel_allocator_simple-DEBUG: <ial: 0x61b3a6f2d850, f...
(kms_plane_cursor:10661) intel_allocator_simple-DEBUG: <ial: 0x61b3a6f2d850, f...
(kms_plane_cursor:10661) intel_allocator_simple-DEBUG: Using simple allocator
(kms_plane_cursor:10661) intel_allocator_simple-DEBUG: <ial: 0x61b3a6f2d6c0, f...
(kms_plane_cursor:10661) intel_allocator_simple-DEBUG: <ial: 0x61b3a6f2d6c0, f...
(kms_plane_cursor:10661) igt_fb-DEBUG: igt_create_fb_with_bo_size(width=128, h...
(kms_plane_cursor:10661) igt_fb-DEBUG: igt_create_fb_with_bo_size(handle=2, pi...
...
igt@kms_plane_cursor@primary@pipe-b-dp-1-size-256
igt@kms_plane_cursor@primary@pipe-b-dp-1-size-256
xe-2895-0d2ff6d7ad3b6bf64c5c0e9a921fcfa925029526

Starting dynamic subtest: pipe-B-DP-1-size-256
(kms_plane_cursor:10661) igt_pipe_crc-CRITICAL: Test assertion failure functio...
(kms_plane_cursor:10661) igt_pipe_crc-CRITICAL: Failed assertion: !mismatch ||...
Dynamic subtest pipe-B-DP-1-size-256 failed.
**** DEBUG ****
(kms_plane_cursor:10661) DEBUG: Test requirement passed: !(size > data->max_cu...
(kms_plane_cursor:10661) igt_fb-DEBUG: igt_create_fb_with_bo_size(width=3840, ...
(kms_plane_cursor:10661) igt_fb-DEBUG: igt_create_fb_with_bo_size(handle=1, pi...
(kms_plane_cursor:10661) ioctl_wrappers-DEBUG: Test requirement passed: igt_ha...
(kms_plane_cursor:10661) intel_allocator_simple-DEBUG: Using simple allocator
(kms_plane_cursor:10661) intel_allocator_simple-DEBUG: <ial: 0x61b3a6f2d850, f...
(kms_plane_cursor:10661) intel_allocator_simple-DEBUG: <ial: 0x61b3a6f2d850, f...
(kms_plane_cursor:10661) intel_allocator_simple-DEBUG: Using simple allocator
(kms_plane_cursor:10661) intel_allocator_simple-DEBUG: <ial: 0x61b3a6f2d6c0, f...
(kms_plane_cursor:10661) intel_allocator_simple-DEBUG: <ial: 0x61b3a6f2d6c0, f...
(kms_plane_cursor:10661) igt_fb-DEBUG: igt_create_fb_with_bo_size(width=256, h...
(kms_plane_cursor:10661) igt_fb-DEBUG: igt_create_fb_with_bo_size(handle=2, pi...
...
igt@kms_plane_cursor@viewport@pipe-b-dp-1-size-64
igt@kms_plane_cursor@viewport@pipe-b-dp-1-size-64
xe-2895-0d2ff6d7ad3b6bf64c5c0e9a921fcfa925029526

Starting dynamic subtest: pipe-B-DP-1-size-64
(kms_plane_cursor:11186) igt_pipe_crc-CRITICAL: Test assertion failure functio...
(kms_plane_cursor:11186) igt_pipe_crc-CRITICAL: Failed assertion: !mismatch ||...
Dynamic subtest pipe-B-DP-1-size-64 failed.
**** DEBUG ****
(kms_plane_cursor:11186) igt_kms-DEBUG: plane C.0: Setting property "CRTC_ID" ...
(kms_plane_cursor:11186) igt_kms-DEBUG: plane C.0: Setting property "rotation"...
(kms_plane_cursor:11186) igt_kms-DEBUG: plane C.0: Setting property "COLOR_ENC...
(kms_plane_cursor:11186) igt_kms-DEBUG: plane C.0: Setting property "COLOR_RAN...
(kms_plane_cursor:11186) igt_kms-DEBUG: plane C.0: Setting property "pixel ble...
(kms_plane_cursor:11186) igt_kms-DEBUG: plane C.0: Setting property "alpha" to...
(kms_plane_cursor:11186) igt_kms-DEBUG: plane C.0: Setting property "FB_DAMAGE...
(kms_plane_cursor:11186) igt_kms-DEBUG: plane C.0: Setting property "SCALING_F...
(kms_plane_cursor:11186) igt_kms-DEBUG: display:     populating plane data: C....
(kms_plane_cursor:11186) igt_kms-DEBUG: plane C.1: Setting property "SRC_X" to...
(kms_plane_cursor:11186) igt_kms-DEBUG: plane C.1: Setting property "SRC_Y" to...
(kms_plane_cursor:11186) igt_kms-DEBUG: plane C.1: Setting property "SRC_W" to...
...
igt@kms_plane_cursor@viewport@pipe-b-dp-1-size-128
igt@kms_plane_cursor@viewport@pipe-b-dp-1-size-128
xe-2895-0d2ff6d7ad3b6bf64c5c0e9a921fcfa925029526

Starting dynamic subtest: pipe-B-DP-1-size-128
(kms_plane_cursor:11186) igt_pipe_crc-CRITICAL: Test assertion failure functio...
(kms_plane_cursor:11186) igt_pipe_crc-CRITICAL: Failed assertion: !mismatch ||...
Dynamic subtest pipe-B-DP-1-size-128 failed.
**** DEBUG ****
(kms_plane_cursor:11186) DEBUG: Test requirement passed: !(size > data->max_cu...
(kms_plane_cursor:11186) igt_fb-DEBUG: igt_create_fb_with_bo_size(width=3840, ...
(kms_plane_cursor:11186) igt_fb-DEBUG: igt_create_fb_with_bo_size(handle=1, pi...
(kms_plane_cursor:11186) ioctl_wrappers-DEBUG: Test requirement passed: igt_ha...
(kms_plane_cursor:11186) intel_allocator_simple-DEBUG: Using simple allocator
(kms_plane_cursor:11186) intel_allocator_simple-DEBUG: <ial: 0x56ad825ddd00, f...
(kms_plane_cursor:11186) intel_allocator_simple-DEBUG: <ial: 0x56ad825ddd00, f...
(kms_plane_cursor:11186) intel_allocator_simple-DEBUG: Using simple allocator
(kms_plane_cursor:11186) intel_allocator_simple-DEBUG: <ial: 0x56ad825e06c0, f...
(kms_plane_cursor:11186) intel_allocator_simple-DEBUG: <ial: 0x56ad825e06c0, f...
(kms_plane_cursor:11186) igt_fb-DEBUG: igt_create_fb_with_bo_size(width=2048, ...
(kms_plane_cursor:11186) igt_fb-DEBUG: igt_create_fb_with_bo_size(handle=2, pi...
...
igt@kms_plane_cursor@viewport@pipe-b-dp-1-size-256
igt@kms_plane_cursor@viewport@pipe-b-dp-1-size-256
xe-2895-0d2ff6d7ad3b6bf64c5c0e9a921fcfa925029526

Starting dynamic subtest: pipe-B-DP-1-size-256
(kms_plane_cursor:11186) igt_pipe_crc-CRITICAL: Test assertion failure functio...
(kms_plane_cursor:11186) igt_pipe_crc-CRITICAL: Failed assertion: !mismatch ||...
Dynamic subtest pipe-B-DP-1-size-256 failed.
**** DEBUG ****
(kms_plane_cursor:11186) DEBUG: Test requirement passed: !(size > data->max_cu...
(kms_plane_cursor:11186) igt_fb-DEBUG: igt_create_fb_with_bo_size(width=3840, ...
(kms_plane_cursor:11186) igt_fb-DEBUG: igt_create_fb_with_bo_size(handle=1, pi...
(kms_plane_cursor:11186) ioctl_wrappers-DEBUG: Test requirement passed: igt_ha...
(kms_plane_cursor:11186) intel_allocator_simple-DEBUG: Using simple allocator
(kms_plane_cursor:11186) intel_allocator_simple-DEBUG: <ial: 0x56ad825ddd00, f...
(kms_plane_cursor:11186) intel_allocator_simple-DEBUG: <ial: 0x56ad825ddd00, f...
(kms_plane_cursor:11186) intel_allocator_simple-DEBUG: Using simple allocator
(kms_plane_cursor:11186) intel_allocator_simple-DEBUG: <ial: 0x56ad825e06c0, f...
(kms_plane_cursor:11186) intel_allocator_simple-DEBUG: <ial: 0x56ad825e06c0, f...
(kms_plane_cursor:11186) igt_fb-DEBUG: igt_create_fb_with_bo_size(width=2048, ...
(kms_plane_cursor:11186) igt_fb-DEBUG: igt_create_fb_with_bo_size(handle=2, pi...
...
igt@kms_plane_lowres@tiling-x@pipe-a-dp-1
igt@kms_plane_lowres@tiling-x@pipe-a-dp-1
xe-2899-8f917568adaeea8b649e337e7d0e03bd03332253

Starting dynamic subtest: pipe-A-DP-1
(kms_plane_lowres:3313) igt_pipe_crc-CRITICAL: Test assertion failure function...
(kms_plane_lowres:3313) igt_pipe_crc-CRITICAL: Failed assertion: !mismatch || ...
Dynamic subtest pipe-A-DP-1 failed.
**** DEBUG ****
(kms_plane_lowres:3313) igt_kms-DEBUG: plane C.5: Setting property "SRC_X" to ...
(kms_plane_lowres:3313) igt_kms-DEBUG: plane C.5: Setting property "SRC_Y" to ...
(kms_plane_lowres:3313) igt_kms-DEBUG: plane C.5: Setting property "SRC_W" to ...
(kms_plane_lowres:3313) igt_kms-DEBUG: plane C.5: Setting property "SRC_H" to ...
(kms_plane_lowres:3313) igt_kms-DEBUG: plane C.5: Setting property "CRTC_X" to...
(kms_plane_lowres:3313) igt_kms-DEBUG: plane C.5: Setting property "CRTC_Y" to...
(kms_plane_lowres:3313) igt_kms-DEBUG: plane C.5: Setting property "CRTC_W" to...
(kms_plane_lowres:3313) igt_kms-DEBUG: plane C.5: Setting property "CRTC_H" to...
(kms_plane_lowres:3313) igt_kms-DEBUG: plane C.5: Setting property "FB_ID" to ...
(kms_plane_lowres:3313) igt_kms-DEBUG: plane C.5: Setting property "CRTC_ID" t...
(kms_plane_lowres:3313) igt_kms-DEBUG: plane C.5: Setting property "rotation" ...
(kms_plane_lowres:3313) igt_kms-DEBUG: plane C.5: Setting property "FB_DAMAGE_...
...
igt@kms_plane_lowres@tiling-x@pipe-b-dp-1
igt@kms_plane_lowres@tiling-x@pipe-b-dp-1
xe-2899-8f917568adaeea8b649e337e7d0e03bd03332253

Starting dynamic subtest: pipe-B-DP-1
(kms_plane_lowres:3313) igt_pipe_crc-CRITICAL: Test assertion failure function...
(kms_plane_lowres:3313) igt_pipe_crc-CRITICAL: Failed assertion: !mismatch || ...
Dynamic subtest pipe-B-DP-1 failed.
**** DEBUG ****
(kms_plane_lowres:3313) igt_kms-DEBUG: plane C.5: Setting property "SRC_X" to ...
(kms_plane_lowres:3313) igt_kms-DEBUG: plane C.5: Setting property "SRC_Y" to ...
(kms_plane_lowres:3313) igt_kms-DEBUG: plane C.5: Setting property "SRC_W" to ...
(kms_plane_lowres:3313) igt_kms-DEBUG: plane C.5: Setting property "SRC_H" to ...
(kms_plane_lowres:3313) igt_kms-DEBUG: plane C.5: Setting property "CRTC_X" to...
(kms_plane_lowres:3313) igt_kms-DEBUG: plane C.5: Setting property "CRTC_Y" to...
(kms_plane_lowres:3313) igt_kms-DEBUG: plane C.5: Setting property "CRTC_W" to...
(kms_plane_lowres:3313) igt_kms-DEBUG: plane C.5: Setting property "CRTC_H" to...
(kms_plane_lowres:3313) igt_kms-DEBUG: plane C.5: Setting property "FB_ID" to ...
(kms_plane_lowres:3313) igt_kms-DEBUG: plane C.5: Setting property "CRTC_ID" t...
(kms_plane_lowres:3313) igt_kms-DEBUG: plane C.5: Setting property "rotation" ...
(kms_plane_lowres:3313) igt_kms-DEBUG: plane C.5: Setting property "FB_DAMAGE_...
...
igt@kms_plane_multiple@2x-tiling-x@pipe-a-edp-1-pipe-b-dp-1
igt@kms_plane_multiple@2x-tiling-x@pipe-a-edp-1-pipe-b-dp-1
xe-2899-8f917568adaeea8b649e337e7d0e03bd03332253

Starting subtest: 2x-tiling-x
Starting dynamic subtest: pipe-A-eDP-1-pipe-B-DP-1
(kms_plane_multiple:3993) igt_pipe_crc-CRITICAL: Test assertion failure functi...
(kms_plane_multiple:3993) igt_pipe_crc-CRITICAL: Failed assertion: !mismatch |...
Dynamic subtest pipe-A-eDP-1-pipe-B-DP-1 failed.
**** DEBUG ****
(kms_plane_multiple:3993) igt_kms-DEBUG: plane C.2: Setting property "CRTC_ID"...
(kms_plane_multiple:3993) igt_kms-DEBUG: plane C.2: Setting property "rotation...
(kms_plane_multiple:3993) igt_kms-DEBUG: plane C.2: Setting property "COLOR_EN...
(kms_plane_multiple:3993) igt_kms-DEBUG: plane C.2: Setting property "COLOR_RA...
(kms_plane_multiple:3993) igt_kms-DEBUG: plane C.2: Setting property "pixel bl...
(kms_plane_multiple:3993) igt_kms-DEBUG: plane C.2: Setting property "alpha" t...
(kms_plane_multiple:3993) igt_kms-DEBUG: plane C.2: Setting property "FB_DAMAG...
(kms_plane_multiple:3993) igt_kms-DEBUG: plane C.2: Setting property "SCALING_...
(kms_plane_multiple:3993) igt_kms-DEBUG: display:     populating plane data: C...
(kms_plane_multiple:3993) igt_kms-DEBUG: plane C.3: Setting property "SRC_X" t...
(kms_plane_multiple:3993) igt_kms-DEBUG: plane C.3: Setting property "SRC_Y" t...
...
igt@kms_plane_multiple@2x-tiling-x@pipe-a-dp-1-pipe-b-edp-1
igt@kms_plane_multiple@2x-tiling-x@pipe-a-dp-1-pipe-b-edp-1
xe-2899-8f917568adaeea8b649e337e7d0e03bd03332253

Starting dynamic subtest: pipe-A-DP-1-pipe-B-eDP-1
(kms_plane_multiple:3993) igt_pipe_crc-CRITICAL: Test assertion failure functi...
(kms_plane_multiple:3993) igt_pipe_crc-CRITICAL: Failed assertion: !mismatch |...
Dynamic subtest pipe-A-DP-1-pipe-B-eDP-1 failed.
**** DEBUG ****
(kms_plane_multiple:3993) igt_kms-DEBUG: plane C.2: Setting property "CRTC_ID"...
(kms_plane_multiple:3993) igt_kms-DEBUG: plane C.2: Setting property "rotation...
(kms_plane_multiple:3993) igt_kms-DEBUG: plane C.2: Setting property "COLOR_EN...
(kms_plane_multiple:3993) igt_kms-DEBUG: plane C.2: Setting property "COLOR_RA...
(kms_plane_multiple:3993) igt_kms-DEBUG: plane C.2: Setting property "pixel bl...
(kms_plane_multiple:3993) igt_kms-DEBUG: plane C.2: Setting property "alpha" t...
(kms_plane_multiple:3993) igt_kms-DEBUG: plane C.2: Setting property "FB_DAMAG...
(kms_plane_multiple:3993) igt_kms-DEBUG: plane C.2: Setting property "SCALING_...
(kms_plane_multiple:3993) igt_kms-DEBUG: display:     populating plane data: C...
(kms_plane_multiple:3993) igt_kms-DEBUG: plane C.3: Setting property "SRC_X" t...
(kms_plane_multiple:3993) igt_kms-DEBUG: plane C.3: Setting property "SRC_Y" t...
(kms_plane_multiple:3993) igt_kms-DEBUG: plane C.3: Setting property "SRC_W" t...
...
igt@kms_plane_multiple@2x-tiling-x@pipe-a-dp-1-pipe-c-edp-1
D igt@kms_plane_multiple@2x-tiling-x@pipe-a-dp-1-pipe-c-edp-1
xe-2899-8f917568adaeea8b649e337e7d0e03bd03332253

<3> [325.771390] [drm:drm_crtc_add_crc_entry] *ERROR* Overflow of CRC buffer, ...
igt@kms_plane_multiple@2x-tiling-x@pipe-b-edp-1-pipe-a-dp-1
igt@kms_plane_multiple@2x-tiling-x@pipe-b-edp-1-pipe-a-dp-1
xe-2899-8f917568adaeea8b649e337e7d0e03bd03332253

Starting dynamic subtest: pipe-B-eDP-1-pipe-A-DP-1
(kms_plane_multiple:3993) igt_pipe_crc-CRITICAL: Test assertion failure functi...
(kms_plane_multiple:3993) igt_pipe_crc-CRITICAL: Failed assertion: !mismatch |...
Dynamic subtest pipe-B-eDP-1-pipe-A-DP-1 failed.
**** DEBUG ****
(kms_plane_multiple:3993) igt_kms-DEBUG: plane C.2: Setting property "CRTC_ID"...
(kms_plane_multiple:3993) igt_kms-DEBUG: plane C.2: Setting property "rotation...
(kms_plane_multiple:3993) igt_kms-DEBUG: plane C.2: Setting property "COLOR_EN...
(kms_plane_multiple:3993) igt_kms-DEBUG: plane C.2: Setting property "COLOR_RA...
(kms_plane_multiple:3993) igt_kms-DEBUG: plane C.2: Setting property "pixel bl...
(kms_plane_multiple:3993) igt_kms-DEBUG: plane C.2: Setting property "alpha" t...
(kms_plane_multiple:3993) igt_kms-DEBUG: plane C.2: Setting property "FB_DAMAG...
(kms_plane_multiple:3993) igt_kms-DEBUG: plane C.2: Setting property "SCALING_...
(kms_plane_multiple:3993) igt_kms-DEBUG: display:     populating plane data: C...
(kms_plane_multiple:3993) igt_kms-DEBUG: plane C.3: Setting property "SRC_X" t...
(kms_plane_multiple:3993) igt_kms-DEBUG: plane C.3: Setting property "SRC_Y" t...
(kms_plane_multiple:3993) igt_kms-DEBUG: plane C.3: Setting property "SRC_W" t...
...
igt@kms_plane_multiple@2x-tiling-x@pipe-b-dp-1-pipe-a-edp-1
D igt@kms_plane_multiple@2x-tiling-x@pipe-b-dp-1-pipe-a-edp-1
xe-2899-8f917568adaeea8b649e337e7d0e03bd03332253

<3> [354.943343] [drm:drm_crtc_add_crc_entry] *ERROR* Overflow of CRC buffer, ...
igt@kms_plane_multiple@2x-tiling-x@pipe-b-dp-1-pipe-c-edp-1
D igt@kms_plane_multiple@2x-tiling-x@pipe-b-dp-1-pipe-c-edp-1
xe-2899-8f917568adaeea8b649e337e7d0e03bd03332253

<3> [359.971263] [drm:drm_crtc_add_crc_entry] *ERROR* Overflow of CRC buffer, ...
igt@kms_plane_multiple@2x-tiling-x@pipe-c-edp-1-pipe-a-dp-1
D igt@kms_plane_multiple@2x-tiling-x@pipe-c-edp-1-pipe-a-dp-1
xe-2899-8f917568adaeea8b649e337e7d0e03bd03332253

<3> [378.374363] [drm:drm_crtc_add_crc_entry] *ERROR* Overflow of CRC buffer, ...
igt@kms_plane_multiple@2x-tiling-x@pipe-c-edp-1-pipe-b-dp-1
D igt@kms_plane_multiple@2x-tiling-x@pipe-c-edp-1-pipe-b-dp-1
xe-2899-8f917568adaeea8b649e337e7d0e03bd03332253

<3> [384.357969] [drm:drm_crtc_add_crc_entry] *ERROR* Overflow of CRC buffer, ...
igt@kms_plane_multiple@tiling-x@pipe-a-dp-1
D igt@kms_plane_multiple@tiling-x@pipe-a-dp-1
xe-2899-8f917568adaeea8b649e337e7d0e03bd03332253

<3> [466.979542] [drm:drm_crtc_add_crc_entry] *ERROR* Overflow of CRC buffer, ...
igt@kms_plane_multiple@tiling-x@pipe-b-dp-1
D igt@kms_plane_multiple@tiling-x@pipe-b-dp-1
xe-2899-8f917568adaeea8b649e337e7d0e03bd03332253

<3> [479.095685] [drm:drm_crtc_add_crc_entry] *ERROR* Overflow of CRC buffer, ...
igt@kms_universal_plane@cursor-fb-leak@pipe-b-dp-1
igt@kms_universal_plane@cursor-fb-leak@pipe-b-dp-1
xe-2895-0d2ff6d7ad3b6bf64c5c0e9a921fcfa925029526

Starting dynamic subtest: pipe-B-DP-1
(kms_universal_plane:12731) CRITICAL: Test assertion failure function cursor_l...
(kms_universal_plane:12731) CRITICAL: Failed assertion: count1 == count2
(kms_universal_plane:12731) CRITICAL: Last errno: 9, Bad file descriptor
(kms_universal_plane:12731) CRITICAL: error: 1 != 2
Dynamic subtest pipe-B-DP-1 failed.
**** DEBUG ****
(kms_universal_plane:12731) igt_kms-DEBUG: display: B.5: plane_set_size (64x64)
(kms_universal_plane:12731) igt_kms-DEBUG: display: B.5: fb_set_position(0,0)
(kms_universal_plane:12731) igt_kms-DEBUG: display: B.5: fb_set_size(64x64)
(kms_universal_plane:12731) igt_kms-DEBUG: display: commit {
(kms_universal_plane:12731) igt_kms-DEBUG: Test requirement passed: plane_idx ...
(kms_universal_plane:12731) igt_kms-DEBUG: Test requirement passed: plane_idx ...
(kms_universal_plane:12731) igt_kms-DEBUG: Test requirement passed: plane_idx ...
(kms_universal_plane:12731) igt_kms-DEBUG: Test requirement passed: plane_idx ...
(kms_universal_plane:12731) igt_kms-DEBUG: Test requirement passed: plane_idx ...
(kms_universal_plane:12731) igt_kms-DEBUG: Test requirement passed: plane_idx ...
...
igt@kms_atomic_transition@plane-all-modeset-transition@pipe-c-dp-2
igt@kms_atomic_transition@plane-all-modeset-transition@pipe-c-dp-2
xe-2895-0d2ff6d7ad3b6bf64c5c0e9a921fcfa925029526

Starting dynamic subtest: pipe-C-DP-2
(kms_atomic_transition:7295) igt_kms-CRITICAL: Test assertion failure function...
(kms_atomic_transition:7295) igt_kms-CRITICAL: Failed assertion: ret == 0
(kms_atomic_transition:7295) igt_kms-CRITICAL: Last errno: 22, Invalid argument
(kms_atomic_transition:7295) igt_kms-CRITICAL: error: -22 != 0
Dynamic subtest pipe-C-DP-2 failed.
**** DEBUG ****
(kms_atomic_transition:7295) igt_kms-DEBUG: plane C.3: Setting property "COLOR...
(kms_atomic_transition:7295) igt_kms-DEBUG: plane C.3: Setting property "COLOR...
(kms_atomic_transition:7295) igt_kms-DEBUG: display:     populating plane data...
(kms_atomic_transition:7295) igt_kms-DEBUG: plane C.5: Setting property "SRC_X...
(kms_atomic_transition:7295) igt_kms-DEBUG: plane C.5: Setting property "SRC_Y...
(kms_atomic_transition:7295) igt_kms-DEBUG: plane C.5: Setting property "SRC_W...
(kms_atomic_transition:7295) igt_kms-DEBUG: plane C.5: Setting property "SRC_H...
(kms_atomic_transition:7295) igt_kms-DEBUG: plane C.5: Setting property "CRTC_...
(kms_atomic_transition:7295) igt_kms-DEBUG: plane C.5: Setting property "CRTC_...
(kms_atomic_transition:7295) igt_kms-DEBUG: plane C.5: Setting property "FB_ID...
...
igt@kms_flip@2x-flip-vs-expired-vblank@ab-dp1-dp2
igt@kms_flip@2x-flip-vs-expired-vblank@ab-dp1-dp2
xe-2899-8f917568adaeea8b649e337e7d0e03bd03332253

Starting subtest: 2x-flip-vs-expired-vblank
Starting dynamic subtest: AB-DP1-DP2
(kms_flip:2201) CRITICAL: Test assertion failure function run_test_step, file ...
(kms_flip:2201) CRITICAL: Failed assertion: end - start < 500
Dynamic subtest AB-DP1-DP2 failed.
**** DEBUG ****
(kms_flip:2201) DEBUG: name = flip
last_ts = 202.738342
last_received_ts = 202.737991
last_seq = 2519
current_ts = 202.771698
current_received_ts = 202.771317
current_seq = 2520
count = 43
seq_step = 1
(kms_flip:2201) DEBUG: Vblank took 274us
(kms_flip:2201) DEBUG: name = flip
...
igt@kms_flip@2x-flip-vs-expired-vblank@ab-dp1-dp2
xe-2895-0d2ff6d7ad3b6bf64c5c0e9a921fcfa925029526

Starting subtest: 2x-flip-vs-expired-vblank
Starting dynamic subtest: AB-DP1-DP2
(kms_flip:5524) CRITICAL: Test assertion failure function run_test_step, file ...
(kms_flip:5524) CRITICAL: Failed assertion: end - start < 500
Dynamic subtest AB-DP1-DP2 failed.
**** DEBUG ****
(kms_flip:5524) igt_fb-DEBUG: igt_create_fb_with_bo_size(width=3840, height=21...
(kms_flip:5524) igt_fb-DEBUG: igt_create_fb_with_bo_size(handle=1, pitch=15360)
(kms_flip:5524) ioctl_wrappers-DEBUG: Test requirement passed: igt_has_fb_modi...
(kms_flip:5524) igt_fb-DEBUG: igt_create_fb_with_bo_size(width=3840, height=21...
(kms_flip:5524) igt_fb-DEBUG: igt_create_fb_with_bo_size(handle=2, pitch=15360)
(kms_flip:5524) ioctl_wrappers-DEBUG: Test requirement passed: igt_has_fb_modi...
(kms_flip:5524) intel_allocator_simple-DEBUG: Using simple allocator
(kms_flip:5524) intel_allocator_simple-DEBUG: <ial: 0x5be674d6fad0, fd: 5> obj...
(kms_flip:5524) intel_allocator_simple-DEBUG: <ial: 0x5be674d6fad0, fd: 5> obj...
(kms_flip:5524) intel_allocator_simple-DEBUG: Using simple allocator
(kms_flip:5524) intel_allocator_simple-DEBUG: <ial: 0x5be674d517a0, fd: 5> obj...
...
igt@kms_flip@2x-flip-vs-expired-vblank@ac-dp1-dp2
igt@kms_flip@2x-flip-vs-expired-vblank@ac-dp1-dp2
xe-2895-0d2ff6d7ad3b6bf64c5c0e9a921fcfa925029526

Starting dynamic subtest: AC-DP1-DP2
(kms_flip:5524) CRITICAL: Test assertion failure function run_test_step, file ...
(kms_flip:5524) CRITICAL: Failed assertion: end - start < 500
Dynamic subtest AC-DP1-DP2 failed.
**** DEBUG ****
(kms_flip:5524) igt_fb-DEBUG: igt_create_fb_with_bo_size(width=3840, height=21...
(kms_flip:5524) igt_fb-DEBUG: igt_create_fb_with_bo_size(handle=3, pitch=15360)
(kms_flip:5524) ioctl_wrappers-DEBUG: Test requirement passed: igt_has_fb_modi...
(kms_flip:5524) igt_fb-DEBUG: igt_create_fb_with_bo_size(width=3840, height=21...
(kms_flip:5524) igt_fb-DEBUG: igt_create_fb_with_bo_size(handle=4, pitch=15360)
(kms_flip:5524) ioctl_wrappers-DEBUG: Test requirement passed: igt_has_fb_modi...
(kms_flip:5524) intel_allocator_simple-DEBUG: Using simple allocator
(kms_flip:5524) intel_allocator_simple-DEBUG: <ial: 0x5be674dde450, fd: 5> obj...
(kms_flip:5524) intel_allocator_simple-DEBUG: <ial: 0x5be674dde450, fd: 5> obj...
(kms_flip:5524) intel_allocator_simple-DEBUG: Using simple allocator
(kms_flip:5524) intel_allocator_simple-DEBUG: <ial: 0x5be674dde450, fd: 5> obj...
(kms_flip:5524) intel_allocator_simple-DEBUG: <ial: 0x5be674dde450, fd: 5> obj...
...
igt@kms_flip@2x-flip-vs-expired-vblank@bc-dp1-dp2
igt@kms_flip@2x-flip-vs-expired-vblank@bc-dp1-dp2
xe-2899-8f917568adaeea8b649e337e7d0e03bd03332253

Starting dynamic subtest: BC-DP1-DP2
(kms_flip:2201) CRITICAL: Test assertion failure function run_test_step, file ...
(kms_flip:2201) CRITICAL: Failed assertion: end - start < 500
Dynamic subtest BC-DP1-DP2 failed.
**** DEBUG ****
(kms_flip:2201) DEBUG: name = flip
last_ts = 222.219299
last_received_ts = 222.219055
last_seq = 3522
current_ts = 222.252655
current_received_ts = 222.253113
current_seq = 3523
count = 61
seq_step = 1
(kms_flip:2201) DEBUG: Vblank took 386us
(kms_flip:2201) DEBUG: name = flip
last_ts = 222.252655
...
igt@kms_flip@2x-flip-vs-expired-vblank@bc-dp1-dp2
xe-2895-0d2ff6d7ad3b6bf64c5c0e9a921fcfa925029526

Starting dynamic subtest: BC-DP1-DP2
(kms_flip:5524) CRITICAL: Test assertion failure function run_test_step, file ...
(kms_flip:5524) CRITICAL: Failed assertion: end - start < 500
Dynamic subtest BC-DP1-DP2 failed.
**** DEBUG ****
(kms_flip:5524) igt_fb-DEBUG: igt_create_fb_with_bo_size(width=3840, height=21...
(kms_flip:5524) igt_fb-DEBUG: igt_create_fb_with_bo_size(handle=5, pitch=15360)
(kms_flip:5524) ioctl_wrappers-DEBUG: Test requirement passed: igt_has_fb_modi...
(kms_flip:5524) igt_fb-DEBUG: igt_create_fb_with_bo_size(width=3840, height=21...
(kms_flip:5524) igt_fb-DEBUG: igt_create_fb_with_bo_size(handle=6, pitch=15360)
(kms_flip:5524) ioctl_wrappers-DEBUG: Test requirement passed: igt_has_fb_modi...
(kms_flip:5524) intel_allocator_simple-DEBUG: Using simple allocator
(kms_flip:5524) intel_allocator_simple-DEBUG: <ial: 0x5be674d7d140, fd: 5> obj...
(kms_flip:5524) intel_allocator_simple-DEBUG: <ial: 0x5be674d7d140, fd: 5> obj...
(kms_flip:5524) intel_allocator_simple-DEBUG: Using simple allocator
(kms_flip:5524) intel_allocator_simple-DEBUG: <ial: 0x5be674dc3350, fd: 5> obj...
(kms_flip:5524) intel_allocator_simple-DEBUG: <ial: 0x5be674dc3350, fd: 5> obj...
...
igt@kms_flip@2x-flip-vs-expired-vblank-interruptible@ab-dp1-dp2
igt@kms_flip@2x-flip-vs-expired-vblank-interruptible@ab-dp1-dp2
xe-2895-0d2ff6d7ad3b6bf64c5c0e9a921fcfa925029526

Starting subtest: 2x-flip-vs-expired-vblank-interruptible
Starting dynamic subtest: AB-DP1-DP2
(kms_flip:5555) CRITICAL: Test assertion failure function run_test_step, file ...
(kms_flip:5555) CRITICAL: Failed assertion: end - start < 500
(kms_flip:5555) CRITICAL: Last errno: 4, Interrupted system call
Dynamic subtest AB-DP1-DP2 failed.
**** DEBUG ****
(kms_flip:5555) igt_fb-DEBUG: igt_create_fb_with_bo_size(width=3840, height=21...
(kms_flip:5555) igt_fb-DEBUG: igt_create_fb_with_bo_size(handle=1, pitch=15360)
(kms_flip:5555) ioctl_wrappers-DEBUG: Test requirement passed: igt_has_fb_modi...
(kms_flip:5555) igt_fb-DEBUG: igt_create_fb_with_bo_size(width=3840, height=21...
(kms_flip:5555) igt_fb-DEBUG: igt_create_fb_with_bo_size(handle=2, pitch=15360)
(kms_flip:5555) ioctl_wrappers-DEBUG: Test requirement passed: igt_has_fb_modi...
(kms_flip:5555) intel_allocator_simple-DEBUG: Using simple allocator
(kms_flip:5555) intel_allocator_simple-DEBUG: <ial: 0x56e4a942fad0, fd: 5> obj...
(kms_flip:5555) intel_allocator_simple-DEBUG: <ial: 0x56e4a942fad0, fd: 5> obj...
(kms_flip:5555) intel_allocator_simple-DEBUG: Using simple allocator
...
igt@kms_flip@2x-flip-vs-expired-vblank-interruptible@ac-dp1-dp2
igt@kms_flip@2x-flip-vs-expired-vblank-interruptible@ac-dp1-dp2
xe-2895-0d2ff6d7ad3b6bf64c5c0e9a921fcfa925029526

Starting dynamic subtest: AC-DP1-DP2
(kms_flip:5555) CRITICAL: Test assertion failure function run_test_step, file ...
(kms_flip:5555) CRITICAL: Failed assertion: end - start < 500
(kms_flip:5555) CRITICAL: Last errno: 4, Interrupted system call
Dynamic subtest AC-DP1-DP2 failed.
**** DEBUG ****
(kms_flip:5555) igt_fb-DEBUG: igt_create_fb_with_bo_size(width=3840, height=21...
(kms_flip:5555) igt_fb-DEBUG: igt_create_fb_with_bo_size(handle=3, pitch=15360)
(kms_flip:5555) ioctl_wrappers-DEBUG: Test requirement passed: igt_has_fb_modi...
(kms_flip:5555) igt_fb-DEBUG: igt_create_fb_with_bo_size(width=3840, height=21...
(kms_flip:5555) igt_fb-DEBUG: igt_create_fb_with_bo_size(handle=4, pitch=15360)
(kms_flip:5555) ioctl_wrappers-DEBUG: Test requirement passed: igt_has_fb_modi...
(kms_flip:5555) intel_allocator_simple-DEBUG: Using simple allocator
(kms_flip:5555) intel_allocator_simple-DEBUG: <ial: 0x56e4a94b7410, fd: 5> obj...
(kms_flip:5555) intel_allocator_simple-DEBUG: <ial: 0x56e4a94b7410, fd: 5> obj...
(kms_flip:5555) intel_allocator_simple-DEBUG: Using simple allocator
(kms_flip:5555) intel_allocator_simple-DEBUG: <ial: 0x56e4a9493620, fd: 5> obj...
...
igt@kms_flip@2x-flip-vs-expired-vblank-interruptible@bc-dp1-dp2
igt@kms_flip@2x-flip-vs-expired-vblank-interruptible@bc-dp1-dp2
xe-2895-0d2ff6d7ad3b6bf64c5c0e9a921fcfa925029526

Starting dynamic subtest: BC-DP1-DP2
(kms_flip:5555) CRITICAL: Test assertion failure function run_test_step, file ...
(kms_flip:5555) CRITICAL: Failed assertion: end - start < 500
(kms_flip:5555) CRITICAL: Last errno: 4, Interrupted system call
Dynamic subtest BC-DP1-DP2 failed.
**** DEBUG ****
(kms_flip:5555) igt_fb-DEBUG: igt_create_fb_with_bo_size(width=3840, height=21...
(kms_flip:5555) igt_fb-DEBUG: igt_create_fb_with_bo_size(handle=5, pitch=15360)
(kms_flip:5555) ioctl_wrappers-DEBUG: Test requirement passed: igt_has_fb_modi...
(kms_flip:5555) igt_fb-DEBUG: igt_create_fb_with_bo_size(width=3840, height=21...
(kms_flip:5555) igt_fb-DEBUG: igt_create_fb_with_bo_size(handle=6, pitch=15360)
(kms_flip:5555) ioctl_wrappers-DEBUG: Test requirement passed: igt_has_fb_modi...
(kms_flip:5555) intel_allocator_simple-DEBUG: Using simple allocator
(kms_flip:5555) intel_allocator_simple-DEBUG: <ial: 0x56e4a94a2830, fd: 5> obj...
(kms_flip:5555) intel_allocator_simple-DEBUG: <ial: 0x56e4a94a2830, fd: 5> obj...
(kms_flip:5555) intel_allocator_simple-DEBUG: Using simple allocator
(kms_flip:5555) intel_allocator_simple-DEBUG: <ial: 0x56e4a94a2830, fd: 5> obj...
...
igt@kms_flip@2x-flip-vs-wf_vblank@ab-dp1-dp2
igt@kms_flip@2x-flip-vs-wf_vblank@ab-dp1-dp2
xe-2899-8f917568adaeea8b649e337e7d0e03bd03332253

Starting subtest: 2x-flip-vs-wf_vblank
Starting dynamic subtest: AB-DP1-DP2
(kms_flip:2705) CRITICAL: Test assertion failure function calibrate_ts, file ....
(kms_flip:2705) CRITICAL: Failed assertion: 3 * stddev / mean < 0.005
Dynamic subtest AB-DP1-DP2 failed.
**** DEBUG ****
(kms_flip:2705) igt_fb-DEBUG: igt_create_fb_with_bo_size(width=3840, height=21...
(kms_flip:2705) igt_fb-DEBUG: igt_create_fb_with_bo_size(handle=1, pitch=15360)
(kms_flip:2705) ioctl_wrappers-DEBUG: Test requirement passed: igt_has_fb_modi...
(kms_flip:2705) igt_fb-DEBUG: igt_create_fb_with_bo_size(width=3840, height=21...
(kms_flip:2705) igt_fb-DEBUG: igt_create_fb_with_bo_size(handle=2, pitch=15360)
(kms_flip:2705) ioctl_wrappers-DEBUG: Test requirement passed: igt_has_fb_modi...
(kms_flip:2705) igt_fb-DEBUG: Test requirement passed: cairo_surface_status(fb...
(kms_flip:2705) igt_fb-DEBUG: Test requirement passed: cairo_surface_status(fb...
(kms_flip:2705) igt_kms-INFO:   3840x2160: 30 262750 3840 3888 3920 4000 2160 ...
(kms_flip:2705) igt_kms-INFO:   3840x2160: 30 297000 3840 4016 4104 4400 2160 ...
(kms_flip:2705) DEBUG: No stale events found
...
igt@kms_flip@flip-vs-expired-vblank@c-dp1
igt@kms_flip@flip-vs-expired-vblank@c-dp1
xe-2899-8f917568adaeea8b649e337e7d0e03bd03332253

Starting dynamic subtest: C-DP1
(kms_flip:2658) CRITICAL: Test assertion failure function run_test_step, file ...
(kms_flip:2658) CRITICAL: Failed assertion: end - start < 500
Dynamic subtest C-DP1 failed.
**** DEBUG ****
(kms_flip:2658) igt_fb-DEBUG: igt_create_fb_with_bo_size(width=3840, height=21...
(kms_flip:2658) igt_fb-DEBUG: igt_create_fb_with_bo_size(handle=1, pitch=15360)
(kms_flip:2658) ioctl_wrappers-DEBUG: Test requirement passed: igt_has_fb_modi...
(kms_flip:2658) igt_fb-DEBUG: igt_create_fb_with_bo_size(width=3840, height=21...
(kms_flip:2658) igt_fb-DEBUG: igt_create_fb_with_bo_size(handle=2, pitch=15360)
(kms_flip:2658) ioctl_wrappers-DEBUG: Test requirement passed: igt_has_fb_modi...
(kms_flip:2658) igt_fb-DEBUG: Test requirement passed: cairo_surface_status(fb...
(kms_flip:2658) igt_fb-DEBUG: Test requirement passed: cairo_surface_status(fb...
(kms_flip:2658) igt_kms-INFO:   3840x2160: 60 533250 3840 3888 3920 4000 2160 ...
(kms_flip:2658) DEBUG: No stale events found
(kms_flip:2658) i915/intel_drrs-DEBUG: Manually disabling DRRS. 0
(kms_flip:2658) i915/intel_drrs-DEBUG: Test requirement passed: dir >= 0
...
igt@kms_flip@flip-vs-expired-vblank-interruptible@c-dp1
igt@kms_flip@flip-vs-expired-vblank-interruptible@c-dp1
xe-2895-0d2ff6d7ad3b6bf64c5c0e9a921fcfa925029526

Starting dynamic subtest: C-DP1
(kms_flip:2264) CRITICAL: Test assertion failure function run_test_step, file ...
(kms_flip:2264) CRITICAL: Failed assertion: end - start < 500
(kms_flip:2264) CRITICAL: Last errno: 4, Interrupted system call
Dynamic subtest C-DP1 failed.
**** DEBUG ****
(kms_flip:2264) igt_fb-DEBUG: igt_create_fb_with_bo_size(width=3840, height=21...
(kms_flip:2264) igt_fb-DEBUG: igt_create_fb_with_bo_size(handle=1, pitch=15360)
(kms_flip:2264) ioctl_wrappers-DEBUG: Test requirement passed: igt_has_fb_modi...
(kms_flip:2264) igt_fb-DEBUG: igt_create_fb_with_bo_size(width=3840, height=21...
(kms_flip:2264) igt_fb-DEBUG: igt_create_fb_with_bo_size(handle=2, pitch=15360)
(kms_flip:2264) ioctl_wrappers-DEBUG: Test requirement passed: igt_has_fb_modi...
(kms_flip:2264) intel_allocator_simple-DEBUG: Using simple allocator
(kms_flip:2264) intel_allocator_simple-DEBUG: <ial: 0x5afdbf218ea0, fd: 5> obj...
(kms_flip:2264) intel_allocator_simple-DEBUG: <ial: 0x5afdbf218ea0, fd: 5> obj...
(kms_flip:2264) intel_allocator_simple-DEBUG: Using simple allocator
(kms_flip:2264) intel_allocator_simple-DEBUG: <ial: 0x5afdbf282730, fd: 5> obj...
...
igt@kms_plane_lowres@tiling-x@pipe-c-dp-1
igt@kms_plane_lowres@tiling-x@pipe-c-dp-1
xe-2899-8f917568adaeea8b649e337e7d0e03bd03332253

Starting dynamic subtest: pipe-C-DP-1
(kms_plane_lowres:3313) igt_pipe_crc-CRITICAL: Test assertion failure function...
(kms_plane_lowres:3313) igt_pipe_crc-CRITICAL: Failed assertion: !mismatch || ...
Dynamic subtest pipe-C-DP-1 failed.
**** DEBUG ****
(kms_plane_lowres:3313) igt_kms-DEBUG: plane C.5: Setting property "SRC_X" to ...
(kms_plane_lowres:3313) igt_kms-DEBUG: plane C.5: Setting property "SRC_Y" to ...
(kms_plane_lowres:3313) igt_kms-DEBUG: plane C.5: Setting property "SRC_W" to ...
(kms_plane_lowres:3313) igt_kms-DEBUG: plane C.5: Setting property "SRC_H" to ...
(kms_plane_lowres:3313) igt_kms-DEBUG: plane C.5: Setting property "CRTC_X" to...
(kms_plane_lowres:3313) igt_kms-DEBUG: plane C.5: Setting property "CRTC_Y" to...
(kms_plane_lowres:3313) igt_kms-DEBUG: plane C.5: Setting property "CRTC_W" to...
(kms_plane_lowres:3313) igt_kms-DEBUG: plane C.5: Setting property "CRTC_H" to...
(kms_plane_lowres:3313) igt_kms-DEBUG: plane C.5: Setting property "FB_ID" to ...
(kms_plane_lowres:3313) igt_kms-DEBUG: plane C.5: Setting property "CRTC_ID" t...
(kms_plane_lowres:3313) igt_kms-DEBUG: plane C.5: Setting property "rotation" ...
(kms_plane_lowres:3313) igt_kms-DEBUG: plane C.5: Setting property "FB_DAMAGE_...
...
igt@kms_plane_multiple@2x-tiling-x@pipe-a-edp-1-pipe-b-dp-2
igt@kms_plane_multiple@2x-tiling-x@pipe-a-edp-1-pipe-b-dp-2
xe-2899-8f917568adaeea8b649e337e7d0e03bd03332253

Starting dynamic subtest: pipe-A-eDP-1-pipe-B-DP-2
(kms_plane_multiple:3993) igt_pipe_crc-CRITICAL: Test assertion failure functi...
(kms_plane_multiple:3993) igt_pipe_crc-CRITICAL: Failed assertion: !mismatch |...
Dynamic subtest pipe-A-eDP-1-pipe-B-DP-2 failed.
**** DEBUG ****
(kms_plane_multiple:3993) igt_kms-DEBUG: plane C.2: Setting property "CRTC_ID"...
(kms_plane_multiple:3993) igt_kms-DEBUG: plane C.2: Setting property "rotation...
(kms_plane_multiple:3993) igt_kms-DEBUG: plane C.2: Setting property "COLOR_EN...
(kms_plane_multiple:3993) igt_kms-DEBUG: plane C.2: Setting property "COLOR_RA...
(kms_plane_multiple:3993) igt_kms-DEBUG: plane C.2: Setting property "pixel bl...
(kms_plane_multiple:3993) igt_kms-DEBUG: plane C.2: Setting property "alpha" t...
(kms_plane_multiple:3993) igt_kms-DEBUG: plane C.2: Setting property "FB_DAMAG...
(kms_plane_multiple:3993) igt_kms-DEBUG: plane C.2: Setting property "SCALING_...
(kms_plane_multiple:3993) igt_kms-DEBUG: display:     populating plane data: C...
(kms_plane_multiple:3993) igt_kms-DEBUG: plane C.3: Setting property "SRC_X" t...
(kms_plane_multiple:3993) igt_kms-DEBUG: plane C.3: Setting property "SRC_Y" t...
(kms_plane_multiple:3993) igt_kms-DEBUG: plane C.3: Setting property "SRC_W" t...
...
igt@kms_plane_multiple@2x-tiling-x@pipe-a-edp-1-pipe-c-dp-1
igt@kms_plane_multiple@2x-tiling-x@pipe-a-edp-1-pipe-c-dp-1
xe-2899-8f917568adaeea8b649e337e7d0e03bd03332253

Starting dynamic subtest: pipe-A-eDP-1-pipe-C-DP-1
(kms_plane_multiple:3993) igt_pipe_crc-CRITICAL: Test assertion failure functi...
(kms_plane_multiple:3993) igt_pipe_crc-CRITICAL: Failed assertion: !mismatch |...
Dynamic subtest pipe-A-eDP-1-pipe-C-DP-1 failed.
**** DEBUG ****
(kms_plane_multiple:3993) igt_kms-DEBUG: plane C.2: Setting property "CRTC_ID"...
(kms_plane_multiple:3993) igt_kms-DEBUG: plane C.2: Setting property "rotation...
(kms_plane_multiple:3993) igt_kms-DEBUG: plane C.2: Setting property "COLOR_EN...
(kms_plane_multiple:3993) igt_kms-DEBUG: plane C.2: Setting property "COLOR_RA...
(kms_plane_multiple:3993) igt_kms-DEBUG: plane C.2: Setting property "pixel bl...
(kms_plane_multiple:3993) igt_kms-DEBUG: plane C.2: Setting property "alpha" t...
(kms_plane_multiple:3993) igt_kms-DEBUG: plane C.2: Setting property "FB_DAMAG...
(kms_plane_multiple:3993) igt_kms-DEBUG: plane C.2: Setting property "SCALING_...
(kms_plane_multiple:3993) igt_kms-DEBUG: display:     populating plane data: C...
(kms_plane_multiple:3993) igt_kms-DEBUG: plane C.3: Setting property "SRC_X" t...
(kms_plane_multiple:3993) igt_kms-DEBUG: plane C.3: Setting property "SRC_Y" t...
(kms_plane_multiple:3993) igt_kms-DEBUG: plane C.3: Setting property "SRC_W" t...
...
igt@kms_plane_multiple@2x-tiling-x@pipe-a-edp-1-pipe-c-dp-2
igt@kms_plane_multiple@2x-tiling-x@pipe-a-edp-1-pipe-c-dp-2
xe-2899-8f917568adaeea8b649e337e7d0e03bd03332253

Starting dynamic subtest: pipe-A-eDP-1-pipe-C-DP-2
(kms_plane_multiple:3993) igt_pipe_crc-CRITICAL: Test assertion failure functi...
(kms_plane_multiple:3993) igt_pipe_crc-CRITICAL: Failed assertion: !mismatch |...
Dynamic subtest pipe-A-eDP-1-pipe-C-DP-2 failed.
**** DEBUG ****
(kms_plane_multiple:3993) igt_kms-DEBUG: plane C.2: Setting property "CRTC_ID"...
(kms_plane_multiple:3993) igt_kms-DEBUG: plane C.2: Setting property "rotation...
(kms_plane_multiple:3993) igt_kms-DEBUG: plane C.2: Setting property "COLOR_EN...
(kms_plane_multiple:3993) igt_kms-DEBUG: plane C.2: Setting property "COLOR_RA...
(kms_plane_multiple:3993) igt_kms-DEBUG: plane C.2: Setting property "pixel bl...
(kms_plane_multiple:3993) igt_kms-DEBUG: plane C.2: Setting property "alpha" t...
(kms_plane_multiple:3993) igt_kms-DEBUG: plane C.2: Setting property "FB_DAMAG...
(kms_plane_multiple:3993) igt_kms-DEBUG: plane C.2: Setting property "SCALING_...
(kms_plane_multiple:3993) igt_kms-DEBUG: display:     populating plane data: C...
(kms_plane_multiple:3993) igt_kms-DEBUG: plane C.3: Setting property "SRC_X" t...
(kms_plane_multiple:3993) igt_kms-DEBUG: plane C.3: Setting property "SRC_Y" t...
(kms_plane_multiple:3993) igt_kms-DEBUG: plane C.3: Setting property "SRC_W" t...
...
igt@kms_plane_multiple@2x-tiling-x@pipe-a-dp-1-pipe-b-dp-2
igt@kms_plane_multiple@2x-tiling-x@pipe-a-dp-1-pipe-b-dp-2
xe-2899-8f917568adaeea8b649e337e7d0e03bd03332253

Starting dynamic subtest: pipe-A-DP-1-pipe-B-DP-2
(kms_plane_multiple:3993) igt_pipe_crc-CRITICAL: Test assertion failure functi...
(kms_plane_multiple:3993) igt_pipe_crc-CRITICAL: Failed assertion: !mismatch |...
Dynamic subtest pipe-A-DP-1-pipe-B-DP-2 failed.
**** DEBUG ****
(kms_plane_multiple:3993) igt_kms-DEBUG: plane C.2: Setting property "CRTC_ID"...
(kms_plane_multiple:3993) igt_kms-DEBUG: plane C.2: Setting property "rotation...
(kms_plane_multiple:3993) igt_kms-DEBUG: plane C.2: Setting property "COLOR_EN...
(kms_plane_multiple:3993) igt_kms-DEBUG: plane C.2: Setting property "COLOR_RA...
(kms_plane_multiple:3993) igt_kms-DEBUG: plane C.2: Setting property "pixel bl...
(kms_plane_multiple:3993) igt_kms-DEBUG: plane C.2: Setting property "alpha" t...
(kms_plane_multiple:3993) igt_kms-DEBUG: plane C.2: Setting property "FB_DAMAG...
(kms_plane_multiple:3993) igt_kms-DEBUG: plane C.2: Setting property "SCALING_...
(kms_plane_multiple:3993) igt_kms-DEBUG: display:     populating plane data: C...
(kms_plane_multiple:3993) igt_kms-DEBUG: plane C.3: Setting property "SRC_X" t...
(kms_plane_multiple:3993) igt_kms-DEBUG: plane C.3: Setting property "SRC_Y" t...
(kms_plane_multiple:3993) igt_kms-DEBUG: plane C.3: Setting property "SRC_W" t...
...
igt@kms_plane_multiple@2x-tiling-x@pipe-a-dp-1-pipe-c-dp-2
D igt@kms_plane_multiple@2x-tiling-x@pipe-a-dp-1-pipe-c-dp-2
xe-2899-8f917568adaeea8b649e337e7d0e03bd03332253

<3> [329.598434] [drm:drm_crtc_add_crc_entry] *ERROR* Overflow of CRC buffer, ...
igt@kms_plane_multiple@2x-tiling-x@pipe-a-dp-2-pipe-b-edp-1
igt@kms_plane_multiple@2x-tiling-x@pipe-a-dp-2-pipe-b-edp-1
xe-2899-8f917568adaeea8b649e337e7d0e03bd03332253

Starting dynamic subtest: pipe-A-DP-2-pipe-B-eDP-1
(kms_plane_multiple:3993) igt_pipe_crc-CRITICAL: Test assertion failure functi...
(kms_plane_multiple:3993) igt_pipe_crc-CRITICAL: Failed assertion: !mismatch |...
Dynamic subtest pipe-A-DP-2-pipe-B-eDP-1 failed.
**** DEBUG ****
(kms_plane_multiple:3993) igt_kms-DEBUG: plane C.2: Setting property "CRTC_ID"...
(kms_plane_multiple:3993) igt_kms-DEBUG: plane C.2: Setting property "rotation...
(kms_plane_multiple:3993) igt_kms-DEBUG: plane C.2: Setting property "COLOR_EN...
(kms_plane_multiple:3993) igt_kms-DEBUG: plane C.2: Setting property "COLOR_RA...
(kms_plane_multiple:3993) igt_kms-DEBUG: plane C.2: Setting property "pixel bl...
(kms_plane_multiple:3993) igt_kms-DEBUG: plane C.2: Setting property "alpha" t...
(kms_plane_multiple:3993) igt_kms-DEBUG: plane C.2: Setting property "FB_DAMAG...
(kms_plane_multiple:3993) igt_kms-DEBUG: plane C.2: Setting property "SCALING_...
(kms_plane_multiple:3993) igt_kms-DEBUG: display:     populating plane data: C...
(kms_plane_multiple:3993) igt_kms-DEBUG: plane C.3: Setting property "SRC_X" t...
(kms_plane_multiple:3993) igt_kms-DEBUG: plane C.3: Setting property "SRC_Y" t...
(kms_plane_multiple:3993) igt_kms-DEBUG: plane C.3: Setting property "SRC_W" t...
...
igt@kms_plane_multiple@2x-tiling-x@pipe-a-dp-2-pipe-b-dp-1
igt@kms_plane_multiple@2x-tiling-x@pipe-a-dp-2-pipe-b-dp-1
xe-2899-8f917568adaeea8b649e337e7d0e03bd03332253

Starting dynamic subtest: pipe-A-DP-2-pipe-B-DP-1
(kms_plane_multiple:3993) igt_pipe_crc-CRITICAL: Test assertion failure functi...
(kms_plane_multiple:3993) igt_pipe_crc-CRITICAL: Failed assertion: !mismatch |...
Dynamic subtest pipe-A-DP-2-pipe-B-DP-1 failed.
**** DEBUG ****
(kms_plane_multiple:3993) igt_kms-DEBUG: plane C.2: Setting property "CRTC_ID"...
(kms_plane_multiple:3993) igt_kms-DEBUG: plane C.2: Setting property "rotation...
(kms_plane_multiple:3993) igt_kms-DEBUG: plane C.2: Setting property "COLOR_EN...
(kms_plane_multiple:3993) igt_kms-DEBUG: plane C.2: Setting property "COLOR_RA...
(kms_plane_multiple:3993) igt_kms-DEBUG: plane C.2: Setting property "pixel bl...
(kms_plane_multiple:3993) igt_kms-DEBUG: plane C.2: Setting property "alpha" t...
(kms_plane_multiple:3993) igt_kms-DEBUG: plane C.2: Setting property "FB_DAMAG...
(kms_plane_multiple:3993) igt_kms-DEBUG: plane C.2: Setting property "SCALING_...
(kms_plane_multiple:3993) igt_kms-DEBUG: display:     populating plane data: C...
(kms_plane_multiple:3993) igt_kms-DEBUG: plane C.3: Setting property "SRC_X" t...
(kms_plane_multiple:3993) igt_kms-DEBUG: plane C.3: Setting property "SRC_Y" t...
(kms_plane_multiple:3993) igt_kms-DEBUG: plane C.3: Setting property "SRC_W" t...
...
igt@kms_plane_multiple@2x-tiling-x@pipe-a-dp-2-pipe-c-edp-1
igt@kms_plane_multiple@2x-tiling-x@pipe-a-dp-2-pipe-c-edp-1
xe-2899-8f917568adaeea8b649e337e7d0e03bd03332253

Starting dynamic subtest: pipe-A-DP-2-pipe-C-eDP-1
(kms_plane_multiple:3993) igt_pipe_crc-CRITICAL: Test assertion failure functi...
(kms_plane_multiple:3993) igt_pipe_crc-CRITICAL: Failed assertion: !mismatch |...
Dynamic subtest pipe-A-DP-2-pipe-C-eDP-1 failed.
**** DEBUG ****
(kms_plane_multiple:3993) igt_kms-DEBUG: plane C.2: Setting property "CRTC_ID"...
(kms_plane_multiple:3993) igt_kms-DEBUG: plane C.2: Setting property "rotation...
(kms_plane_multiple:3993) igt_kms-DEBUG: plane C.2: Setting property "COLOR_EN...
(kms_plane_multiple:3993) igt_kms-DEBUG: plane C.2: Setting property "COLOR_RA...
(kms_plane_multiple:3993) igt_kms-DEBUG: plane C.2: Setting property "pixel bl...
(kms_plane_multiple:3993) igt_kms-DEBUG: plane C.2: Setting property "alpha" t...
(kms_plane_multiple:3993) igt_kms-DEBUG: plane C.2: Setting property "FB_DAMAG...
(kms_plane_multiple:3993) igt_kms-DEBUG: plane C.2: Setting property "SCALING_...
(kms_plane_multiple:3993) igt_kms-DEBUG: display:     populating plane data: C...
(kms_plane_multiple:3993) igt_kms-DEBUG: plane C.3: Setting property "SRC_X" t...
(kms_plane_multiple:3993) igt_kms-DEBUG: plane C.3: Setting property "SRC_Y" t...
(kms_plane_multiple:3993) igt_kms-DEBUG: plane C.3: Setting property "SRC_W" t...
...
igt@kms_plane_multiple@2x-tiling-x@pipe-a-dp-2-pipe-c-dp-1
igt@kms_plane_multiple@2x-tiling-x@pipe-a-dp-2-pipe-c-dp-1
xe-2899-8f917568adaeea8b649e337e7d0e03bd03332253

Starting dynamic subtest: pipe-A-DP-2-pipe-C-DP-1
(kms_plane_multiple:3993) igt_pipe_crc-CRITICAL: Test assertion failure functi...
(kms_plane_multiple:3993) igt_pipe_crc-CRITICAL: Failed assertion: !mismatch |...
Dynamic subtest pipe-A-DP-2-pipe-C-DP-1 failed.
**** DEBUG ****
(kms_plane_multiple:3993) igt_kms-DEBUG: plane C.2: Setting property "CRTC_ID"...
(kms_plane_multiple:3993) igt_kms-DEBUG: plane C.2: Setting property "rotation...
(kms_plane_multiple:3993) igt_kms-DEBUG: plane C.2: Setting property "COLOR_EN...
(kms_plane_multiple:3993) igt_kms-DEBUG: plane C.2: Setting property "COLOR_RA...
(kms_plane_multiple:3993) igt_kms-DEBUG: plane C.2: Setting property "pixel bl...
(kms_plane_multiple:3993) igt_kms-DEBUG: plane C.2: Setting property "alpha" t...
(kms_plane_multiple:3993) igt_kms-DEBUG: plane C.2: Setting property "FB_DAMAG...
(kms_plane_multiple:3993) igt_kms-DEBUG: plane C.2: Setting property "SCALING_...
(kms_plane_multiple:3993) igt_kms-DEBUG: display:     populating plane data: C...
(kms_plane_multiple:3993) igt_kms-DEBUG: plane C.3: Setting property "SRC_X" t...
(kms_plane_multiple:3993) igt_kms-DEBUG: plane C.3: Setting property "SRC_Y" t...
(kms_plane_multiple:3993) igt_kms-DEBUG: plane C.3: Setting property "SRC_W" t...
...
igt@kms_plane_multiple@2x-tiling-x@pipe-b-edp-1-pipe-a-dp-2
igt@kms_plane_multiple@2x-tiling-x@pipe-b-edp-1-pipe-a-dp-2
xe-2899-8f917568adaeea8b649e337e7d0e03bd03332253

Starting dynamic subtest: pipe-B-eDP-1-pipe-A-DP-2
(kms_plane_multiple:3993) igt_pipe_crc-CRITICAL: Test assertion failure functi...
(kms_plane_multiple:3993) igt_pipe_crc-CRITICAL: Failed assertion: !mismatch |...
Dynamic subtest pipe-B-eDP-1-pipe-A-DP-2 failed.
**** DEBUG ****
(kms_plane_multiple:3993) igt_kms-DEBUG: plane C.2: Setting property "CRTC_ID"...
(kms_plane_multiple:3993) igt_kms-DEBUG: plane C.2: Setting property "rotation...
(kms_plane_multiple:3993) igt_kms-DEBUG: plane C.2: Setting property "COLOR_EN...
(kms_plane_multiple:3993) igt_kms-DEBUG: plane C.2: Setting property "COLOR_RA...
(kms_plane_multiple:3993) igt_kms-DEBUG: plane C.2: Setting property "pixel bl...
(kms_plane_multiple:3993) igt_kms-DEBUG: plane C.2: Setting property "alpha" t...
(kms_plane_multiple:3993) igt_kms-DEBUG: plane C.2: Setting property "FB_DAMAG...
(kms_plane_multiple:3993) igt_kms-DEBUG: plane C.2: Setting property "SCALING_...
(kms_plane_multiple:3993) igt_kms-DEBUG: display:     populating plane data: C...
(kms_plane_multiple:3993) igt_kms-DEBUG: plane C.3: Setting property "SRC_X" t...
(kms_plane_multiple:3993) igt_kms-DEBUG: plane C.3: Setting property "SRC_Y" t...
(kms_plane_multiple:3993) igt_kms-DEBUG: plane C.3: Setting property "SRC_W" t...
...
igt@kms_plane_multiple@2x-tiling-x@pipe-b-edp-1-pipe-c-dp-1
igt@kms_plane_multiple@2x-tiling-x@pipe-b-edp-1-pipe-c-dp-1
xe-2899-8f917568adaeea8b649e337e7d0e03bd03332253

Starting dynamic subtest: pipe-B-eDP-1-pipe-C-DP-1
(kms_plane_multiple:3993) igt_pipe_crc-CRITICAL: Test assertion failure functi...
(kms_plane_multiple:3993) igt_pipe_crc-CRITICAL: Failed assertion: !mismatch |...
Dynamic subtest pipe-B-eDP-1-pipe-C-DP-1 failed.
**** DEBUG ****
(kms_plane_multiple:3993) igt_kms-DEBUG: plane C.2: Setting property "CRTC_ID"...
(kms_plane_multiple:3993) igt_kms-DEBUG: plane C.2: Setting property "rotation...
(kms_plane_multiple:3993) igt_kms-DEBUG: plane C.2: Setting property "COLOR_EN...
(kms_plane_multiple:3993) igt_kms-DEBUG: plane C.2: Setting property "COLOR_RA...
(kms_plane_multiple:3993) igt_kms-DEBUG: plane C.2: Setting property "pixel bl...
(kms_plane_multiple:3993) igt_kms-DEBUG: plane C.2: Setting property "alpha" t...
(kms_plane_multiple:3993) igt_kms-DEBUG: plane C.2: Setting property "FB_DAMAG...
(kms_plane_multiple:3993) igt_kms-DEBUG: plane C.2: Setting property "SCALING_...
(kms_plane_multiple:3993) igt_kms-DEBUG: display:     populating plane data: C...
(kms_plane_multiple:3993) igt_kms-DEBUG: plane C.3: Setting property "SRC_X" t...
(kms_plane_multiple:3993) igt_kms-DEBUG: plane C.3: Setting property "SRC_Y" t...
(kms_plane_multiple:3993) igt_kms-DEBUG: plane C.3: Setting property "SRC_W" t...
...
igt@kms_plane_multiple@2x-tiling-x@pipe-b-edp-1-pipe-c-dp-2
igt@kms_plane_multiple@2x-tiling-x@pipe-b-edp-1-pipe-c-dp-2
xe-2899-8f917568adaeea8b649e337e7d0e03bd03332253

Starting dynamic subtest: pipe-B-eDP-1-pipe-C-DP-2
(kms_plane_multiple:3993) igt_pipe_crc-CRITICAL: Test assertion failure functi...
(kms_plane_multiple:3993) igt_pipe_crc-CRITICAL: Failed assertion: !mismatch |...
Dynamic subtest pipe-B-eDP-1-pipe-C-DP-2 failed.
**** DEBUG ****
(kms_plane_multiple:3993) igt_kms-DEBUG: plane C.2: Setting property "CRTC_ID"...
(kms_plane_multiple:3993) igt_kms-DEBUG: plane C.2: Setting property "rotation...
(kms_plane_multiple:3993) igt_kms-DEBUG: plane C.2: Setting property "COLOR_EN...
(kms_plane_multiple:3993) igt_kms-DEBUG: plane C.2: Setting property "COLOR_RA...
(kms_plane_multiple:3993) igt_kms-DEBUG: plane C.2: Setting property "pixel bl...
(kms_plane_multiple:3993) igt_kms-DEBUG: plane C.2: Setting property "alpha" t...
(kms_plane_multiple:3993) igt_kms-DEBUG: plane C.2: Setting property "FB_DAMAG...
(kms_plane_multiple:3993) igt_kms-DEBUG: plane C.2: Setting property "SCALING_...
(kms_plane_multiple:3993) igt_kms-DEBUG: display:     populating plane data: C...
(kms_plane_multiple:3993) igt_kms-DEBUG: plane C.3: Setting property "SRC_X" t...
(kms_plane_multiple:3993) igt_kms-DEBUG: plane C.3: Setting property "SRC_Y" t...
(kms_plane_multiple:3993) igt_kms-DEBUG: plane C.3: Setting property "SRC_W" t...
...
igt@kms_plane_multiple@2x-tiling-x@pipe-b-dp-1-pipe-a-dp-2
igt@kms_plane_multiple@2x-tiling-x@pipe-b-dp-1-pipe-a-dp-2
xe-2899-8f917568adaeea8b649e337e7d0e03bd03332253

Starting dynamic subtest: pipe-B-DP-1-pipe-A-DP-2
(kms_plane_multiple:3993) igt_pipe_crc-CRITICAL: Test assertion failure functi...
(kms_plane_multiple:3993) igt_pipe_crc-CRITICAL: Failed assertion: !mismatch |...
Dynamic subtest pipe-B-DP-1-pipe-A-DP-2 failed.
**** DEBUG ****
(kms_plane_multiple:3993) igt_kms-DEBUG: plane C.2: Setting property "CRTC_ID"...
(kms_plane_multiple:3993) igt_kms-DEBUG: plane C.2: Setting property "rotation...
(kms_plane_multiple:3993) igt_kms-DEBUG: plane C.2: Setting property "COLOR_EN...
(kms_plane_multiple:3993) igt_kms-DEBUG: plane C.2: Setting property "COLOR_RA...
(kms_plane_multiple:3993) igt_kms-DEBUG: plane C.2: Setting property "pixel bl...
(kms_plane_multiple:3993) igt_kms-DEBUG: plane C.2: Setting property "alpha" t...
(kms_plane_multiple:3993) igt_kms-DEBUG: plane C.2: Setting property "FB_DAMAG...
(kms_plane_multiple:3993) igt_kms-DEBUG: plane C.2: Setting property "SCALING_...
(kms_plane_multiple:3993) igt_kms-DEBUG: display:     populating plane data: C...
(kms_plane_multiple:3993) igt_kms-DEBUG: plane C.3: Setting property "SRC_X" t...
(kms_plane_multiple:3993) igt_kms-DEBUG: plane C.3: Setting property "SRC_Y" t...
(kms_plane_multiple:3993) igt_kms-DEBUG: plane C.3: Setting property "SRC_W" t...
...
igt@kms_plane_multiple@2x-tiling-x@pipe-b-dp-1-pipe-c-dp-2
igt@kms_plane_multiple@2x-tiling-x@pipe-b-dp-1-pipe-c-dp-2
xe-2899-8f917568adaeea8b649e337e7d0e03bd03332253

Starting dynamic subtest: pipe-B-DP-1-pipe-C-DP-2
(kms_plane_multiple:3993) igt_pipe_crc-CRITICAL: Test assertion failure functi...
(kms_plane_multiple:3993) igt_pipe_crc-CRITICAL: Failed assertion: !mismatch |...
Dynamic subtest pipe-B-DP-1-pipe-C-DP-2 failed.
**** DEBUG ****
(kms_plane_multiple:3993) igt_kms-DEBUG: plane C.2: Setting property "CRTC_ID"...
(kms_plane_multiple:3993) igt_kms-DEBUG: plane C.2: Setting property "rotation...
(kms_plane_multiple:3993) igt_kms-DEBUG: plane C.2: Setting property "COLOR_EN...
(kms_plane_multiple:3993) igt_kms-DEBUG: plane C.2: Setting property "COLOR_RA...
(kms_plane_multiple:3993) igt_kms-DEBUG: plane C.2: Setting property "pixel bl...
(kms_plane_multiple:3993) igt_kms-DEBUG: plane C.2: Setting property "alpha" t...
(kms_plane_multiple:3993) igt_kms-DEBUG: plane C.2: Setting property "FB_DAMAG...
(kms_plane_multiple:3993) igt_kms-DEBUG: plane C.2: Setting property "SCALING_...
(kms_plane_multiple:3993) igt_kms-DEBUG: display:     populating plane data: C...
(kms_plane_multiple:3993) igt_kms-DEBUG: plane C.3: Setting property "SRC_X" t...
(kms_plane_multiple:3993) igt_kms-DEBUG: plane C.3: Setting property "SRC_Y" t...
(kms_plane_multiple:3993) igt_kms-DEBUG: plane C.3: Setting property "SRC_W" t...
...
igt@kms_plane_multiple@2x-tiling-x@pipe-b-dp-2-pipe-a-edp-1
igt@kms_plane_multiple@2x-tiling-x@pipe-b-dp-2-pipe-a-edp-1
xe-2899-8f917568adaeea8b649e337e7d0e03bd03332253

Starting dynamic subtest: pipe-B-DP-2-pipe-A-eDP-1
(kms_plane_multiple:3993) igt_pipe_crc-CRITICAL: Test assertion failure functi...
(kms_plane_multiple:3993) igt_pipe_crc-CRITICAL: Failed assertion: !mismatch |...
Dynamic subtest pipe-B-DP-2-pipe-A-eDP-1 failed.
**** DEBUG ****
(kms_plane_multiple:3993) igt_kms-DEBUG: plane C.2: Setting property "CRTC_ID"...
(kms_plane_multiple:3993) igt_kms-DEBUG: plane C.2: Setting property "rotation...
(kms_plane_multiple:3993) igt_kms-DEBUG: plane C.2: Setting property "COLOR_EN...
(kms_plane_multiple:3993) igt_kms-DEBUG: plane C.2: Setting property "COLOR_RA...
(kms_plane_multiple:3993) igt_kms-DEBUG: plane C.2: Setting property "pixel bl...
(kms_plane_multiple:3993) igt_kms-DEBUG: plane C.2: Setting property "alpha" t...
(kms_plane_multiple:3993) igt_kms-DEBUG: plane C.2: Setting property "FB_DAMAG...
(kms_plane_multiple:3993) igt_kms-DEBUG: plane C.2: Setting property "SCALING_...
(kms_plane_multiple:3993) igt_kms-DEBUG: display:     populating plane data: C...
(kms_plane_multiple:3993) igt_kms-DEBUG: plane C.3: Setting property "SRC_X" t...
(kms_plane_multiple:3993) igt_kms-DEBUG: plane C.3: Setting property "SRC_Y" t...
(kms_plane_multiple:3993) igt_kms-DEBUG: plane C.3: Setting property "SRC_W" t...
...
igt@kms_plane_multiple@2x-tiling-x@pipe-b-dp-2-pipe-a-dp-1
D igt@kms_plane_multiple@2x-tiling-x@pipe-b-dp-2-pipe-a-dp-1
xe-2899-8f917568adaeea8b649e337e7d0e03bd03332253

<3> [368.660793] [drm:drm_crtc_add_crc_entry] *ERROR* Overflow of CRC buffer, ...
igt@kms_plane_multiple@2x-tiling-x@pipe-b-dp-2-pipe-c-edp-1
igt@kms_plane_multiple@2x-tiling-x@pipe-b-dp-2-pipe-c-edp-1
xe-2899-8f917568adaeea8b649e337e7d0e03bd03332253

Starting dynamic subtest: pipe-B-DP-2-pipe-C-eDP-1
(kms_plane_multiple:3993) igt_pipe_crc-CRITICAL: Test assertion failure functi...
(kms_plane_multiple:3993) igt_pipe_crc-CRITICAL: Failed assertion: !mismatch |...
Dynamic subtest pipe-B-DP-2-pipe-C-eDP-1 failed.
**** DEBUG ****
(kms_plane_multiple:3993) igt_kms-DEBUG: plane C.2: Setting property "CRTC_ID"...
(kms_plane_multiple:3993) igt_kms-DEBUG: plane C.2: Setting property "rotation...
(kms_plane_multiple:3993) igt_kms-DEBUG: plane C.2: Setting property "COLOR_EN...
(kms_plane_multiple:3993) igt_kms-DEBUG: plane C.2: Setting property "COLOR_RA...
(kms_plane_multiple:3993) igt_kms-DEBUG: plane C.2: Setting property "pixel bl...
(kms_plane_multiple:3993) igt_kms-DEBUG: plane C.2: Setting property "alpha" t...
(kms_plane_multiple:3993) igt_kms-DEBUG: plane C.2: Setting property "FB_DAMAG...
(kms_plane_multiple:3993) igt_kms-DEBUG: plane C.2: Setting property "SCALING_...
(kms_plane_multiple:3993) igt_kms-DEBUG: display:     populating plane data: C...
(kms_plane_multiple:3993) igt_kms-DEBUG: plane C.3: Setting property "SRC_X" t...
(kms_plane_multiple:3993) igt_kms-DEBUG: plane C.3: Setting property "SRC_Y" t...
(kms_plane_multiple:3993) igt_kms-DEBUG: plane C.3: Setting property "SRC_W" t...
...
igt@kms_plane_multiple@2x-tiling-x@pipe-b-dp-2-pipe-c-dp-1
igt@kms_plane_multiple@2x-tiling-x@pipe-b-dp-2-pipe-c-dp-1
xe-2899-8f917568adaeea8b649e337e7d0e03bd03332253

Starting dynamic subtest: pipe-B-DP-2-pipe-C-DP-1
(kms_plane_multiple:3993) igt_pipe_crc-CRITICAL: Test assertion failure functi...
(kms_plane_multiple:3993) igt_pipe_crc-CRITICAL: Failed assertion: !mismatch |...
Dynamic subtest pipe-B-DP-2-pipe-C-DP-1 failed.
**** DEBUG ****
(kms_plane_multiple:3993) igt_kms-DEBUG: plane C.2: Setting property "CRTC_ID"...
(kms_plane_multiple:3993) igt_kms-DEBUG: plane C.2: Setting property "rotation...
(kms_plane_multiple:3993) igt_kms-DEBUG: plane C.2: Setting property "COLOR_EN...
(kms_plane_multiple:3993) igt_kms-DEBUG: plane C.2: Setting property "COLOR_RA...
(kms_plane_multiple:3993) igt_kms-DEBUG: plane C.2: Setting property "pixel bl...
(kms_plane_multiple:3993) igt_kms-DEBUG: plane C.2: Setting property "alpha" t...
(kms_plane_multiple:3993) igt_kms-DEBUG: plane C.2: Setting property "FB_DAMAG...
(kms_plane_multiple:3993) igt_kms-DEBUG: plane C.2: Setting property "SCALING_...
(kms_plane_multiple:3993) igt_kms-DEBUG: display:     populating plane data: C...
(kms_plane_multiple:3993) igt_kms-DEBUG: plane C.3: Setting property "SRC_X" t...
(kms_plane_multiple:3993) igt_kms-DEBUG: plane C.3: Setting property "SRC_Y" t...
(kms_plane_multiple:3993) igt_kms-DEBUG: plane C.3: Setting property "SRC_W" t...
...
igt@kms_plane_multiple@2x-tiling-x@pipe-c-edp-1-pipe-a-dp-2
igt@kms_plane_multiple@2x-tiling-x@pipe-c-edp-1-pipe-a-dp-2
xe-2899-8f917568adaeea8b649e337e7d0e03bd03332253

Starting dynamic subtest: pipe-C-eDP-1-pipe-A-DP-2
(kms_plane_multiple:3993) igt_pipe_crc-CRITICAL: Test assertion failure functi...
(kms_plane_multiple:3993) igt_pipe_crc-CRITICAL: Failed assertion: !mismatch |...
Dynamic subtest pipe-C-eDP-1-pipe-A-DP-2 failed.
**** DEBUG ****
(kms_plane_multiple:3993) igt_kms-DEBUG: plane C.2: Setting property "CRTC_ID"...
(kms_plane_multiple:3993) igt_kms-DEBUG: plane C.2: Setting property "rotation...
(kms_plane_multiple:3993) igt_kms-DEBUG: plane C.2: Setting property "COLOR_EN...
(kms_plane_multiple:3993) igt_kms-DEBUG: plane C.2: Setting property "COLOR_RA...
(kms_plane_multiple:3993) igt_kms-DEBUG: plane C.2: Setting property "pixel bl...
(kms_plane_multiple:3993) igt_kms-DEBUG: plane C.2: Setting property "alpha" t...
(kms_plane_multiple:3993) igt_kms-DEBUG: plane C.2: Setting property "FB_DAMAG...
(kms_plane_multiple:3993) igt_kms-DEBUG: plane C.2: Setting property "SCALING_...
(kms_plane_multiple:3993) igt_kms-DEBUG: display:     populating plane data: C...
(kms_plane_multiple:3993) igt_kms-DEBUG: plane C.3: Setting property "SRC_X" t...
(kms_plane_multiple:3993) igt_kms-DEBUG: plane C.3: Setting property "SRC_Y" t...
(kms_plane_multiple:3993) igt_kms-DEBUG: plane C.3: Setting property "SRC_W" t...
...
igt@kms_plane_multiple@2x-tiling-x@pipe-c-edp-1-pipe-b-dp-2
igt@kms_plane_multiple@2x-tiling-x@pipe-c-edp-1-pipe-b-dp-2
xe-2899-8f917568adaeea8b649e337e7d0e03bd03332253

Starting dynamic subtest: pipe-C-eDP-1-pipe-B-DP-2
(kms_plane_multiple:3993) igt_pipe_crc-CRITICAL: Test assertion failure functi...
(kms_plane_multiple:3993) igt_pipe_crc-CRITICAL: Failed assertion: !mismatch |...
Dynamic subtest pipe-C-eDP-1-pipe-B-DP-2 failed.
**** DEBUG ****
(kms_plane_multiple:3993) igt_kms-DEBUG: plane C.2: Setting property "CRTC_ID"...
(kms_plane_multiple:3993) igt_kms-DEBUG: plane C.2: Setting property "rotation...
(kms_plane_multiple:3993) igt_kms-DEBUG: plane C.2: Setting property "COLOR_EN...
(kms_plane_multiple:3993) igt_kms-DEBUG: plane C.2: Setting property "COLOR_RA...
(kms_plane_multiple:3993) igt_kms-DEBUG: plane C.2: Setting property "pixel bl...
(kms_plane_multiple:3993) igt_kms-DEBUG: plane C.2: Setting property "alpha" t...
(kms_plane_multiple:3993) igt_kms-DEBUG: plane C.2: Setting property "FB_DAMAG...
(kms_plane_multiple:3993) igt_kms-DEBUG: plane C.2: Setting property "SCALING_...
(kms_plane_multiple:3993) igt_kms-DEBUG: display:     populating plane data: C...
(kms_plane_multiple:3993) igt_kms-DEBUG: plane C.3: Setting property "SRC_X" t...
(kms_plane_multiple:3993) igt_kms-DEBUG: plane C.3: Setting property "SRC_Y" t...
(kms_plane_multiple:3993) igt_kms-DEBUG: plane C.3: Setting property "SRC_W" t...
...
igt@kms_plane_multiple@2x-tiling-x@pipe-c-dp-1-pipe-a-edp-1
D igt@kms_plane_multiple@2x-tiling-x@pipe-c-dp-1-pipe-a-edp-1
xe-2899-8f917568adaeea8b649e337e7d0e03bd03332253

<3> [390.453171] [drm:drm_crtc_add_crc_entry] *ERROR* Overflow of CRC buffer, ...
igt@kms_plane_multiple@2x-tiling-x@pipe-c-dp-1-pipe-a-dp-2
igt@kms_plane_multiple@2x-tiling-x@pipe-c-dp-1-pipe-a-dp-2
xe-2899-8f917568adaeea8b649e337e7d0e03bd03332253

Starting dynamic subtest: pipe-C-DP-1-pipe-A-DP-2
(kms_plane_multiple:3993) igt_pipe_crc-CRITICAL: Test assertion failure functi...
(kms_plane_multiple:3993) igt_pipe_crc-CRITICAL: Failed assertion: !mismatch |...
Dynamic subtest pipe-C-DP-1-pipe-A-DP-2 failed.
**** DEBUG ****
(kms_plane_multiple:3993) igt_kms-DEBUG: plane C.2: Setting property "CRTC_ID"...
(kms_plane_multiple:3993) igt_kms-DEBUG: plane C.2: Setting property "rotation...
(kms_plane_multiple:3993) igt_kms-DEBUG: plane C.2: Setting property "COLOR_EN...
(kms_plane_multiple:3993) igt_kms-DEBUG: plane C.2: Setting property "COLOR_RA...
(kms_plane_multiple:3993) igt_kms-DEBUG: plane C.2: Setting property "pixel bl...
(kms_plane_multiple:3993) igt_kms-DEBUG: plane C.2: Setting property "alpha" t...
(kms_plane_multiple:3993) igt_kms-DEBUG: plane C.2: Setting property "FB_DAMAG...
(kms_plane_multiple:3993) igt_kms-DEBUG: plane C.2: Setting property "SCALING_...
(kms_plane_multiple:3993) igt_kms-DEBUG: display:     populating plane data: C...
(kms_plane_multiple:3993) igt_kms-DEBUG: plane C.3: Setting property "SRC_X" t...
(kms_plane_multiple:3993) igt_kms-DEBUG: plane C.3: Setting property "SRC_Y" t...
(kms_plane_multiple:3993) igt_kms-DEBUG: plane C.3: Setting property "SRC_W" t...
...
igt@kms_plane_multiple@2x-tiling-x@pipe-c-dp-1-pipe-b-edp-1
igt@kms_plane_multiple@2x-tiling-x@pipe-c-dp-1-pipe-b-edp-1
xe-2899-8f917568adaeea8b649e337e7d0e03bd03332253

Starting dynamic subtest: pipe-C-DP-1-pipe-B-eDP-1
(kms_plane_multiple:3993) igt_pipe_crc-CRITICAL: Test assertion failure functi...
(kms_plane_multiple:3993) igt_pipe_crc-CRITICAL: Failed assertion: !mismatch |...
Dynamic subtest pipe-C-DP-1-pipe-B-eDP-1 failed.
**** DEBUG ****
(kms_plane_multiple:3993) igt_kms-DEBUG: plane C.2: Setting property "CRTC_ID"...
(kms_plane_multiple:3993) igt_kms-DEBUG: plane C.2: Setting property "rotation...
(kms_plane_multiple:3993) igt_kms-DEBUG: plane C.2: Setting property "COLOR_EN...
(kms_plane_multiple:3993) igt_kms-DEBUG: plane C.2: Setting property "COLOR_RA...
(kms_plane_multiple:3993) igt_kms-DEBUG: plane C.2: Setting property "pixel bl...
(kms_plane_multiple:3993) igt_kms-DEBUG: plane C.2: Setting property "alpha" t...
(kms_plane_multiple:3993) igt_kms-DEBUG: plane C.2: Setting property "FB_DAMAG...
(kms_plane_multiple:3993) igt_kms-DEBUG: plane C.2: Setting property "SCALING_...
(kms_plane_multiple:3993) igt_kms-DEBUG: display:     populating plane data: C...
(kms_plane_multiple:3993) igt_kms-DEBUG: plane C.3: Setting property "SRC_X" t...
(kms_plane_multiple:3993) igt_kms-DEBUG: plane C.3: Setting property "SRC_Y" t...
(kms_plane_multiple:3993) igt_kms-DEBUG: plane C.3: Setting property "SRC_W" t...
...
igt@kms_plane_multiple@2x-tiling-x@pipe-c-dp-1-pipe-b-dp-2
D igt@kms_plane_multiple@2x-tiling-x@pipe-c-dp-1-pipe-b-dp-2
xe-2899-8f917568adaeea8b649e337e7d0e03bd03332253

<3> [398.692259] [drm:drm_crtc_add_crc_entry] *ERROR* Overflow of CRC buffer, ...
igt@kms_plane_multiple@2x-tiling-x@pipe-c-dp-2-pipe-a-edp-1
igt@kms_plane_multiple@2x-tiling-x@pipe-c-dp-2-pipe-a-edp-1
xe-2899-8f917568adaeea8b649e337e7d0e03bd03332253

Starting dynamic subtest: pipe-C-DP-2-pipe-A-eDP-1
(kms_plane_multiple:3993) igt_pipe_crc-CRITICAL: Test assertion failure functi...
(kms_plane_multiple:3993) igt_pipe_crc-CRITICAL: Failed assertion: !mismatch |...
Dynamic subtest pipe-C-DP-2-pipe-A-eDP-1 failed.
**** DEBUG ****
(kms_plane_multiple:3993) igt_kms-DEBUG: plane C.2: Setting property "CRTC_ID"...
(kms_plane_multiple:3993) igt_kms-DEBUG: plane C.2: Setting property "rotation...
(kms_plane_multiple:3993) igt_kms-DEBUG: plane C.2: Setting property "COLOR_EN...
(kms_plane_multiple:3993) igt_kms-DEBUG: plane C.2: Setting property "COLOR_RA...
(kms_plane_multiple:3993) igt_kms-DEBUG: plane C.2: Setting property "pixel bl...
(kms_plane_multiple:3993) igt_kms-DEBUG: plane C.2: Setting property "alpha" t...
(kms_plane_multiple:3993) igt_kms-DEBUG: plane C.2: Setting property "FB_DAMAG...
(kms_plane_multiple:3993) igt_kms-DEBUG: plane C.2: Setting property "SCALING_...
(kms_plane_multiple:3993) igt_kms-DEBUG: display:     populating plane data: C...
(kms_plane_multiple:3993) igt_kms-DEBUG: plane C.3: Setting property "SRC_X" t...
(kms_plane_multiple:3993) igt_kms-DEBUG: plane C.3: Setting property "SRC_Y" t...
(kms_plane_multiple:3993) igt_kms-DEBUG: plane C.3: Setting property "SRC_W" t...
...
igt@kms_plane_multiple@2x-tiling-x@pipe-c-dp-2-pipe-a-dp-1
igt@kms_plane_multiple@2x-tiling-x@pipe-c-dp-2-pipe-a-dp-1
xe-2899-8f917568adaeea8b649e337e7d0e03bd03332253

Starting dynamic subtest: pipe-C-DP-2-pipe-A-DP-1
(kms_plane_multiple:3993) igt_pipe_crc-CRITICAL: Test assertion failure functi...
(kms_plane_multiple:3993) igt_pipe_crc-CRITICAL: Failed assertion: !mismatch |...
Dynamic subtest pipe-C-DP-2-pipe-A-DP-1 failed.
**** DEBUG ****
(kms_plane_multiple:3993) igt_kms-DEBUG: plane C.2: Setting property "CRTC_ID"...
(kms_plane_multiple:3993) igt_kms-DEBUG: plane C.2: Setting property "rotation...
(kms_plane_multiple:3993) igt_kms-DEBUG: plane C.2: Setting property "COLOR_EN...
(kms_plane_multiple:3993) igt_kms-DEBUG: plane C.2: Setting property "COLOR_RA...
(kms_plane_multiple:3993) igt_kms-DEBUG: plane C.2: Setting property "pixel bl...
(kms_plane_multiple:3993) igt_kms-DEBUG: plane C.2: Setting property "alpha" t...
(kms_plane_multiple:3993) igt_kms-DEBUG: plane C.2: Setting property "FB_DAMAG...
(kms_plane_multiple:3993) igt_kms-DEBUG: plane C.2: Setting property "SCALING_...
(kms_plane_multiple:3993) igt_kms-DEBUG: display:     populating plane data: C...
(kms_plane_multiple:3993) igt_kms-DEBUG: plane C.3: Setting property "SRC_X" t...
(kms_plane_multiple:3993) igt_kms-DEBUG: plane C.3: Setting property "SRC_Y" t...
(kms_plane_multiple:3993) igt_kms-DEBUG: plane C.3: Setting property "SRC_W" t...
...
igt@kms_plane_multiple@2x-tiling-x@pipe-c-dp-2-pipe-b-edp-1
igt@kms_plane_multiple@2x-tiling-x@pipe-c-dp-2-pipe-b-edp-1
xe-2899-8f917568adaeea8b649e337e7d0e03bd03332253

Starting dynamic subtest: pipe-C-DP-2-pipe-B-eDP-1
(kms_plane_multiple:3993) igt_pipe_crc-CRITICAL: Test assertion failure functi...
(kms_plane_multiple:3993) igt_pipe_crc-CRITICAL: Failed assertion: !mismatch |...
Dynamic subtest pipe-C-DP-2-pipe-B-eDP-1 failed.
**** DEBUG ****
(kms_plane_multiple:3993) igt_kms-DEBUG: plane C.2: Setting property "CRTC_ID"...
(kms_plane_multiple:3993) igt_kms-DEBUG: plane C.2: Setting property "rotation...
(kms_plane_multiple:3993) igt_kms-DEBUG: plane C.2: Setting property "COLOR_EN...
(kms_plane_multiple:3993) igt_kms-DEBUG: plane C.2: Setting property "COLOR_RA...
(kms_plane_multiple:3993) igt_kms-DEBUG: plane C.2: Setting property "pixel bl...
(kms_plane_multiple:3993) igt_kms-DEBUG: plane C.2: Setting property "alpha" t...
(kms_plane_multiple:3993) igt_kms-DEBUG: plane C.2: Setting property "FB_DAMAG...
(kms_plane_multiple:3993) igt_kms-DEBUG: plane C.2: Setting property "SCALING_...
(kms_plane_multiple:3993) igt_kms-DEBUG: display:     populating plane data: C...
(kms_plane_multiple:3993) igt_kms-DEBUG: plane C.3: Setting property "SRC_X" t...
(kms_plane_multiple:3993) igt_kms-DEBUG: plane C.3: Setting property "SRC_Y" t...
(kms_plane_multiple:3993) igt_kms-DEBUG: plane C.3: Setting property "SRC_W" t...
...
igt@kms_plane_multiple@2x-tiling-x@pipe-c-dp-2-pipe-b-dp-1
igt@kms_plane_multiple@2x-tiling-x@pipe-c-dp-2-pipe-b-dp-1
xe-2899-8f917568adaeea8b649e337e7d0e03bd03332253

Starting dynamic subtest: pipe-C-DP-2-pipe-B-DP-1
(kms_plane_multiple:3993) igt_pipe_crc-CRITICAL: Test assertion failure functi...
(kms_plane_multiple:3993) igt_pipe_crc-CRITICAL: Failed assertion: !mismatch |...
Dynamic subtest pipe-C-DP-2-pipe-B-DP-1 failed.
**** DEBUG ****
(kms_plane_multiple:3993) igt_kms-DEBUG: plane C.2: Setting property "CRTC_ID"...
(kms_plane_multiple:3993) igt_kms-DEBUG: plane C.2: Setting property "rotation...
(kms_plane_multiple:3993) igt_kms-DEBUG: plane C.2: Setting property "COLOR_EN...
(kms_plane_multiple:3993) igt_kms-DEBUG: plane C.2: Setting property "COLOR_RA...
(kms_plane_multiple:3993) igt_kms-DEBUG: plane C.2: Setting property "pixel bl...
(kms_plane_multiple:3993) igt_kms-DEBUG: plane C.2: Setting property "alpha" t...
(kms_plane_multiple:3993) igt_kms-DEBUG: plane C.2: Setting property "FB_DAMAG...
(kms_plane_multiple:3993) igt_kms-DEBUG: plane C.2: Setting property "SCALING_...
(kms_plane_multiple:3993) igt_kms-DEBUG: display:     populating plane data: C...
(kms_plane_multiple:3993) igt_kms-DEBUG: plane C.3: Setting property "SRC_X" t...
(kms_plane_multiple:3993) igt_kms-DEBUG: plane C.3: Setting property "SRC_Y" t...
(kms_plane_multiple:3993) igt_kms-DEBUG: plane C.3: Setting property "SRC_W" t...
...
igt@kms_plane_multiple@tiling-x@pipe-c-dp-1
D igt@kms_plane_multiple@tiling-x@pipe-c-dp-1
xe-2899-8f917568adaeea8b649e337e7d0e03bd03332253

<3> [490.437967] [drm:drm_crtc_add_crc_entry] *ERROR* Overflow of CRC buffer, ...
igt@kms_setmode@invalid-clone-single-crtc-stealing@pipe-a-edp-1-dp-2
igt@kms_setmode@invalid-clone-single-crtc-stealing@pipe-a-edp-1-dp-2
xe-2899-8f917568adaeea8b649e337e7d0e03bd03332253

Starting dynamic subtest: pipe-A-eDP-1-DP-2
(kms_setmode:4679) CRITICAL: Test assertion failure function test_stealing, fi...
(kms_setmode:4679) CRITICAL: Failed assertion: ret == 0
(kms_setmode:4679) CRITICAL: Last errno: 22, Invalid argument
(kms_setmode:4679) CRITICAL: error: -22 != 0
Dynamic subtest pipe-A-eDP-1-DP-2 failed.
**** DEBUG ****
(kms_setmode:4679) INFO:   Test id#3 CRTC count 1
(kms_setmode:4679) INFO:     CRTC[82] [Pipe A] Mode: 3840x2160@30Hz Connectors...
(kms_setmode:4679) igt_fb-DEBUG: igt_create_fb_with_bo_size(width=3840, height...
(kms_setmode:4679) igt_fb-DEBUG: igt_create_fb_with_bo_size(handle=4, pitch=15...
(kms_setmode:4679) ioctl_wrappers-DEBUG: Test requirement passed: igt_has_fb_m...
(kms_setmode:4679) igt_fb-DEBUG: Test requirement passed: cairo_surface_status...
(kms_setmode:4679) igt_fb-DEBUG: Test requirement passed: cairo_surface_status...
(kms_setmode:4679) CRITICAL: Test assertion failure function test_stealing, fi...
(kms_setmode:4679) CRITICAL: Failed assertion: ret == 0
(kms_setmode:4679) CRITICAL: Last errno: 22, Invalid argument
...
igt@kms_setmode@invalid-clone-single-crtc-stealing@pipe-a-edp-1-dp-2
xe-2895-0d2ff6d7ad3b6bf64c5c0e9a921fcfa925029526

Starting dynamic subtest: pipe-A-eDP-1-DP-2
(kms_setmode:12650) CRITICAL: Test assertion failure function test_stealing, f...
(kms_setmode:12650) CRITICAL: Failed assertion: ret == 0
(kms_setmode:12650) CRITICAL: Last errno: 22, Invalid argument
(kms_setmode:12650) CRITICAL: error: -22 != 0
Dynamic subtest pipe-A-eDP-1-DP-2 failed.
**** DEBUG ****
(kms_setmode:12650) INFO:   Test id#3 CRTC count 1
(kms_setmode:12650) INFO:     CRTC[82] [Pipe A] Mode: 3840x2160@30Hz Connector...
(kms_setmode:12650) igt_fb-DEBUG: igt_create_fb_with_bo_size(width=3840, heigh...
(kms_setmode:12650) igt_fb-DEBUG: igt_create_fb_with_bo_size(handle=4, pitch=1...
(kms_setmode:12650) ioctl_wrappers-DEBUG: Test requirement passed: igt_has_fb_...
(kms_setmode:12650) intel_allocator_simple-DEBUG: Using simple allocator
(kms_setmode:12650) intel_allocator_simple-DEBUG: <ial: 0x6212f2e42b60, fd: 5>...
(kms_setmode:12650) intel_allocator_simple-DEBUG: <ial: 0x6212f2e42b60, fd: 5>...
(kms_setmode:12650) intel_allocator_simple-DEBUG: Using simple allocator
(kms_setmode:12650) intel_allocator_simple-DEBUG: <ial: 0x6212f2e39c60, fd: 5>...
...
igt@kms_setmode@invalid-clone-single-crtc-stealing@pipe-b-edp-1-dp-2
igt@kms_setmode@invalid-clone-single-crtc-stealing@pipe-b-edp-1-dp-2
xe-2899-8f917568adaeea8b649e337e7d0e03bd03332253

Starting dynamic subtest: pipe-B-eDP-1-DP-2
(kms_setmode:4679) CRITICAL: Test assertion failure function test_stealing, fi...
(kms_setmode:4679) CRITICAL: Failed assertion: ret == 0
(kms_setmode:4679) CRITICAL: Last errno: 22, Invalid argument
(kms_setmode:4679) CRITICAL: error: -22 != 0
Dynamic subtest pipe-B-eDP-1-DP-2 failed.
**** DEBUG ****
(kms_setmode:4679) INFO:   Test id#4 CRTC count 1
(kms_setmode:4679) INFO:     CRTC[134] [Pipe B] Mode: 3840x2160@30Hz Connector...
(kms_setmode:4679) igt_fb-DEBUG: igt_create_fb_with_bo_size(width=3840, height...
(kms_setmode:4679) igt_fb-DEBUG: igt_create_fb_with_bo_size(handle=5, pitch=15...
(kms_setmode:4679) ioctl_wrappers-DEBUG: Test requirement passed: igt_has_fb_m...
(kms_setmode:4679) igt_fb-DEBUG: Test requirement passed: cairo_surface_status...
(kms_setmode:4679) igt_fb-DEBUG: Test requirement passed: cairo_surface_status...
(kms_setmode:4679) CRITICAL: Test assertion failure function test_stealing, fi...
(kms_setmode:4679) CRITICAL: Failed assertion: ret == 0
(kms_setmode:4679) CRITICAL: Last errno: 22, Invalid argument
...
igt@kms_setmode@invalid-clone-single-crtc-stealing@pipe-b-edp-1-dp-2
xe-2895-0d2ff6d7ad3b6bf64c5c0e9a921fcfa925029526

Starting dynamic subtest: pipe-B-eDP-1-DP-2
(kms_setmode:12650) CRITICAL: Test assertion failure function test_stealing, f...
(kms_setmode:12650) CRITICAL: Failed assertion: ret == 0
(kms_setmode:12650) CRITICAL: Last errno: 22, Invalid argument
(kms_setmode:12650) CRITICAL: error: -22 != 0
Dynamic subtest pipe-B-eDP-1-DP-2 failed.
**** DEBUG ****
(kms_setmode:12650) INFO:   Test id#4 CRTC count 1
(kms_setmode:12650) INFO:     CRTC[134] [Pipe B] Mode: 3840x2160@30Hz Connecto...
(kms_setmode:12650) igt_fb-DEBUG: igt_create_fb_with_bo_size(width=3840, heigh...
(kms_setmode:12650) igt_fb-DEBUG: igt_create_fb_with_bo_size(handle=5, pitch=1...
(kms_setmode:12650) ioctl_wrappers-DEBUG: Test requirement passed: igt_has_fb_...
(kms_setmode:12650) intel_allocator_simple-DEBUG: Using simple allocator
(kms_setmode:12650) intel_allocator_simple-DEBUG: <ial: 0x6212f2ea0a60, fd: 5>...
(kms_setmode:12650) intel_allocator_simple-DEBUG: <ial: 0x6212f2ea0a60, fd: 5>...
(kms_setmode:12650) intel_allocator_simple-DEBUG: Using simple allocator
(kms_setmode:12650) intel_allocator_simple-DEBUG: <ial: 0x6212f2eb1300, fd: 5>...
...
Created at 2025-04-03 17:27:47