FAIL WARN PASS SKIP TIMEOUT NOT RUN INCOMPLETE ABORT CRASH
 
xe-2900-135e2838ed7d44d880e7e19971b1234e6ae04ded xe-2899-8f917568adaeea8b649e337e7d0e03bd03332253 xe-2895-0d2ff6d7ad3b6bf64c5c0e9a921fcfa925029526
igt@intel_hwmon@hwmon-write
igt@intel_hwmon@hwmon-write
xe-2899-8f917568adaeea8b649e337e7d0e03bd03332253

Starting subtest: hwmon-write
(intel_hwmon:2899) igt_sysfs-CRITICAL: Test assertion failure function igt_sys...
(intel_hwmon:2899) igt_sysfs-CRITICAL: Failed assertion: !ret
(intel_hwmon:2899) igt_sysfs-CRITICAL: Last errno: 22, Invalid argument
Subtest hwmon-write failed.
**** DEBUG ****
(intel_hwmon:2899) igt_sysfs-DEBUG: 'power1_max_interval': prev 0
(intel_hwmon:2899) igt_sysfs-DEBUG: 'power1_max_interval': sweeping range of v...
(intel_hwmon:2899) igt_sysfs-DEBUG: 'power1_max_interval': ret 1 set 1 get 0
(intel_hwmon:2899) igt_sysfs-DEBUG: 'power1_max_interval': ret 1 set 2 get 0
(intel_hwmon:2899) igt_sysfs-DEBUG: 'power1_max_interval': ret 1 set 4 get 0
(intel_hwmon:2899) igt_sysfs-DEBUG: 'power1_max_interval': ret 1 set 8 get 0
(intel_hwmon:2899) igt_sysfs-DEBUG: 'power1_max_interval': ret 1 set 16 get 0
(intel_hwmon:2899) igt_sysfs-DEBUG: 'power1_max_interval': ret 1 set 32 get 0
(intel_hwmon:2899) igt_sysfs-DEBUG: 'power1_max_interval': ret 1 set 64 get 0
(intel_hwmon:2899) igt_sysfs-DEBUG: 'power1_max_interval': ret 1 set 128 get 0
(intel_hwmon:2899) igt_sysfs-DEBUG: 'power1_max_interval': ret 1 set 256 get 0
...
igt@intel_hwmon@hwmon-write
xe-2895-0d2ff6d7ad3b6bf64c5c0e9a921fcfa925029526

Starting subtest: hwmon-write
(intel_hwmon:2912) igt_sysfs-CRITICAL: Test assertion failure function igt_sys...
(intel_hwmon:2912) igt_sysfs-CRITICAL: Failed assertion: !ret
(intel_hwmon:2912) igt_sysfs-CRITICAL: Last errno: 22, Invalid argument
Subtest hwmon-write failed.
**** DEBUG ****
(intel_hwmon:2912) igt_sysfs-DEBUG: 'power1_max_interval': prev 0
(intel_hwmon:2912) igt_sysfs-DEBUG: 'power1_max_interval': sweeping range of v...
(intel_hwmon:2912) igt_sysfs-DEBUG: 'power1_max_interval': ret 1 set 1 get 0
(intel_hwmon:2912) igt_sysfs-DEBUG: 'power1_max_interval': ret 1 set 2 get 0
(intel_hwmon:2912) igt_sysfs-DEBUG: 'power1_max_interval': ret 1 set 4 get 0
(intel_hwmon:2912) igt_sysfs-DEBUG: 'power1_max_interval': ret 1 set 8 get 0
(intel_hwmon:2912) igt_sysfs-DEBUG: 'power1_max_interval': ret 1 set 16 get 0
(intel_hwmon:2912) igt_sysfs-DEBUG: 'power1_max_interval': ret 1 set 32 get 0
(intel_hwmon:2912) igt_sysfs-DEBUG: 'power1_max_interval': ret 1 set 64 get 0
(intel_hwmon:2912) igt_sysfs-DEBUG: 'power1_max_interval': ret 1 set 128 get 0
(intel_hwmon:2912) igt_sysfs-DEBUG: 'power1_max_interval': ret 1 set 256 get 0
...
igt@xe_compute_preempt@compute-preempt-many
igt@xe_compute_preempt@compute-preempt-many
xe-2899-8f917568adaeea8b649e337e7d0e03bd03332253

Starting subtest: compute-preempt-many
Starting dynamic subtest: engine-DRM_XE_ENGINE_CLASS_COMPUTE
(xe_compute_preempt:5835) intel_compute-CRITICAL: Test assertion failure funct...
(xe_compute_preempt:5835) intel_compute-CRITICAL: Failed assertion: 0 != __xe_...
(xe_compute_preempt:5835) intel_compute-CRITICAL: error: 0 == 0
Dynamic subtest engine-DRM_XE_ENGINE_CLASS_COMPUTE failed.
**** DEBUG ****
(xe_compute_preempt:5753) intel_compute-DEBUG: [i:  0 name:     instr state ba...
(xe_compute_preempt:5753) intel_compute-DEBUG: [i:  1 name:   dynamic state ba...
(xe_compute_preempt:5753) intel_compute-DEBUG: [i:  2 name:   surface state ba...
(xe_compute_preempt:5753) intel_compute-DEBUG: [i:  3 name: indirect object ba...
(xe_compute_preempt:5753) intel_compute-DEBUG: [i:  4 name:           addr inp...
(xe_compute_preempt:5753) intel_compute-DEBUG: [i:  5 name:          addr outp...
(xe_compute_preempt:5753) intel_compute-DEBUG: [i:  6 name:   general state ba...
(xe_compute_preempt:5753) intel_compute-DEBUG: [i:  7 name:        binding tab...
(xe_compute_preempt:5753) intel_compute-DEBUG: [i:  8 name:                bat...
(xe_compute_preempt:5753) intel_compute-DEBUG: [i:  9 name: state context data...
...
igt@xe_compute_preempt@compute-preempt-many
xe-2895-0d2ff6d7ad3b6bf64c5c0e9a921fcfa925029526

Starting subtest: compute-preempt-many
Starting dynamic subtest: engine-DRM_XE_ENGINE_CLASS_COMPUTE
(xe_compute_preempt:16495) intel_compute-CRITICAL: Test assertion failure func...
(xe_compute_preempt:16495) intel_compute-CRITICAL: Failed assertion: 0 != __xe...
(xe_compute_preempt:16495) intel_compute-CRITICAL: error: 0 == 0
(xe_compute_preempt:16660) intel_compute-CRITICAL: Test assertion failure func...
(xe_compute_preempt:16660) intel_compute-CRITICAL: Failed assertion: 0 != __xe...
(xe_compute_preempt:16660) intel_compute-CRITICAL: error: 0 == 0
Dynamic subtest engine-DRM_XE_ENGINE_CLASS_COMPUTE failed.
**** DEBUG ****
(xe_compute_preempt:16360) intel_compute-DEBUG: [i:  0 name:     instr state b...
(xe_compute_preempt:16360) intel_compute-DEBUG: [i:  1 name:   dynamic state b...
(xe_compute_preempt:16360) intel_compute-DEBUG: [i:  2 name:   surface state b...
(xe_compute_preempt:16360) intel_compute-DEBUG: [i:  3 name: indirect object b...
(xe_compute_preempt:16360) intel_compute-DEBUG: [i:  4 name:           addr in...
(xe_compute_preempt:16360) intel_compute-DEBUG: [i:  5 name:          addr out...
(xe_compute_preempt:16360) intel_compute-DEBUG: [i:  6 name:   general state b...
...
igt@xe_compute_preempt@compute-preempt-many@engine-drm_xe_engine_class_compute
igt@xe_compute_preempt@compute-preempt-many@engine-drm_xe_engine_class_compute
xe-2899-8f917568adaeea8b649e337e7d0e03bd03332253

Starting subtest: compute-preempt-many
Starting dynamic subtest: engine-DRM_XE_ENGINE_CLASS_COMPUTE
(xe_compute_preempt:5835) intel_compute-CRITICAL: Test assertion failure funct...
(xe_compute_preempt:5835) intel_compute-CRITICAL: Failed assertion: 0 != __xe_...
(xe_compute_preempt:5835) intel_compute-CRITICAL: error: 0 == 0
Dynamic subtest engine-DRM_XE_ENGINE_CLASS_COMPUTE failed.
**** DEBUG ****
(xe_compute_preempt:5753) intel_compute-DEBUG: [i:  0 name:     instr state ba...
(xe_compute_preempt:5753) intel_compute-DEBUG: [i:  1 name:   dynamic state ba...
(xe_compute_preempt:5753) intel_compute-DEBUG: [i:  2 name:   surface state ba...
(xe_compute_preempt:5753) intel_compute-DEBUG: [i:  3 name: indirect object ba...
(xe_compute_preempt:5753) intel_compute-DEBUG: [i:  4 name:           addr inp...
(xe_compute_preempt:5753) intel_compute-DEBUG: [i:  5 name:          addr outp...
(xe_compute_preempt:5753) intel_compute-DEBUG: [i:  6 name:   general state ba...
(xe_compute_preempt:5753) intel_compute-DEBUG: [i:  7 name:        binding tab...
(xe_compute_preempt:5753) intel_compute-DEBUG: [i:  8 name:                bat...
(xe_compute_preempt:5753) intel_compute-DEBUG: [i:  9 name: state context data...
...
igt@xe_compute_preempt@compute-preempt-many@engine-drm_xe_engine_class_compute
xe-2895-0d2ff6d7ad3b6bf64c5c0e9a921fcfa925029526

Starting subtest: compute-preempt-many
Starting dynamic subtest: engine-DRM_XE_ENGINE_CLASS_COMPUTE
(xe_compute_preempt:16495) intel_compute-CRITICAL: Test assertion failure func...
(xe_compute_preempt:16495) intel_compute-CRITICAL: Failed assertion: 0 != __xe...
(xe_compute_preempt:16495) intel_compute-CRITICAL: error: 0 == 0
(xe_compute_preempt:16660) intel_compute-CRITICAL: Test assertion failure func...
(xe_compute_preempt:16660) intel_compute-CRITICAL: Failed assertion: 0 != __xe...
(xe_compute_preempt:16660) intel_compute-CRITICAL: error: 0 == 0
Dynamic subtest engine-DRM_XE_ENGINE_CLASS_COMPUTE failed.
**** DEBUG ****
(xe_compute_preempt:16360) intel_compute-DEBUG: [i:  0 name:     instr state b...
(xe_compute_preempt:16360) intel_compute-DEBUG: [i:  1 name:   dynamic state b...
(xe_compute_preempt:16360) intel_compute-DEBUG: [i:  2 name:   surface state b...
(xe_compute_preempt:16360) intel_compute-DEBUG: [i:  3 name: indirect object b...
(xe_compute_preempt:16360) intel_compute-DEBUG: [i:  4 name:           addr in...
(xe_compute_preempt:16360) intel_compute-DEBUG: [i:  5 name:          addr out...
(xe_compute_preempt:16360) intel_compute-DEBUG: [i:  6 name:   general state b...
...
igt@kms_flip@2x-plain-flip-ts-check
igt@kms_flip@2x-plain-flip-ts-check
xe-2899-8f917568adaeea8b649e337e7d0e03bd03332253

Starting subtest: 2x-plain-flip-ts-check
Starting dynamic subtest: AB-DP2-HDMI-A3
Dynamic subtest AB-DP2-HDMI-A3: SUCCESS (5.762s)
Starting dynamic subtest: AC-DP2-HDMI-A3
Dynamic subtest AC-DP2-HDMI-A3: SUCCESS (5.702s)
Starting dynamic subtest: AD-DP2-HDMI-A3
(kms_flip:3333) CRITICAL: Test assertion failure function __run_test_on_crtc_s...
(kms_flip:3333) CRITICAL: Failed assertion: !retried && needs_retry_after_link...
Dynamic subtest AD-DP2-HDMI-A3 failed.
**** DEBUG ****
(kms_flip:3333) igt_fb-DEBUG: igt_create_fb_with_bo_size(width=3840, height=21...
(kms_flip:3333) igt_fb-DEBUG: igt_create_fb_with_bo_size(handle=1, pitch=15360)
(kms_flip:3333) ioctl_wrappers-DEBUG: Test requirement passed: igt_has_fb_modi...
(kms_flip:3333) igt_fb-DEBUG: igt_create_fb_with_bo_size(width=3840, height=21...
(kms_flip:3333) igt_fb-DEBUG: igt_create_fb_with_bo_size(handle=2, pitch=15360)
(kms_flip:3333) ioctl_wrappers-DEBUG: Test requirement passed: igt_has_fb_modi...
(kms_flip:3333) intel_allocator_simple-DEBUG: Using simple allocator
...
igt@kms_flip@2x-plain-flip-ts-check
xe-2895-0d2ff6d7ad3b6bf64c5c0e9a921fcfa925029526

Starting subtest: 2x-plain-flip-ts-check
Starting dynamic subtest: AB-DP2-HDMI-A3
Dynamic subtest AB-DP2-HDMI-A3: SUCCESS (5.772s)
Starting dynamic subtest: AC-DP2-HDMI-A3
Dynamic subtest AC-DP2-HDMI-A3: SUCCESS (5.701s)
Starting dynamic subtest: AD-DP2-HDMI-A3
(kms_flip:2623) CRITICAL: Test assertion failure function __run_test_on_crtc_s...
(kms_flip:2623) CRITICAL: Failed assertion: !retried && needs_retry_after_link...
Dynamic subtest AD-DP2-HDMI-A3 failed.
**** DEBUG ****
(kms_flip:2623) igt_fb-DEBUG: igt_create_fb_with_bo_size(width=3840, height=21...
(kms_flip:2623) igt_fb-DEBUG: igt_create_fb_with_bo_size(handle=1, pitch=15360)
(kms_flip:2623) ioctl_wrappers-DEBUG: Test requirement passed: igt_has_fb_modi...
(kms_flip:2623) igt_fb-DEBUG: igt_create_fb_with_bo_size(width=3840, height=21...
(kms_flip:2623) igt_fb-DEBUG: igt_create_fb_with_bo_size(handle=2, pitch=15360)
(kms_flip:2623) ioctl_wrappers-DEBUG: Test requirement passed: igt_has_fb_modi...
(kms_flip:2623) intel_allocator_simple-DEBUG: Using simple allocator
...
igt@kms_flip@2x-plain-flip-ts-check-interruptible
igt@kms_flip@2x-plain-flip-ts-check-interruptible
xe-2899-8f917568adaeea8b649e337e7d0e03bd03332253

Starting subtest: 2x-plain-flip-ts-check-interruptible
Starting dynamic subtest: AB-DP2-HDMI-A3
(kms_flip:3403) CRITICAL: Test assertion failure function __run_test_on_crtc_s...
(kms_flip:3403) CRITICAL: Failed assertion: !retried && needs_retry_after_link...
(kms_flip:3403) CRITICAL: Last errno: 4, Interrupted system call
Dynamic subtest AB-DP2-HDMI-A3 failed.
**** DEBUG ****
(kms_flip:3403) igt_fb-DEBUG: igt_create_fb_with_bo_size(width=3840, height=21...
(kms_flip:3403) igt_fb-DEBUG: igt_create_fb_with_bo_size(handle=1, pitch=15360)
(kms_flip:3403) ioctl_wrappers-DEBUG: Test requirement passed: igt_has_fb_modi...
(kms_flip:3403) igt_fb-DEBUG: igt_create_fb_with_bo_size(width=3840, height=21...
(kms_flip:3403) igt_fb-DEBUG: igt_create_fb_with_bo_size(handle=2, pitch=15360)
(kms_flip:3403) ioctl_wrappers-DEBUG: Test requirement passed: igt_has_fb_modi...
(kms_flip:3403) intel_allocator_simple-DEBUG: Using simple allocator
(kms_flip:3403) intel_allocator_simple-DEBUG: <ial: 0x5b5089a18720, fd: 5> obj...
(kms_flip:3403) intel_allocator_simple-DEBUG: <ial: 0x5b5089a18720, fd: 5> obj...
(kms_flip:3403) intel_allocator_simple-DEBUG: Using simple allocator
...
igt@kms_flip@2x-plain-flip-ts-check-interruptible
xe-2895-0d2ff6d7ad3b6bf64c5c0e9a921fcfa925029526

Starting subtest: 2x-plain-flip-ts-check-interruptible
Starting dynamic subtest: AB-DP2-HDMI-A3
Dynamic subtest AB-DP2-HDMI-A3: SUCCESS (5.750s)
Starting dynamic subtest: AC-DP2-HDMI-A3
(kms_flip:2693) CRITICAL: Test assertion failure function __run_test_on_crtc_s...
(kms_flip:2693) CRITICAL: Failed assertion: !retried && needs_retry_after_link...
(kms_flip:2693) CRITICAL: Last errno: 4, Interrupted system call
Dynamic subtest AC-DP2-HDMI-A3 failed.
**** DEBUG ****
(kms_flip:2693) DEBUG: name = flip
last_ts = 172.144821
last_received_ts = 172.144348
last_seq = 4256
current_ts = 172.161499
current_received_ts = 172.160995
current_seq = 4257
count = 159
...
igt@kms_flip@2x-plain-flip-fb-recreate
igt@kms_flip@2x-plain-flip-fb-recreate
xe-2899-8f917568adaeea8b649e337e7d0e03bd03332253

Starting subtest: 2x-plain-flip-fb-recreate
Starting dynamic subtest: AB-DP2-HDMI-A3
(kms_flip:3126) CRITICAL: Test assertion failure function __run_test_on_crtc_s...
(kms_flip:3126) CRITICAL: Failed assertion: !retried && needs_retry_after_link...
Dynamic subtest AB-DP2-HDMI-A3 failed.
**** DEBUG ****
(kms_flip:3126) igt_fb-DEBUG: igt_create_fb_with_bo_size(width=3840, height=21...
(kms_flip:3126) igt_fb-DEBUG: igt_create_fb_with_bo_size(handle=1, pitch=15360)
(kms_flip:3126) ioctl_wrappers-DEBUG: Test requirement passed: igt_has_fb_modi...
(kms_flip:3126) igt_fb-DEBUG: igt_create_fb_with_bo_size(width=3840, height=21...
(kms_flip:3126) igt_fb-DEBUG: igt_create_fb_with_bo_size(handle=2, pitch=15360)
(kms_flip:3126) ioctl_wrappers-DEBUG: Test requirement passed: igt_has_fb_modi...
(kms_flip:3126) intel_allocator_simple-DEBUG: Using simple allocator
(kms_flip:3126) intel_allocator_simple-DEBUG: <ial: 0x635ffaaa5c00, fd: 5> obj...
(kms_flip:3126) intel_allocator_simple-DEBUG: <ial: 0x635ffaaa5c00, fd: 5> obj...
(kms_flip:3126) intel_allocator_simple-DEBUG: Using simple allocator
(kms_flip:3126) intel_allocator_simple-DEBUG: <ial: 0x635ffaab3060, fd: 5> obj...
...
igt@kms_flip@2x-plain-flip-fb-recreate
xe-2895-0d2ff6d7ad3b6bf64c5c0e9a921fcfa925029526

Starting subtest: 2x-plain-flip-fb-recreate
Starting dynamic subtest: AB-DP2-HDMI-A3
(kms_flip:2426) CRITICAL: Test assertion failure function __run_test_on_crtc_s...
(kms_flip:2426) CRITICAL: Failed assertion: !retried && needs_retry_after_link...
Dynamic subtest AB-DP2-HDMI-A3 failed.
**** DEBUG ****
(kms_flip:2426) igt_fb-DEBUG: igt_create_fb_with_bo_size(width=3840, height=21...
(kms_flip:2426) igt_fb-DEBUG: igt_create_fb_with_bo_size(handle=1, pitch=15360)
(kms_flip:2426) ioctl_wrappers-DEBUG: Test requirement passed: igt_has_fb_modi...
(kms_flip:2426) igt_fb-DEBUG: igt_create_fb_with_bo_size(width=3840, height=21...
(kms_flip:2426) igt_fb-DEBUG: igt_create_fb_with_bo_size(handle=2, pitch=15360)
(kms_flip:2426) ioctl_wrappers-DEBUG: Test requirement passed: igt_has_fb_modi...
(kms_flip:2426) intel_allocator_simple-DEBUG: Using simple allocator
(kms_flip:2426) intel_allocator_simple-DEBUG: <ial: 0x57f0c8102cf0, fd: 5> obj...
(kms_flip:2426) intel_allocator_simple-DEBUG: <ial: 0x57f0c8102cf0, fd: 5> obj...
(kms_flip:2426) intel_allocator_simple-DEBUG: Using simple allocator
(kms_flip:2426) intel_allocator_simple-DEBUG: <ial: 0x57f0c810fe70, fd: 5> obj...
...
igt@kms_pm_dc@dc6-dpms
igt@kms_pm_dc@dc6-dpms
xe-2899-8f917568adaeea8b649e337e7d0e03bd03332253

Starting subtest: dc6-dpms
(kms_pm_dc:10294) CRITICAL: Test assertion failure function test_pkgc_state_dp...
(kms_pm_dc:10294) CRITICAL: Failed assertion: cur_value > prev_value
(kms_pm_dc:10294) CRITICAL: PKGC10 is not achieved.
Subtest dc6-dpms failed.
**** DEBUG ****
(kms_pm_dc:10294) DEBUG: Test requirement passed: igt_pm_pc8_plus_residencies_...
(kms_pm_dc:10294) DEBUG: Test requirement passed: !(len < 0)
(kms_pm_dc:10294) DEBUG: Test requirement passed: !(!str)
(kms_pm_dc:10294) DEBUG: Test requirement passed: !(len < 0)
(kms_pm_dc:10294) DEBUG: Test requirement passed: !(!str)
(kms_pm_dc:10294) DEBUG: Test requirement passed: !(len < 0)
(kms_pm_dc:10294) DEBUG: Test requirement passed: !(!str)
(kms_pm_dc:10294) DEBUG: Test requirement passed: !(len < 0)
(kms_pm_dc:10294) DEBUG: Test requirement passed: !(!str)
(kms_pm_dc:10294) DEBUG: Test requirement passed: !(len < 0)
(kms_pm_dc:10294) DEBUG: Test requirement passed: !(!str)
...
igt@kms_pm_dc@dc6-dpms
xe-2895-0d2ff6d7ad3b6bf64c5c0e9a921fcfa925029526

Starting subtest: dc6-dpms
(kms_pm_dc:14642) CRITICAL: Test assertion failure function test_pkgc_state_dp...
(kms_pm_dc:14642) CRITICAL: Failed assertion: cur_value > prev_value
(kms_pm_dc:14642) CRITICAL: PKGC10 is not achieved.
Subtest dc6-dpms failed.
**** DEBUG ****
(kms_pm_dc:14642) DEBUG: Test requirement passed: igt_pm_pc8_plus_residencies_...
(kms_pm_dc:14642) DEBUG: Test requirement passed: !(len < 0)
(kms_pm_dc:14642) DEBUG: Test requirement passed: !(!str)
(kms_pm_dc:14642) DEBUG: Test requirement passed: !(len < 0)
(kms_pm_dc:14642) DEBUG: Test requirement passed: !(!str)
(kms_pm_dc:14642) DEBUG: Test requirement passed: !(len < 0)
(kms_pm_dc:14642) DEBUG: Test requirement passed: !(!str)
(kms_pm_dc:14642) DEBUG: Test requirement passed: !(len < 0)
(kms_pm_dc:14642) DEBUG: Test requirement passed: !(!str)
(kms_pm_dc:14642) DEBUG: Test requirement passed: !(len < 0)
(kms_pm_dc:14642) DEBUG: Test requirement passed: !(!str)
...
igt@kms_flip@flip-vs-expired-vblank-interruptible
igt@kms_flip@flip-vs-expired-vblank-interruptible
xe-2899-8f917568adaeea8b649e337e7d0e03bd03332253

Starting subtest: flip-vs-expired-vblank-interruptible
Starting dynamic subtest: A-DP2
Dynamic subtest A-DP2: SUCCESS (4.112s)
Starting dynamic subtest: B-DP2
Dynamic subtest B-DP2: SUCCESS (4.010s)
Starting dynamic subtest: C-DP2
Dynamic subtest C-DP2: SUCCESS (4.002s)
Starting dynamic subtest: D-DP2
Dynamic subtest D-DP2: SUCCESS (4.005s)
Starting dynamic subtest: A-HDMI-A3
Dynamic subtest A-HDMI-A3: SUCCESS (3.987s)
Starting dynamic subtest: B-HDMI-A3
(kms_flip:5639) CRITICAL: Test assertion failure function run_test_step, file ...
(kms_flip:5639) CRITICAL: Failed assertion: end - start < 500
(kms_flip:5639) CRITICAL: Last errno: 4, Interrupted system call
Dynamic subtest B-HDMI-A3 failed.
**** DEBUG ****
...
igt@kms_flip@2x-plain-flip-ts-check-interruptible@ab-dp2-hdmi-a3
igt@kms_flip@2x-plain-flip-ts-check-interruptible@ab-dp2-hdmi-a3
xe-2899-8f917568adaeea8b649e337e7d0e03bd03332253

Starting subtest: 2x-plain-flip-ts-check-interruptible
Starting dynamic subtest: AB-DP2-HDMI-A3
(kms_flip:3403) CRITICAL: Test assertion failure function __run_test_on_crtc_s...
(kms_flip:3403) CRITICAL: Failed assertion: !retried && needs_retry_after_link...
(kms_flip:3403) CRITICAL: Last errno: 4, Interrupted system call
Dynamic subtest AB-DP2-HDMI-A3 failed.
**** DEBUG ****
(kms_flip:3403) igt_fb-DEBUG: igt_create_fb_with_bo_size(width=3840, height=21...
(kms_flip:3403) igt_fb-DEBUG: igt_create_fb_with_bo_size(handle=1, pitch=15360)
(kms_flip:3403) ioctl_wrappers-DEBUG: Test requirement passed: igt_has_fb_modi...
(kms_flip:3403) igt_fb-DEBUG: igt_create_fb_with_bo_size(width=3840, height=21...
(kms_flip:3403) igt_fb-DEBUG: igt_create_fb_with_bo_size(handle=2, pitch=15360)
(kms_flip:3403) ioctl_wrappers-DEBUG: Test requirement passed: igt_has_fb_modi...
(kms_flip:3403) intel_allocator_simple-DEBUG: Using simple allocator
(kms_flip:3403) intel_allocator_simple-DEBUG: <ial: 0x5b5089a18720, fd: 5> obj...
(kms_flip:3403) intel_allocator_simple-DEBUG: <ial: 0x5b5089a18720, fd: 5> obj...
(kms_flip:3403) intel_allocator_simple-DEBUG: Using simple allocator
...
igt@kms_flip@2x-plain-flip-ts-check-interruptible@ac-dp2-hdmi-a3
igt@kms_flip@2x-plain-flip-ts-check-interruptible@ac-dp2-hdmi-a3
xe-2899-8f917568adaeea8b649e337e7d0e03bd03332253

Starting dynamic subtest: AC-DP2-HDMI-A3
(kms_flip:3403) CRITICAL: Test assertion failure function __run_test_on_crtc_s...
(kms_flip:3403) CRITICAL: Failed assertion: !retried && needs_retry_after_link...
(kms_flip:3403) CRITICAL: Last errno: 4, Interrupted system call
Dynamic subtest AC-DP2-HDMI-A3 failed.
**** DEBUG ****
(kms_flip:3403) DEBUG: name = flip
last_ts = 263.373840
last_received_ts = 263.373291
last_seq = 5463
current_ts = 263.390503
current_received_ts = 263.389954
current_seq = 5464
count = 17
seq_step = 1
(kms_flip:3403) DEBUG: flip ts/seq: last 263.373840/5463, current 263.390503/5...
(kms_flip:3403) DEBUG: name = flip
...
igt@kms_flip@2x-plain-flip-ts-check-interruptible@ac-dp2-hdmi-a3
xe-2895-0d2ff6d7ad3b6bf64c5c0e9a921fcfa925029526

Starting dynamic subtest: AC-DP2-HDMI-A3
(kms_flip:2693) CRITICAL: Test assertion failure function __run_test_on_crtc_s...
(kms_flip:2693) CRITICAL: Failed assertion: !retried && needs_retry_after_link...
(kms_flip:2693) CRITICAL: Last errno: 4, Interrupted system call
Dynamic subtest AC-DP2-HDMI-A3 failed.
**** DEBUG ****
(kms_flip:2693) DEBUG: name = flip
last_ts = 172.144821
last_received_ts = 172.144348
last_seq = 4256
current_ts = 172.161499
current_received_ts = 172.160995
current_seq = 4257
count = 159
seq_step = 1
(kms_flip:2693) DEBUG: flip ts/seq: last 172.144821/4256, current 172.161499/4...
(kms_flip:2693) DEBUG: name = flip
...
igt@kms_flip@2x-plain-flip-ts-check-interruptible@ad-dp2-hdmi-a3
igt@kms_flip@2x-plain-flip-ts-check-interruptible@ad-dp2-hdmi-a3
xe-2895-0d2ff6d7ad3b6bf64c5c0e9a921fcfa925029526

Starting dynamic subtest: AD-DP2-HDMI-A3
(kms_flip:2693) CRITICAL: Test assertion failure function __run_test_on_crtc_s...
(kms_flip:2693) CRITICAL: Failed assertion: !retried && needs_retry_after_link...
(kms_flip:2693) CRITICAL: Last errno: 4, Interrupted system call
Dynamic subtest AD-DP2-HDMI-A3 failed.
**** DEBUG ****
(kms_flip:2693) DEBUG: name = flip
last_ts = 178.186447
last_received_ts = 178.186005
last_seq = 4606
current_ts = 178.203110
current_received_ts = 178.202667
current_seq = 4607
count = 18
seq_step = 1
(kms_flip:2693) DEBUG: flip ts/seq: last 178.186447/4606, current 178.203110/4...
(kms_flip:2693) DEBUG: name = flip
...
igt@kms_flip@2x-plain-flip-ts-check-interruptible@bc-dp2-hdmi-a3
igt@kms_flip@2x-plain-flip-ts-check-interruptible@bc-dp2-hdmi-a3
xe-2899-8f917568adaeea8b649e337e7d0e03bd03332253

Starting dynamic subtest: BC-DP2-HDMI-A3
(kms_flip:3403) CRITICAL: Test assertion failure function __run_test_on_crtc_s...
(kms_flip:3403) CRITICAL: Failed assertion: !retried && needs_retry_after_link...
(kms_flip:3403) CRITICAL: Last errno: 4, Interrupted system call
Dynamic subtest BC-DP2-HDMI-A3 failed.
**** DEBUG ****
(kms_flip:3403) igt_fb-DEBUG: igt_create_fb_with_bo_size(width=3840, height=21...
(kms_flip:3403) igt_fb-DEBUG: igt_create_fb_with_bo_size(handle=5, pitch=15360)
(kms_flip:3403) ioctl_wrappers-DEBUG: Test requirement passed: igt_has_fb_modi...
(kms_flip:3403) igt_fb-DEBUG: igt_create_fb_with_bo_size(width=3840, height=21...
(kms_flip:3403) igt_fb-DEBUG: igt_create_fb_with_bo_size(handle=6, pitch=15360)
(kms_flip:3403) ioctl_wrappers-DEBUG: Test requirement passed: igt_has_fb_modi...
(kms_flip:3403) intel_allocator_simple-DEBUG: Using simple allocator
(kms_flip:3403) intel_allocator_simple-DEBUG: <ial: 0x5b5089a68080, fd: 5> obj...
(kms_flip:3403) intel_allocator_simple-DEBUG: <ial: 0x5b5089a68080, fd: 5> obj...
(kms_flip:3403) intel_allocator_simple-DEBUG: Using simple allocator
(kms_flip:3403) intel_allocator_simple-DEBUG: <ial: 0x5b5089a66fa0, fd: 5> obj...
...
igt@kms_flip@2x-plain-flip-ts-check-interruptible@bc-dp2-hdmi-a3
xe-2895-0d2ff6d7ad3b6bf64c5c0e9a921fcfa925029526

Starting dynamic subtest: BC-DP2-HDMI-A3
(kms_flip:2693) CRITICAL: Test assertion failure function __run_test_on_crtc_s...
(kms_flip:2693) CRITICAL: Failed assertion: !retried && needs_retry_after_link...
(kms_flip:2693) CRITICAL: Last errno: 4, Interrupted system call
Dynamic subtest BC-DP2-HDMI-A3 failed.
**** DEBUG ****
(kms_flip:2693) igt_fb-DEBUG: igt_create_fb_with_bo_size(width=3840, height=21...
(kms_flip:2693) igt_fb-DEBUG: igt_create_fb_with_bo_size(handle=5, pitch=15360)
(kms_flip:2693) ioctl_wrappers-DEBUG: Test requirement passed: igt_has_fb_modi...
(kms_flip:2693) igt_fb-DEBUG: igt_create_fb_with_bo_size(width=3840, height=21...
(kms_flip:2693) igt_fb-DEBUG: igt_create_fb_with_bo_size(handle=6, pitch=15360)
(kms_flip:2693) ioctl_wrappers-DEBUG: Test requirement passed: igt_has_fb_modi...
(kms_flip:2693) intel_allocator_simple-DEBUG: Using simple allocator
(kms_flip:2693) intel_allocator_simple-DEBUG: <ial: 0x6502ba026aa0, fd: 5> obj...
(kms_flip:2693) intel_allocator_simple-DEBUG: <ial: 0x6502ba026aa0, fd: 5> obj...
(kms_flip:2693) intel_allocator_simple-DEBUG: Using simple allocator
(kms_flip:2693) intel_allocator_simple-DEBUG: <ial: 0x6502ba026aa0, fd: 5> obj...
...
igt@kms_flip@2x-plain-flip-ts-check-interruptible@bd-dp2-hdmi-a3
igt@kms_flip@2x-plain-flip-ts-check-interruptible@bd-dp2-hdmi-a3
xe-2899-8f917568adaeea8b649e337e7d0e03bd03332253

Starting dynamic subtest: BD-DP2-HDMI-A3
(kms_flip:3403) CRITICAL: Test assertion failure function __run_test_on_crtc_s...
(kms_flip:3403) CRITICAL: Failed assertion: !retried && needs_retry_after_link...
(kms_flip:3403) CRITICAL: Last errno: 4, Interrupted system call
Dynamic subtest BD-DP2-HDMI-A3 failed.
**** DEBUG ****
(kms_flip:3403) igt_fb-DEBUG: igt_create_fb_with_bo_size(width=3840, height=21...
(kms_flip:3403) igt_fb-DEBUG: igt_create_fb_with_bo_size(handle=7, pitch=15360)
(kms_flip:3403) ioctl_wrappers-DEBUG: Test requirement passed: igt_has_fb_modi...
(kms_flip:3403) igt_fb-DEBUG: igt_create_fb_with_bo_size(width=3840, height=21...
(kms_flip:3403) igt_fb-DEBUG: igt_create_fb_with_bo_size(handle=8, pitch=15360)
(kms_flip:3403) ioctl_wrappers-DEBUG: Test requirement passed: igt_has_fb_modi...
(kms_flip:3403) intel_allocator_simple-DEBUG: Using simple allocator
(kms_flip:3403) intel_allocator_simple-DEBUG: <ial: 0x5b5089a29aa0, fd: 5> obj...
(kms_flip:3403) intel_allocator_simple-DEBUG: <ial: 0x5b5089a29aa0, fd: 5> obj...
(kms_flip:3403) intel_allocator_simple-DEBUG: Using simple allocator
(kms_flip:3403) intel_allocator_simple-DEBUG: <ial: 0x5b5089a731d0, fd: 5> obj...
...
igt@kms_flip@2x-plain-flip-ts-check-interruptible@cd-dp2-hdmi-a3
igt@kms_flip@2x-plain-flip-ts-check-interruptible@cd-dp2-hdmi-a3
xe-2899-8f917568adaeea8b649e337e7d0e03bd03332253

Starting dynamic subtest: CD-DP2-HDMI-A3
(kms_flip:3403) CRITICAL: Test assertion failure function __run_test_on_crtc_s...
(kms_flip:3403) CRITICAL: Failed assertion: !retried && needs_retry_after_link...
(kms_flip:3403) CRITICAL: Last errno: 4, Interrupted system call
Dynamic subtest CD-DP2-HDMI-A3 failed.
**** DEBUG ****
(kms_flip:3403) igt_fb-DEBUG: igt_create_fb_with_bo_size(width=3840, height=21...
(kms_flip:3403) igt_fb-DEBUG: igt_create_fb_with_bo_size(handle=9, pitch=15360)
(kms_flip:3403) ioctl_wrappers-DEBUG: Test requirement passed: igt_has_fb_modi...
(kms_flip:3403) igt_fb-DEBUG: igt_create_fb_with_bo_size(width=3840, height=21...
(kms_flip:3403) igt_fb-DEBUG: igt_create_fb_with_bo_size(handle=10, pitch=15360)
(kms_flip:3403) ioctl_wrappers-DEBUG: Test requirement passed: igt_has_fb_modi...
(kms_flip:3403) intel_allocator_simple-DEBUG: Using simple allocator
(kms_flip:3403) intel_allocator_simple-DEBUG: <ial: 0x5b5089a29aa0, fd: 5> obj...
(kms_flip:3403) intel_allocator_simple-DEBUG: <ial: 0x5b5089a29aa0, fd: 5> obj...
(kms_flip:3403) intel_allocator_simple-DEBUG: Using simple allocator
(kms_flip:3403) intel_allocator_simple-DEBUG: <ial: 0x5b5089a68f80, fd: 5> obj...
...
igt@kms_flip@2x-plain-flip-ts-check-interruptible@cd-dp2-hdmi-a3
xe-2895-0d2ff6d7ad3b6bf64c5c0e9a921fcfa925029526

Starting dynamic subtest: CD-DP2-HDMI-A3
(kms_flip:2693) CRITICAL: Test assertion failure function __run_test_on_crtc_s...
(kms_flip:2693) CRITICAL: Failed assertion: !retried && needs_retry_after_link...
(kms_flip:2693) CRITICAL: Last errno: 4, Interrupted system call
Dynamic subtest CD-DP2-HDMI-A3 failed.
**** DEBUG ****
(kms_flip:2693) igt_fb-DEBUG: igt_create_fb_with_bo_size(width=3840, height=21...
(kms_flip:2693) igt_fb-DEBUG: igt_create_fb_with_bo_size(handle=7, pitch=15360)
(kms_flip:2693) ioctl_wrappers-DEBUG: Test requirement passed: igt_has_fb_modi...
(kms_flip:2693) igt_fb-DEBUG: igt_create_fb_with_bo_size(width=3840, height=21...
(kms_flip:2693) igt_fb-DEBUG: igt_create_fb_with_bo_size(handle=8, pitch=15360)
(kms_flip:2693) ioctl_wrappers-DEBUG: Test requirement passed: igt_has_fb_modi...
(kms_flip:2693) intel_allocator_simple-DEBUG: Using simple allocator
(kms_flip:2693) intel_allocator_simple-DEBUG: <ial: 0x6502ba0f75b0, fd: 5> obj...
(kms_flip:2693) intel_allocator_simple-DEBUG: <ial: 0x6502ba0f75b0, fd: 5> obj...
(kms_flip:2693) intel_allocator_simple-DEBUG: Using simple allocator
(kms_flip:2693) intel_allocator_simple-DEBUG: <ial: 0x6502ba0f75b0, fd: 5> obj...
...
igt@kms_flip@flip-vs-expired-vblank-interruptible@b-hdmi-a3
igt@kms_flip@flip-vs-expired-vblank-interruptible@b-hdmi-a3
xe-2899-8f917568adaeea8b649e337e7d0e03bd03332253

Starting dynamic subtest: B-HDMI-A3
(kms_flip:5639) CRITICAL: Test assertion failure function run_test_step, file ...
(kms_flip:5639) CRITICAL: Failed assertion: end - start < 500
(kms_flip:5639) CRITICAL: Last errno: 4, Interrupted system call
Dynamic subtest B-HDMI-A3 failed.
**** DEBUG ****
(kms_flip:5639) igt_fb-DEBUG: igt_create_fb_with_bo_size(width=3840, height=21...
(kms_flip:5639) igt_fb-DEBUG: igt_create_fb_with_bo_size(handle=1, pitch=15360)
(kms_flip:5639) ioctl_wrappers-DEBUG: Test requirement passed: igt_has_fb_modi...
(kms_flip:5639) igt_fb-DEBUG: igt_create_fb_with_bo_size(width=3840, height=21...
(kms_flip:5639) igt_fb-DEBUG: igt_create_fb_with_bo_size(handle=2, pitch=15360)
(kms_flip:5639) ioctl_wrappers-DEBUG: Test requirement passed: igt_has_fb_modi...
(kms_flip:5639) intel_allocator_simple-DEBUG: Using simple allocator
(kms_flip:5639) intel_allocator_simple-DEBUG: <ial: 0x6132abf61620, fd: 5> obj...
(kms_flip:5639) intel_allocator_simple-DEBUG: <ial: 0x6132abf61620, fd: 5> obj...
(kms_flip:5639) intel_allocator_simple-DEBUG: Using simple allocator
(kms_flip:5639) intel_allocator_simple-DEBUG: <ial: 0x6132abee0640, fd: 5> obj...
...
igt@kms_flip@2x-flip-vs-blocking-wf-vblank
igt@kms_flip@2x-flip-vs-blocking-wf-vblank
xe-2899-8f917568adaeea8b649e337e7d0e03bd03332253

Starting subtest: 2x-flip-vs-blocking-wf-vblank
Starting dynamic subtest: AB-DP2-HDMI-A3
Dynamic subtest AB-DP2-HDMI-A3: SUCCESS (5.926s)
Starting dynamic subtest: AC-DP2-HDMI-A3
Dynamic subtest AC-DP2-HDMI-A3: SUCCESS (5.874s)
Starting dynamic subtest: AD-DP2-HDMI-A3
Dynamic subtest AD-DP2-HDMI-A3: SUCCESS (5.890s)
Starting dynamic subtest: BC-DP2-HDMI-A3
Dynamic subtest BC-DP2-HDMI-A3: SUCCESS (5.736s)
Starting dynamic subtest: BD-DP2-HDMI-A3
Dynamic subtest BD-DP2-HDMI-A3: SUCCESS (5.735s)
Starting dynamic subtest: CD-DP2-HDMI-A3
(kms_flip:4656) CRITICAL: Test assertion failure function __run_test_on_crtc_s...
(kms_flip:4656) CRITICAL: Failed assertion: !retried && needs_retry_after_link...
Dynamic subtest CD-DP2-HDMI-A3 failed.
**** DEBUG ****
(kms_flip:4656) igt_fb-DEBUG: igt_create_fb_with_bo_size(width=3840, height=21...
...
igt@kms_hdr@bpc-switch-suspend
igt@kms_hdr@bpc-switch-suspend
xe-2899-8f917568adaeea8b649e337e7d0e03bd03332253

<6> [451.213825] Console: switching to colour dummy device 80x25
<6> [451.214120] [IGT] kms_hdr: executing
<7> [451.227152] xe 0000:03:00.0: [drm:drm_helper_probe_single_connector_modes...
<7> [451.227168] xe 0000:03:00.0: [drm:intel_dp_detect [xe]] [CONNECTOR:241:DP...
<7> [451.231610] xe 0000:03:00.0: [drm:drm_helper_probe_single_connector_modes...
<7> [451.232065] xe 0000:03:00.0: [drm:drm_helper_probe_single_connector_modes...
<7> [451.232081] xe 0000:03:00.0: [drm:intel_hdmi_detect [xe]] [CONNECTOR:254:...
<7> [451.236605] xe 0000:03:00.0: [drm:drm_helper_probe_single_connector_modes...
<7> [451.237216] xe 0000:03:00.0: [drm:drm_helper_probe_single_connector_modes...
<7> [451.237231] xe 0000:03:00.0: [drm:intel_hdmi_detect [xe]] [CONNECTOR:268:...
<7> [451.237543] xe 0000:03:00.0: [drm:do_gmbus_xfer [xe]] GMBUS [i915 gmbus t...
<7> [451.237666] xe 0000:03:00.0: [drm:do_gmbus_xfer [xe]] GMBUS [i915 gmbus t...
<7> [451.237975] xe 0000:03:00.0: [drm:do_gmbus_xfer [xe]] GMBUS [i915 gmbus t...
<7> [451.238080] [drm:drm_do_probe_ddc_edid] drm: skipping non-existent adapte...
<7> [451.238085] xe 0000:03:00.0: [drm:intel_hdmi_set_edid [xe]] HDMI GMBUS ED...
<7> [451.238173] xe 0000:03:00.0: [drm:intel_gmbus_force_bit [xe]] enabling bi...
<7> [451.239325] [drm:drm_do_probe_ddc_edid] drm: skipping non-existent adapte...
...
igt@kms_flip@2x-flip-vs-expired-vblank-interruptible
igt@kms_flip@2x-flip-vs-expired-vblank-interruptible
xe-2899-8f917568adaeea8b649e337e7d0e03bd03332253

Starting subtest: 2x-flip-vs-expired-vblank-interruptible
Starting dynamic subtest: AB-DP2-HDMI-A3
(kms_flip:4969) CRITICAL: Test assertion failure function run_test_step, file ...
(kms_flip:4969) CRITICAL: Failed assertion: end - start < 500
(kms_flip:4969) CRITICAL: Last errno: 4, Interrupted system call
Dynamic subtest AB-DP2-HDMI-A3 failed.
**** DEBUG ****
(kms_flip:4969) igt_fb-DEBUG: igt_create_fb_with_bo_size(width=3840, height=21...
(kms_flip:4969) igt_fb-DEBUG: igt_create_fb_with_bo_size(handle=1, pitch=15360)
(kms_flip:4969) ioctl_wrappers-DEBUG: Test requirement passed: igt_has_fb_modi...
(kms_flip:4969) igt_fb-DEBUG: igt_create_fb_with_bo_size(width=3840, height=21...
(kms_flip:4969) igt_fb-DEBUG: igt_create_fb_with_bo_size(handle=2, pitch=15360)
(kms_flip:4969) ioctl_wrappers-DEBUG: Test requirement passed: igt_has_fb_modi...
(kms_flip:4969) intel_allocator_simple-DEBUG: Using simple allocator
(kms_flip:4969) intel_allocator_simple-DEBUG: <ial: 0x5ae06b220990, fd: 5> obj...
(kms_flip:4969) intel_allocator_simple-DEBUG: <ial: 0x5ae06b220990, fd: 5> obj...
(kms_flip:4969) intel_allocator_simple-DEBUG: Using simple allocator
...
igt@kms_flip@2x-flip-vs-expired-vblank-interruptible
xe-2895-0d2ff6d7ad3b6bf64c5c0e9a921fcfa925029526

Starting subtest: 2x-flip-vs-expired-vblank-interruptible
Starting dynamic subtest: AB-DP2-HDMI-A3
(kms_flip:4936) CRITICAL: Test assertion failure function run_test_step, file ...
(kms_flip:4936) CRITICAL: Failed assertion: end - start < 500
(kms_flip:4936) CRITICAL: Last errno: 4, Interrupted system call
Dynamic subtest AB-DP2-HDMI-A3 failed.
**** DEBUG ****
(kms_flip:4936) igt_fb-DEBUG: igt_create_fb_with_bo_size(width=3840, height=21...
(kms_flip:4936) igt_fb-DEBUG: igt_create_fb_with_bo_size(handle=1, pitch=15360)
(kms_flip:4936) ioctl_wrappers-DEBUG: Test requirement passed: igt_has_fb_modi...
(kms_flip:4936) igt_fb-DEBUG: igt_create_fb_with_bo_size(width=3840, height=21...
(kms_flip:4936) igt_fb-DEBUG: igt_create_fb_with_bo_size(handle=2, pitch=15360)
(kms_flip:4936) ioctl_wrappers-DEBUG: Test requirement passed: igt_has_fb_modi...
(kms_flip:4936) intel_allocator_simple-DEBUG: Using simple allocator
(kms_flip:4936) intel_allocator_simple-DEBUG: <ial: 0x63aa9c6ea6e0, fd: 5> obj...
(kms_flip:4936) intel_allocator_simple-DEBUG: <ial: 0x63aa9c6ea6e0, fd: 5> obj...
(kms_flip:4936) intel_allocator_simple-DEBUG: Using simple allocator
...
igt@kms_flip@2x-flip-vs-expired-vblank
igt@kms_flip@2x-flip-vs-expired-vblank
xe-2899-8f917568adaeea8b649e337e7d0e03bd03332253

Starting subtest: 2x-flip-vs-expired-vblank
Starting dynamic subtest: AB-DP2-HDMI-A3
(kms_flip:4903) CRITICAL: Test assertion failure function run_test_step, file ...
(kms_flip:4903) CRITICAL: Failed assertion: end - start < 500
Dynamic subtest AB-DP2-HDMI-A3 failed.
**** DEBUG ****
(kms_flip:4903) igt_fb-DEBUG: igt_create_fb_with_bo_size(width=3840, height=21...
(kms_flip:4903) igt_fb-DEBUG: igt_create_fb_with_bo_size(handle=1, pitch=15360)
(kms_flip:4903) ioctl_wrappers-DEBUG: Test requirement passed: igt_has_fb_modi...
(kms_flip:4903) igt_fb-DEBUG: igt_create_fb_with_bo_size(width=3840, height=21...
(kms_flip:4903) igt_fb-DEBUG: igt_create_fb_with_bo_size(handle=2, pitch=15360)
(kms_flip:4903) ioctl_wrappers-DEBUG: Test requirement passed: igt_has_fb_modi...
(kms_flip:4903) intel_allocator_simple-DEBUG: Using simple allocator
(kms_flip:4903) intel_allocator_simple-DEBUG: <ial: 0x57aaa39e17f0, fd: 5> obj...
(kms_flip:4903) intel_allocator_simple-DEBUG: <ial: 0x57aaa39e17f0, fd: 5> obj...
(kms_flip:4903) intel_allocator_simple-DEBUG: Using simple allocator
(kms_flip:4903) intel_allocator_simple-DEBUG: <ial: 0x57aaa39eec10, fd: 5> obj...
...
igt@kms_flip@2x-flip-vs-expired-vblank
xe-2895-0d2ff6d7ad3b6bf64c5c0e9a921fcfa925029526

Starting subtest: 2x-flip-vs-expired-vblank
Starting dynamic subtest: AB-DP2-HDMI-A3
(kms_flip:4870) CRITICAL: Test assertion failure function run_test_step, file ...
(kms_flip:4870) CRITICAL: Failed assertion: end - start < 500
Dynamic subtest AB-DP2-HDMI-A3 failed.
**** DEBUG ****
(kms_flip:4870) igt_fb-DEBUG: igt_create_fb_with_bo_size(width=3840, height=21...
(kms_flip:4870) igt_fb-DEBUG: igt_create_fb_with_bo_size(handle=1, pitch=15360)
(kms_flip:4870) ioctl_wrappers-DEBUG: Test requirement passed: igt_has_fb_modi...
(kms_flip:4870) igt_fb-DEBUG: igt_create_fb_with_bo_size(width=3840, height=21...
(kms_flip:4870) igt_fb-DEBUG: igt_create_fb_with_bo_size(handle=2, pitch=15360)
(kms_flip:4870) ioctl_wrappers-DEBUG: Test requirement passed: igt_has_fb_modi...
(kms_flip:4870) intel_allocator_simple-DEBUG: Using simple allocator
(kms_flip:4870) intel_allocator_simple-DEBUG: <ial: 0x5c750e004c10, fd: 5> obj...
(kms_flip:4870) intel_allocator_simple-DEBUG: <ial: 0x5c750e004c10, fd: 5> obj...
(kms_flip:4870) intel_allocator_simple-DEBUG: Using simple allocator
(kms_flip:4870) intel_allocator_simple-DEBUG: <ial: 0x5c750e0494c0, fd: 5> obj...
...
igt@kms_flip@2x-flip-vs-expired-vblank@ab-dp2-hdmi-a3
igt@kms_flip@2x-flip-vs-expired-vblank@ab-dp2-hdmi-a3
xe-2899-8f917568adaeea8b649e337e7d0e03bd03332253

Starting subtest: 2x-flip-vs-expired-vblank
Starting dynamic subtest: AB-DP2-HDMI-A3
(kms_flip:4903) CRITICAL: Test assertion failure function run_test_step, file ...
(kms_flip:4903) CRITICAL: Failed assertion: end - start < 500
Dynamic subtest AB-DP2-HDMI-A3 failed.
**** DEBUG ****
(kms_flip:4903) igt_fb-DEBUG: igt_create_fb_with_bo_size(width=3840, height=21...
(kms_flip:4903) igt_fb-DEBUG: igt_create_fb_with_bo_size(handle=1, pitch=15360)
(kms_flip:4903) ioctl_wrappers-DEBUG: Test requirement passed: igt_has_fb_modi...
(kms_flip:4903) igt_fb-DEBUG: igt_create_fb_with_bo_size(width=3840, height=21...
(kms_flip:4903) igt_fb-DEBUG: igt_create_fb_with_bo_size(handle=2, pitch=15360)
(kms_flip:4903) ioctl_wrappers-DEBUG: Test requirement passed: igt_has_fb_modi...
(kms_flip:4903) intel_allocator_simple-DEBUG: Using simple allocator
(kms_flip:4903) intel_allocator_simple-DEBUG: <ial: 0x57aaa39e17f0, fd: 5> obj...
(kms_flip:4903) intel_allocator_simple-DEBUG: <ial: 0x57aaa39e17f0, fd: 5> obj...
(kms_flip:4903) intel_allocator_simple-DEBUG: Using simple allocator
(kms_flip:4903) intel_allocator_simple-DEBUG: <ial: 0x57aaa39eec10, fd: 5> obj...
...
igt@kms_flip@2x-flip-vs-expired-vblank@ab-dp2-hdmi-a3
xe-2895-0d2ff6d7ad3b6bf64c5c0e9a921fcfa925029526

Starting subtest: 2x-flip-vs-expired-vblank
Starting dynamic subtest: AB-DP2-HDMI-A3
(kms_flip:4870) CRITICAL: Test assertion failure function run_test_step, file ...
(kms_flip:4870) CRITICAL: Failed assertion: end - start < 500
Dynamic subtest AB-DP2-HDMI-A3 failed.
**** DEBUG ****
(kms_flip:4870) igt_fb-DEBUG: igt_create_fb_with_bo_size(width=3840, height=21...
(kms_flip:4870) igt_fb-DEBUG: igt_create_fb_with_bo_size(handle=1, pitch=15360)
(kms_flip:4870) ioctl_wrappers-DEBUG: Test requirement passed: igt_has_fb_modi...
(kms_flip:4870) igt_fb-DEBUG: igt_create_fb_with_bo_size(width=3840, height=21...
(kms_flip:4870) igt_fb-DEBUG: igt_create_fb_with_bo_size(handle=2, pitch=15360)
(kms_flip:4870) ioctl_wrappers-DEBUG: Test requirement passed: igt_has_fb_modi...
(kms_flip:4870) intel_allocator_simple-DEBUG: Using simple allocator
(kms_flip:4870) intel_allocator_simple-DEBUG: <ial: 0x5c750e004c10, fd: 5> obj...
(kms_flip:4870) intel_allocator_simple-DEBUG: <ial: 0x5c750e004c10, fd: 5> obj...
(kms_flip:4870) intel_allocator_simple-DEBUG: Using simple allocator
(kms_flip:4870) intel_allocator_simple-DEBUG: <ial: 0x5c750e0494c0, fd: 5> obj...
...
igt@kms_flip@2x-flip-vs-expired-vblank@ac-dp2-hdmi-a3
igt@kms_flip@2x-flip-vs-expired-vblank@ac-dp2-hdmi-a3
xe-2899-8f917568adaeea8b649e337e7d0e03bd03332253

Starting dynamic subtest: AC-DP2-HDMI-A3
(kms_flip:4903) CRITICAL: Test assertion failure function run_test_step, file ...
(kms_flip:4903) CRITICAL: Failed assertion: end - start < 500
Dynamic subtest AC-DP2-HDMI-A3 failed.
**** DEBUG ****
(kms_flip:4903) igt_fb-DEBUG: igt_create_fb_with_bo_size(width=3840, height=21...
(kms_flip:4903) igt_fb-DEBUG: igt_create_fb_with_bo_size(handle=3, pitch=15360)
(kms_flip:4903) ioctl_wrappers-DEBUG: Test requirement passed: igt_has_fb_modi...
(kms_flip:4903) igt_fb-DEBUG: igt_create_fb_with_bo_size(width=3840, height=21...
(kms_flip:4903) igt_fb-DEBUG: igt_create_fb_with_bo_size(handle=4, pitch=15360)
(kms_flip:4903) ioctl_wrappers-DEBUG: Test requirement passed: igt_has_fb_modi...
(kms_flip:4903) intel_allocator_simple-DEBUG: Using simple allocator
(kms_flip:4903) intel_allocator_simple-DEBUG: <ial: 0x57aaa3a47cb0, fd: 5> obj...
(kms_flip:4903) intel_allocator_simple-DEBUG: <ial: 0x57aaa3a47cb0, fd: 5> obj...
(kms_flip:4903) intel_allocator_simple-DEBUG: Using simple allocator
(kms_flip:4903) intel_allocator_simple-DEBUG: <ial: 0x57aaa3a32920, fd: 5> obj...
(kms_flip:4903) intel_allocator_simple-DEBUG: <ial: 0x57aaa3a32920, fd: 5> obj...
...
igt@kms_flip@2x-flip-vs-expired-vblank@ac-dp2-hdmi-a3
xe-2895-0d2ff6d7ad3b6bf64c5c0e9a921fcfa925029526

Starting dynamic subtest: AC-DP2-HDMI-A3
(kms_flip:4870) CRITICAL: Test assertion failure function run_test_step, file ...
(kms_flip:4870) CRITICAL: Failed assertion: end - start < 500
Dynamic subtest AC-DP2-HDMI-A3 failed.
**** DEBUG ****
(kms_flip:4870) igt_fb-DEBUG: igt_create_fb_with_bo_size(width=3840, height=21...
(kms_flip:4870) igt_fb-DEBUG: igt_create_fb_with_bo_size(handle=3, pitch=15360)
(kms_flip:4870) ioctl_wrappers-DEBUG: Test requirement passed: igt_has_fb_modi...
(kms_flip:4870) igt_fb-DEBUG: igt_create_fb_with_bo_size(width=3840, height=21...
(kms_flip:4870) igt_fb-DEBUG: igt_create_fb_with_bo_size(handle=4, pitch=15360)
(kms_flip:4870) ioctl_wrappers-DEBUG: Test requirement passed: igt_has_fb_modi...
(kms_flip:4870) intel_allocator_simple-DEBUG: Using simple allocator
(kms_flip:4870) intel_allocator_simple-DEBUG: <ial: 0x5c750e070460, fd: 5> obj...
(kms_flip:4870) intel_allocator_simple-DEBUG: <ial: 0x5c750e070460, fd: 5> obj...
(kms_flip:4870) intel_allocator_simple-DEBUG: Using simple allocator
(kms_flip:4870) intel_allocator_simple-DEBUG: <ial: 0x5c750e06fa50, fd: 5> obj...
(kms_flip:4870) intel_allocator_simple-DEBUG: <ial: 0x5c750e06fa50, fd: 5> obj...
...
igt@kms_flip@2x-flip-vs-expired-vblank@bc-dp2-hdmi-a3
igt@kms_flip@2x-flip-vs-expired-vblank@bc-dp2-hdmi-a3
xe-2895-0d2ff6d7ad3b6bf64c5c0e9a921fcfa925029526

Starting dynamic subtest: BC-DP2-HDMI-A3
(kms_flip:4870) CRITICAL: Test assertion failure function run_test_step, file ...
(kms_flip:4870) CRITICAL: Failed assertion: end - start < 500
Dynamic subtest BC-DP2-HDMI-A3 failed.
**** DEBUG ****
(kms_flip:4870) igt_fb-DEBUG: igt_create_fb_with_bo_size(width=3840, height=21...
(kms_flip:4870) igt_fb-DEBUG: igt_create_fb_with_bo_size(handle=5, pitch=15360)
(kms_flip:4870) ioctl_wrappers-DEBUG: Test requirement passed: igt_has_fb_modi...
(kms_flip:4870) igt_fb-DEBUG: igt_create_fb_with_bo_size(width=3840, height=21...
(kms_flip:4870) igt_fb-DEBUG: igt_create_fb_with_bo_size(handle=6, pitch=15360)
(kms_flip:4870) ioctl_wrappers-DEBUG: Test requirement passed: igt_has_fb_modi...
(kms_flip:4870) intel_allocator_simple-DEBUG: Using simple allocator
(kms_flip:4870) intel_allocator_simple-DEBUG: <ial: 0x5c750e0706c0, fd: 5> obj...
(kms_flip:4870) intel_allocator_simple-DEBUG: <ial: 0x5c750e0706c0, fd: 5> obj...
(kms_flip:4870) intel_allocator_simple-DEBUG: Using simple allocator
(kms_flip:4870) intel_allocator_simple-DEBUG: <ial: 0x5c750e0706c0, fd: 5> obj...
(kms_flip:4870) intel_allocator_simple-DEBUG: <ial: 0x5c750e0706c0, fd: 5> obj...
...
igt@kms_universal_plane@cursor-fb-leak
igt@kms_universal_plane@cursor-fb-leak
xe-2899-8f917568adaeea8b649e337e7d0e03bd03332253

Starting subtest: cursor-fb-leak
Starting dynamic subtest: pipe-A-DP-2
Dynamic subtest pipe-A-DP-2: SUCCESS (0.649s)
Starting dynamic subtest: pipe-B-HDMI-A-3
Dynamic subtest pipe-B-HDMI-A-3: SUCCESS (0.529s)
Starting dynamic subtest: pipe-C-DP-2
(kms_universal_plane:21335) CRITICAL: Test assertion failure function cursor_l...
(kms_universal_plane:21335) CRITICAL: Failed assertion: count1 == count2
(kms_universal_plane:21335) CRITICAL: Last errno: 9, Bad file descriptor
(kms_universal_plane:21335) CRITICAL: error: 1 != 17
Dynamic subtest pipe-C-DP-2 failed.
**** DEBUG ****
}
(kms_universal_plane:21335) igt_kms-DEBUG: display: C.5: plane_set_fb(297)
(kms_universal_plane:21335) igt_kms-DEBUG: display: C.5: plane_set_size (64x64)
(kms_universal_plane:21335) igt_kms-DEBUG: display: C.5: fb_set_position(0,0)
(kms_universal_plane:21335) igt_kms-DEBUG: display: C.5: fb_set_size(64x64)
...
igt@kms_universal_plane@cursor-fb-leak
xe-2895-0d2ff6d7ad3b6bf64c5c0e9a921fcfa925029526

Starting subtest: cursor-fb-leak
Starting dynamic subtest: pipe-A-DP-2
Dynamic subtest pipe-A-DP-2: SUCCESS (0.633s)
Starting dynamic subtest: pipe-B-HDMI-A-3
Dynamic subtest pipe-B-HDMI-A-3: SUCCESS (0.556s)
Starting dynamic subtest: pipe-C-DP-2
(kms_universal_plane:12244) CRITICAL: Test assertion failure function cursor_l...
(kms_universal_plane:12244) CRITICAL: Failed assertion: count1 == count2
(kms_universal_plane:12244) CRITICAL: Last errno: 9, Bad file descriptor
(kms_universal_plane:12244) CRITICAL: error: 1 != 3
Dynamic subtest pipe-C-DP-2 failed.
**** DEBUG ****
}
(kms_universal_plane:12244) igt_kms-DEBUG: display: C.5: plane_set_fb(297)
(kms_universal_plane:12244) igt_kms-DEBUG: display: C.5: plane_set_size (64x64)
(kms_universal_plane:12244) igt_kms-DEBUG: display: C.5: fb_set_position(0,0)
(kms_universal_plane:12244) igt_kms-DEBUG: display: C.5: fb_set_size(64x64)
...
igt@kms_flip@2x-plain-flip-fb-recreate-interruptible
igt@kms_flip@2x-plain-flip-fb-recreate-interruptible
xe-2899-8f917568adaeea8b649e337e7d0e03bd03332253

Starting subtest: 2x-plain-flip-fb-recreate-interruptible
Starting dynamic subtest: AB-DP2-HDMI-A3
(kms_flip:3196) CRITICAL: Test assertion failure function __run_test_on_crtc_s...
(kms_flip:3196) CRITICAL: Failed assertion: !retried && needs_retry_after_link...
(kms_flip:3196) CRITICAL: Last errno: 4, Interrupted system call
Dynamic subtest AB-DP2-HDMI-A3 failed.
**** DEBUG ****
(kms_flip:3196) igt_fb-DEBUG: igt_create_fb_with_bo_size(width=3840, height=21...
(kms_flip:3196) igt_fb-DEBUG: igt_create_fb_with_bo_size(handle=1, pitch=15360)
(kms_flip:3196) ioctl_wrappers-DEBUG: Test requirement passed: igt_has_fb_modi...
(kms_flip:3196) igt_fb-DEBUG: igt_create_fb_with_bo_size(width=3840, height=21...
(kms_flip:3196) igt_fb-DEBUG: igt_create_fb_with_bo_size(handle=2, pitch=15360)
(kms_flip:3196) ioctl_wrappers-DEBUG: Test requirement passed: igt_has_fb_modi...
(kms_flip:3196) intel_allocator_simple-DEBUG: Using simple allocator
(kms_flip:3196) intel_allocator_simple-DEBUG: <ial: 0x641897975eb0, fd: 5> obj...
(kms_flip:3196) intel_allocator_simple-DEBUG: <ial: 0x641897975eb0, fd: 5> obj...
(kms_flip:3196) intel_allocator_simple-DEBUG: Using simple allocator
...
igt@kms_flip@2x-plain-flip-fb-recreate-interruptible
xe-2895-0d2ff6d7ad3b6bf64c5c0e9a921fcfa925029526

Starting subtest: 2x-plain-flip-fb-recreate-interruptible
Starting dynamic subtest: AB-DP2-HDMI-A3
(kms_flip:2497) CRITICAL: Test assertion failure function __run_test_on_crtc_s...
(kms_flip:2497) CRITICAL: Failed assertion: !retried && needs_retry_after_link...
(kms_flip:2497) CRITICAL: Last errno: 4, Interrupted system call
Dynamic subtest AB-DP2-HDMI-A3 failed.
**** DEBUG ****
(kms_flip:2497) igt_fb-DEBUG: igt_create_fb_with_bo_size(width=3840, height=21...
(kms_flip:2497) igt_fb-DEBUG: igt_create_fb_with_bo_size(handle=1, pitch=15360)
(kms_flip:2497) ioctl_wrappers-DEBUG: Test requirement passed: igt_has_fb_modi...
(kms_flip:2497) igt_fb-DEBUG: igt_create_fb_with_bo_size(width=3840, height=21...
(kms_flip:2497) igt_fb-DEBUG: igt_create_fb_with_bo_size(handle=2, pitch=15360)
(kms_flip:2497) ioctl_wrappers-DEBUG: Test requirement passed: igt_has_fb_modi...
(kms_flip:2497) intel_allocator_simple-DEBUG: Using simple allocator
(kms_flip:2497) intel_allocator_simple-DEBUG: <ial: 0x6454e483bb60, fd: 5> obj...
(kms_flip:2497) intel_allocator_simple-DEBUG: <ial: 0x6454e483bb60, fd: 5> obj...
(kms_flip:2497) intel_allocator_simple-DEBUG: Using simple allocator
...
igt@kms_flip@2x-flip-vs-expired-vblank-interruptible@ab-dp2-hdmi-a3
igt@kms_flip@2x-flip-vs-expired-vblank-interruptible@ab-dp2-hdmi-a3
xe-2899-8f917568adaeea8b649e337e7d0e03bd03332253

Starting subtest: 2x-flip-vs-expired-vblank-interruptible
Starting dynamic subtest: AB-DP2-HDMI-A3
(kms_flip:4969) CRITICAL: Test assertion failure function run_test_step, file ...
(kms_flip:4969) CRITICAL: Failed assertion: end - start < 500
(kms_flip:4969) CRITICAL: Last errno: 4, Interrupted system call
Dynamic subtest AB-DP2-HDMI-A3 failed.
**** DEBUG ****
(kms_flip:4969) igt_fb-DEBUG: igt_create_fb_with_bo_size(width=3840, height=21...
(kms_flip:4969) igt_fb-DEBUG: igt_create_fb_with_bo_size(handle=1, pitch=15360)
(kms_flip:4969) ioctl_wrappers-DEBUG: Test requirement passed: igt_has_fb_modi...
(kms_flip:4969) igt_fb-DEBUG: igt_create_fb_with_bo_size(width=3840, height=21...
(kms_flip:4969) igt_fb-DEBUG: igt_create_fb_with_bo_size(handle=2, pitch=15360)
(kms_flip:4969) ioctl_wrappers-DEBUG: Test requirement passed: igt_has_fb_modi...
(kms_flip:4969) intel_allocator_simple-DEBUG: Using simple allocator
(kms_flip:4969) intel_allocator_simple-DEBUG: <ial: 0x5ae06b220990, fd: 5> obj...
(kms_flip:4969) intel_allocator_simple-DEBUG: <ial: 0x5ae06b220990, fd: 5> obj...
(kms_flip:4969) intel_allocator_simple-DEBUG: Using simple allocator
...
igt@kms_flip@2x-flip-vs-expired-vblank-interruptible@ab-dp2-hdmi-a3
xe-2895-0d2ff6d7ad3b6bf64c5c0e9a921fcfa925029526

Starting subtest: 2x-flip-vs-expired-vblank-interruptible
Starting dynamic subtest: AB-DP2-HDMI-A3
(kms_flip:4936) CRITICAL: Test assertion failure function run_test_step, file ...
(kms_flip:4936) CRITICAL: Failed assertion: end - start < 500
(kms_flip:4936) CRITICAL: Last errno: 4, Interrupted system call
Dynamic subtest AB-DP2-HDMI-A3 failed.
**** DEBUG ****
(kms_flip:4936) igt_fb-DEBUG: igt_create_fb_with_bo_size(width=3840, height=21...
(kms_flip:4936) igt_fb-DEBUG: igt_create_fb_with_bo_size(handle=1, pitch=15360)
(kms_flip:4936) ioctl_wrappers-DEBUG: Test requirement passed: igt_has_fb_modi...
(kms_flip:4936) igt_fb-DEBUG: igt_create_fb_with_bo_size(width=3840, height=21...
(kms_flip:4936) igt_fb-DEBUG: igt_create_fb_with_bo_size(handle=2, pitch=15360)
(kms_flip:4936) ioctl_wrappers-DEBUG: Test requirement passed: igt_has_fb_modi...
(kms_flip:4936) intel_allocator_simple-DEBUG: Using simple allocator
(kms_flip:4936) intel_allocator_simple-DEBUG: <ial: 0x63aa9c6ea6e0, fd: 5> obj...
(kms_flip:4936) intel_allocator_simple-DEBUG: <ial: 0x63aa9c6ea6e0, fd: 5> obj...
(kms_flip:4936) intel_allocator_simple-DEBUG: Using simple allocator
...
igt@kms_flip@2x-flip-vs-expired-vblank-interruptible@ac-dp2-hdmi-a3
igt@kms_flip@2x-flip-vs-expired-vblank-interruptible@ac-dp2-hdmi-a3
xe-2899-8f917568adaeea8b649e337e7d0e03bd03332253

Starting dynamic subtest: AC-DP2-HDMI-A3
(kms_flip:4969) CRITICAL: Test assertion failure function run_test_step, file ...
(kms_flip:4969) CRITICAL: Failed assertion: end - start < 500
(kms_flip:4969) CRITICAL: Last errno: 4, Interrupted system call
Dynamic subtest AC-DP2-HDMI-A3 failed.
**** DEBUG ****
(kms_flip:4969) igt_fb-DEBUG: igt_create_fb_with_bo_size(width=3840, height=21...
(kms_flip:4969) igt_fb-DEBUG: igt_create_fb_with_bo_size(handle=3, pitch=15360)
(kms_flip:4969) ioctl_wrappers-DEBUG: Test requirement passed: igt_has_fb_modi...
(kms_flip:4969) igt_fb-DEBUG: igt_create_fb_with_bo_size(width=3840, height=21...
(kms_flip:4969) igt_fb-DEBUG: igt_create_fb_with_bo_size(handle=4, pitch=15360)
(kms_flip:4969) ioctl_wrappers-DEBUG: Test requirement passed: igt_has_fb_modi...
(kms_flip:4969) intel_allocator_simple-DEBUG: Using simple allocator
(kms_flip:4969) intel_allocator_simple-DEBUG: <ial: 0x5ae06b271580, fd: 5> obj...
(kms_flip:4969) intel_allocator_simple-DEBUG: <ial: 0x5ae06b271580, fd: 5> obj...
(kms_flip:4969) intel_allocator_simple-DEBUG: Using simple allocator
(kms_flip:4969) intel_allocator_simple-DEBUG: <ial: 0x5ae06b271580, fd: 5> obj...
...
igt@kms_flip@2x-flip-vs-expired-vblank-interruptible@bc-dp2-hdmi-a3
igt@kms_flip@2x-flip-vs-expired-vblank-interruptible@bc-dp2-hdmi-a3
xe-2895-0d2ff6d7ad3b6bf64c5c0e9a921fcfa925029526

Starting dynamic subtest: BC-DP2-HDMI-A3
(kms_flip:4936) CRITICAL: Test assertion failure function run_test_step, file ...
(kms_flip:4936) CRITICAL: Failed assertion: end - start < 500
(kms_flip:4936) CRITICAL: Last errno: 4, Interrupted system call
Dynamic subtest BC-DP2-HDMI-A3 failed.
**** DEBUG ****
(kms_flip:4936) igt_fb-DEBUG: igt_create_fb_with_bo_size(width=3840, height=21...
(kms_flip:4936) igt_fb-DEBUG: igt_create_fb_with_bo_size(handle=3, pitch=15360)
(kms_flip:4936) ioctl_wrappers-DEBUG: Test requirement passed: igt_has_fb_modi...
(kms_flip:4936) igt_fb-DEBUG: igt_create_fb_with_bo_size(width=3840, height=21...
(kms_flip:4936) igt_fb-DEBUG: igt_create_fb_with_bo_size(handle=4, pitch=15360)
(kms_flip:4936) ioctl_wrappers-DEBUG: Test requirement passed: igt_has_fb_modi...
(kms_flip:4936) intel_allocator_simple-DEBUG: Using simple allocator
(kms_flip:4936) intel_allocator_simple-DEBUG: <ial: 0x63aa9c6f3c20, fd: 5> obj...
(kms_flip:4936) intel_allocator_simple-DEBUG: <ial: 0x63aa9c6f3c20, fd: 5> obj...
(kms_flip:4936) intel_allocator_simple-DEBUG: Using simple allocator
(kms_flip:4936) intel_allocator_simple-DEBUG: <ial: 0x63aa9c6f3c20, fd: 5> obj...
...
igt@kms_flip@2x-flip-vs-blocking-wf-vblank@cd-dp2-hdmi-a3
igt@kms_flip@2x-flip-vs-blocking-wf-vblank@cd-dp2-hdmi-a3
xe-2899-8f917568adaeea8b649e337e7d0e03bd03332253

Starting dynamic subtest: CD-DP2-HDMI-A3
(kms_flip:4656) CRITICAL: Test assertion failure function __run_test_on_crtc_s...
(kms_flip:4656) CRITICAL: Failed assertion: !retried && needs_retry_after_link...
Dynamic subtest CD-DP2-HDMI-A3 failed.
**** DEBUG ****
(kms_flip:4656) igt_fb-DEBUG: igt_create_fb_with_bo_size(width=3840, height=21...
(kms_flip:4656) igt_fb-DEBUG: igt_create_fb_with_bo_size(handle=1, pitch=15360)
(kms_flip:4656) ioctl_wrappers-DEBUG: Test requirement passed: igt_has_fb_modi...
(kms_flip:4656) igt_fb-DEBUG: igt_create_fb_with_bo_size(width=3840, height=21...
(kms_flip:4656) igt_fb-DEBUG: igt_create_fb_with_bo_size(handle=2, pitch=15360)
(kms_flip:4656) ioctl_wrappers-DEBUG: Test requirement passed: igt_has_fb_modi...
(kms_flip:4656) intel_allocator_simple-DEBUG: Using simple allocator
(kms_flip:4656) intel_allocator_simple-DEBUG: <ial: 0x600d5eb89d70, fd: 5> obj...
(kms_flip:4656) intel_allocator_simple-DEBUG: <ial: 0x600d5eb89d70, fd: 5> obj...
(kms_flip:4656) intel_allocator_simple-DEBUG: Using simple allocator
(kms_flip:4656) intel_allocator_simple-DEBUG: <ial: 0x600d5eb89d70, fd: 5> obj...
(kms_flip:4656) intel_allocator_simple-DEBUG: <ial: 0x600d5eb89d70, fd: 5> obj...
...
igt@kms_hdr@bpc-switch-suspend@pipe-a-hdmi-a-3
igt@kms_hdr@bpc-switch-suspend@pipe-a-hdmi-a-3
xe-2899-8f917568adaeea8b649e337e7d0e03bd03332253

<6> [458.810080] [IGT] kms_hdr: starting dynamic subtest pipe-A-HDMI-A-3
<7> [458.810232] xe 0000:03:00.0: [drm:drm_mode_addfb2] [FB:294]
<7> [459.303231] xe 0000:03:00.0: [drm:skl_update_scaler [xe]] [CRTC:82:pipe A...
<7> [459.303352] xe 0000:03:00.0: [drm:skl_compute_wm [xe]] [PLANE:32:plane 1A...
<7> [459.303425] xe 0000:03:00.0: [drm:skl_compute_wm [xe]] [PLANE:32:plane 1A...
<7> [459.303493] xe 0000:03:00.0: [drm:skl_compute_wm [xe]] [PLANE:32:plane 1A...
<7> [459.303562] xe 0000:03:00.0: [drm:skl_compute_wm [xe]] [PLANE:32:plane 1A...
<7> [459.303631] xe 0000:03:00.0: [drm:skl_compute_wm [xe]] [PLANE:32:plane 1A...
<7> [459.303699] xe 0000:03:00.0: [drm:intel_bw_atomic_check [xe]] [CRTC:82:pi...
<7> [459.303814] xe 0000:03:00.0: [drm:skl_update_scaler [xe]] [CRTC:82:pipe A...
<7> [459.303897] xe 0000:03:00.0: [drm:skl_compute_wm [xe]] [PLANE:32:plane 1A...
<7> [459.303968] xe 0000:03:00.0: [drm:skl_compute_wm [xe]] [PLANE:32:plane 1A...
<7> [459.304048] xe 0000:03:00.0: [drm:skl_compute_wm [xe]] [PLANE:32:plane 1A...
<7> [459.304122] xe 0000:03:00.0: [drm:skl_compute_wm [xe]] [PLANE:32:plane 1A...
<7> [459.304194] xe 0000:03:00.0: [drm:skl_compute_wm [xe]] [PLANE:32:plane 1A...
<7> [459.304268] xe 0000:03:00.0: [drm:intel_bw_atomic_check [xe]] [CRTC:82:pi...
<7> [459.304352] xe 0000:03:00.0: [drm:intel_bw_atomic_check [xe]] QGV point 0...
...
igt@kms_flip@2x-flip-vs-absolute-wf_vblank
igt@kms_flip@2x-flip-vs-absolute-wf_vblank
xe-2899-8f917568adaeea8b649e337e7d0e03bd03332253

Starting subtest: 2x-flip-vs-absolute-wf_vblank
Starting dynamic subtest: AB-DP2-HDMI-A3
(kms_flip:4503) CRITICAL: Test assertion failure function __run_test_on_crtc_s...
(kms_flip:4503) CRITICAL: Failed assertion: !retried && needs_retry_after_link...
Dynamic subtest AB-DP2-HDMI-A3 failed.
**** DEBUG ****
(kms_flip:4503) igt_fb-DEBUG: igt_create_fb_with_bo_size(width=3840, height=21...
(kms_flip:4503) igt_fb-DEBUG: igt_create_fb_with_bo_size(handle=1, pitch=15360)
(kms_flip:4503) ioctl_wrappers-DEBUG: Test requirement passed: igt_has_fb_modi...
(kms_flip:4503) igt_fb-DEBUG: igt_create_fb_with_bo_size(width=3840, height=21...
(kms_flip:4503) igt_fb-DEBUG: igt_create_fb_with_bo_size(handle=2, pitch=15360)
(kms_flip:4503) ioctl_wrappers-DEBUG: Test requirement passed: igt_has_fb_modi...
(kms_flip:4503) intel_allocator_simple-DEBUG: Using simple allocator
(kms_flip:4503) intel_allocator_simple-DEBUG: <ial: 0x64f7c09652d0, fd: 5> obj...
(kms_flip:4503) intel_allocator_simple-DEBUG: <ial: 0x64f7c09652d0, fd: 5> obj...
(kms_flip:4503) intel_allocator_simple-DEBUG: Using simple allocator
(kms_flip:4503) intel_allocator_simple-DEBUG: <ial: 0x64f7c09ac230, fd: 5> obj...
...
igt@kms_flip@2x-plain-flip-ts-check@ad-dp2-hdmi-a3
igt@kms_flip@2x-plain-flip-ts-check@ad-dp2-hdmi-a3
xe-2899-8f917568adaeea8b649e337e7d0e03bd03332253

Starting dynamic subtest: AD-DP2-HDMI-A3
(kms_flip:3333) CRITICAL: Test assertion failure function __run_test_on_crtc_s...
(kms_flip:3333) CRITICAL: Failed assertion: !retried && needs_retry_after_link...
Dynamic subtest AD-DP2-HDMI-A3 failed.
**** DEBUG ****
(kms_flip:3333) igt_fb-DEBUG: igt_create_fb_with_bo_size(width=3840, height=21...
(kms_flip:3333) igt_fb-DEBUG: igt_create_fb_with_bo_size(handle=1, pitch=15360)
(kms_flip:3333) ioctl_wrappers-DEBUG: Test requirement passed: igt_has_fb_modi...
(kms_flip:3333) igt_fb-DEBUG: igt_create_fb_with_bo_size(width=3840, height=21...
(kms_flip:3333) igt_fb-DEBUG: igt_create_fb_with_bo_size(handle=2, pitch=15360)
(kms_flip:3333) ioctl_wrappers-DEBUG: Test requirement passed: igt_has_fb_modi...
(kms_flip:3333) intel_allocator_simple-DEBUG: Using simple allocator
(kms_flip:3333) intel_allocator_simple-DEBUG: <ial: 0x5c371ef1cdd0, fd: 5> obj...
(kms_flip:3333) intel_allocator_simple-DEBUG: <ial: 0x5c371ef1cdd0, fd: 5> obj...
(kms_flip:3333) intel_allocator_simple-DEBUG: Using simple allocator
(kms_flip:3333) intel_allocator_simple-DEBUG: <ial: 0x5c371ef1cfb0, fd: 5> obj...
(kms_flip:3333) intel_allocator_simple-DEBUG: <ial: 0x5c371ef1cfb0, fd: 5> obj...
...
igt@kms_flip@2x-plain-flip-ts-check@ad-dp2-hdmi-a3
xe-2895-0d2ff6d7ad3b6bf64c5c0e9a921fcfa925029526

Starting dynamic subtest: AD-DP2-HDMI-A3
(kms_flip:2623) CRITICAL: Test assertion failure function __run_test_on_crtc_s...
(kms_flip:2623) CRITICAL: Failed assertion: !retried && needs_retry_after_link...
Dynamic subtest AD-DP2-HDMI-A3 failed.
**** DEBUG ****
(kms_flip:2623) igt_fb-DEBUG: igt_create_fb_with_bo_size(width=3840, height=21...
(kms_flip:2623) igt_fb-DEBUG: igt_create_fb_with_bo_size(handle=1, pitch=15360)
(kms_flip:2623) ioctl_wrappers-DEBUG: Test requirement passed: igt_has_fb_modi...
(kms_flip:2623) igt_fb-DEBUG: igt_create_fb_with_bo_size(width=3840, height=21...
(kms_flip:2623) igt_fb-DEBUG: igt_create_fb_with_bo_size(handle=2, pitch=15360)
(kms_flip:2623) ioctl_wrappers-DEBUG: Test requirement passed: igt_has_fb_modi...
(kms_flip:2623) intel_allocator_simple-DEBUG: Using simple allocator
(kms_flip:2623) intel_allocator_simple-DEBUG: <ial: 0x5c4f02ea0660, fd: 5> obj...
(kms_flip:2623) intel_allocator_simple-DEBUG: <ial: 0x5c4f02ea0660, fd: 5> obj...
(kms_flip:2623) intel_allocator_simple-DEBUG: Using simple allocator
(kms_flip:2623) intel_allocator_simple-DEBUG: <ial: 0x5c4f02eac830, fd: 5> obj...
(kms_flip:2623) intel_allocator_simple-DEBUG: <ial: 0x5c4f02eac830, fd: 5> obj...
...
igt@kms_flip@2x-plain-flip-ts-check@bd-dp2-hdmi-a3
igt@kms_flip@2x-plain-flip-ts-check@bd-dp2-hdmi-a3
xe-2899-8f917568adaeea8b649e337e7d0e03bd03332253

Starting dynamic subtest: BD-DP2-HDMI-A3
(kms_flip:3333) CRITICAL: Test assertion failure function __run_test_on_crtc_s...
(kms_flip:3333) CRITICAL: Failed assertion: !retried && needs_retry_after_link...
Dynamic subtest BD-DP2-HDMI-A3 failed.
**** DEBUG ****
(kms_flip:3333) igt_fb-DEBUG: igt_create_fb_with_bo_size(width=3840, height=21...
(kms_flip:3333) igt_fb-DEBUG: igt_create_fb_with_bo_size(handle=3, pitch=15360)
(kms_flip:3333) ioctl_wrappers-DEBUG: Test requirement passed: igt_has_fb_modi...
(kms_flip:3333) igt_fb-DEBUG: igt_create_fb_with_bo_size(width=3840, height=21...
(kms_flip:3333) igt_fb-DEBUG: igt_create_fb_with_bo_size(handle=4, pitch=15360)
(kms_flip:3333) ioctl_wrappers-DEBUG: Test requirement passed: igt_has_fb_modi...
(kms_flip:3333) intel_allocator_simple-DEBUG: Using simple allocator
(kms_flip:3333) intel_allocator_simple-DEBUG: <ial: 0x5c371ef1b570, fd: 5> obj...
(kms_flip:3333) intel_allocator_simple-DEBUG: <ial: 0x5c371ef1b570, fd: 5> obj...
(kms_flip:3333) intel_allocator_simple-DEBUG: Using simple allocator
(kms_flip:3333) intel_allocator_simple-DEBUG: <ial: 0x5c371ef1b570, fd: 5> obj...
(kms_flip:3333) intel_allocator_simple-DEBUG: <ial: 0x5c371ef1b570, fd: 5> obj...
...
igt@kms_flip@2x-plain-flip-ts-check@cd-dp2-hdmi-a3
igt@kms_flip@2x-plain-flip-ts-check@cd-dp2-hdmi-a3
xe-2895-0d2ff6d7ad3b6bf64c5c0e9a921fcfa925029526

Starting dynamic subtest: CD-DP2-HDMI-A3
(kms_flip:2623) CRITICAL: Test assertion failure function __run_test_on_crtc_s...
(kms_flip:2623) CRITICAL: Failed assertion: !retried && needs_retry_after_link...
Dynamic subtest CD-DP2-HDMI-A3 failed.
**** DEBUG ****
(kms_flip:2623) igt_fb-DEBUG: igt_create_fb_with_bo_size(width=3840, height=21...
(kms_flip:2623) igt_fb-DEBUG: igt_create_fb_with_bo_size(handle=3, pitch=15360)
(kms_flip:2623) ioctl_wrappers-DEBUG: Test requirement passed: igt_has_fb_modi...
(kms_flip:2623) igt_fb-DEBUG: igt_create_fb_with_bo_size(width=3840, height=21...
(kms_flip:2623) igt_fb-DEBUG: igt_create_fb_with_bo_size(handle=4, pitch=15360)
(kms_flip:2623) ioctl_wrappers-DEBUG: Test requirement passed: igt_has_fb_modi...
(kms_flip:2623) intel_allocator_simple-DEBUG: Using simple allocator
(kms_flip:2623) intel_allocator_simple-DEBUG: <ial: 0x5c4f02ebcf80, fd: 5> obj...
(kms_flip:2623) intel_allocator_simple-DEBUG: <ial: 0x5c4f02ebcf80, fd: 5> obj...
(kms_flip:2623) intel_allocator_simple-DEBUG: Using simple allocator
(kms_flip:2623) intel_allocator_simple-DEBUG: <ial: 0x5c4f02ec6980, fd: 5> obj...
(kms_flip:2623) intel_allocator_simple-DEBUG: <ial: 0x5c4f02ec6980, fd: 5> obj...
...
igt@kms_universal_plane@cursor-fb-leak@pipe-c-dp-2
igt@kms_universal_plane@cursor-fb-leak@pipe-c-dp-2
xe-2899-8f917568adaeea8b649e337e7d0e03bd03332253

Starting dynamic subtest: pipe-C-DP-2
(kms_universal_plane:21335) CRITICAL: Test assertion failure function cursor_l...
(kms_universal_plane:21335) CRITICAL: Failed assertion: count1 == count2
(kms_universal_plane:21335) CRITICAL: Last errno: 9, Bad file descriptor
(kms_universal_plane:21335) CRITICAL: error: 1 != 17
Dynamic subtest pipe-C-DP-2 failed.
**** DEBUG ****
}
(kms_universal_plane:21335) igt_kms-DEBUG: display: C.5: plane_set_fb(297)
(kms_universal_plane:21335) igt_kms-DEBUG: display: C.5: plane_set_size (64x64)
(kms_universal_plane:21335) igt_kms-DEBUG: display: C.5: fb_set_position(0,0)
(kms_universal_plane:21335) igt_kms-DEBUG: display: C.5: fb_set_size(64x64)
(kms_universal_plane:21335) igt_kms-DEBUG: display: commit {
(kms_universal_plane:21335) igt_kms-DEBUG: Test requirement passed: plane_idx ...
(kms_universal_plane:21335) igt_kms-DEBUG: Test requirement passed: plane_idx ...
(kms_universal_plane:21335) igt_kms-DEBUG: Test requirement passed: plane_idx ...
(kms_universal_plane:21335) igt_kms-DEBUG: Test requirement passed: plane_idx ...
...
igt@kms_universal_plane@cursor-fb-leak@pipe-c-dp-2
xe-2895-0d2ff6d7ad3b6bf64c5c0e9a921fcfa925029526

Starting dynamic subtest: pipe-C-DP-2
(kms_universal_plane:12244) CRITICAL: Test assertion failure function cursor_l...
(kms_universal_plane:12244) CRITICAL: Failed assertion: count1 == count2
(kms_universal_plane:12244) CRITICAL: Last errno: 9, Bad file descriptor
(kms_universal_plane:12244) CRITICAL: error: 1 != 3
Dynamic subtest pipe-C-DP-2 failed.
**** DEBUG ****
}
(kms_universal_plane:12244) igt_kms-DEBUG: display: C.5: plane_set_fb(297)
(kms_universal_plane:12244) igt_kms-DEBUG: display: C.5: plane_set_size (64x64)
(kms_universal_plane:12244) igt_kms-DEBUG: display: C.5: fb_set_position(0,0)
(kms_universal_plane:12244) igt_kms-DEBUG: display: C.5: fb_set_size(64x64)
(kms_universal_plane:12244) igt_kms-DEBUG: display: commit {
(kms_universal_plane:12244) igt_kms-DEBUG: Test requirement passed: plane_idx ...
(kms_universal_plane:12244) igt_kms-DEBUG: Test requirement passed: plane_idx ...
(kms_universal_plane:12244) igt_kms-DEBUG: Test requirement passed: plane_idx ...
(kms_universal_plane:12244) igt_kms-DEBUG: Test requirement passed: plane_idx ...
...
igt@kms_universal_plane@cursor-fb-leak@pipe-d-dp-2
igt@kms_universal_plane@cursor-fb-leak@pipe-d-dp-2
xe-2899-8f917568adaeea8b649e337e7d0e03bd03332253

Starting dynamic subtest: pipe-D-DP-2
(kms_universal_plane:21335) CRITICAL: Test assertion failure function cursor_l...
(kms_universal_plane:21335) CRITICAL: Failed assertion: count1 == count2
(kms_universal_plane:21335) CRITICAL: Last errno: 9, Bad file descriptor
(kms_universal_plane:21335) CRITICAL: error: 1 != 3
Dynamic subtest pipe-D-DP-2 failed.
**** DEBUG ****
}
(kms_universal_plane:21335) igt_kms-DEBUG: display: D.5: plane_set_fb(297)
(kms_universal_plane:21335) igt_kms-DEBUG: display: D.5: plane_set_size (64x64)
(kms_universal_plane:21335) igt_kms-DEBUG: display: D.5: fb_set_position(0,0)
(kms_universal_plane:21335) igt_kms-DEBUG: display: D.5: fb_set_size(64x64)
(kms_universal_plane:21335) igt_kms-DEBUG: display: commit {
(kms_universal_plane:21335) igt_kms-DEBUG: Test requirement passed: plane_idx ...
(kms_universal_plane:21335) igt_kms-DEBUG: Test requirement passed: plane_idx ...
(kms_universal_plane:21335) igt_kms-DEBUG: Test requirement passed: plane_idx ...
(kms_universal_plane:21335) igt_kms-DEBUG: Test requirement passed: plane_idx ...
...
igt@kms_universal_plane@cursor-fb-leak@pipe-d-dp-2
xe-2895-0d2ff6d7ad3b6bf64c5c0e9a921fcfa925029526

Starting dynamic subtest: pipe-D-DP-2
(kms_universal_plane:12244) CRITICAL: Test assertion failure function cursor_l...
(kms_universal_plane:12244) CRITICAL: Failed assertion: count1 == count2
(kms_universal_plane:12244) CRITICAL: Last errno: 9, Bad file descriptor
(kms_universal_plane:12244) CRITICAL: error: 1 != 3
Dynamic subtest pipe-D-DP-2 failed.
**** DEBUG ****
}
(kms_universal_plane:12244) igt_kms-DEBUG: display: D.5: plane_set_fb(297)
(kms_universal_plane:12244) igt_kms-DEBUG: display: D.5: plane_set_size (64x64)
(kms_universal_plane:12244) igt_kms-DEBUG: display: D.5: fb_set_position(0,0)
(kms_universal_plane:12244) igt_kms-DEBUG: display: D.5: fb_set_size(64x64)
(kms_universal_plane:12244) igt_kms-DEBUG: display: commit {
(kms_universal_plane:12244) igt_kms-DEBUG: Test requirement passed: plane_idx ...
(kms_universal_plane:12244) igt_kms-DEBUG: Test requirement passed: plane_idx ...
(kms_universal_plane:12244) igt_kms-DEBUG: Test requirement passed: plane_idx ...
(kms_universal_plane:12244) igt_kms-DEBUG: Test requirement passed: plane_idx ...
...
igt@kms_flip@2x-flip-vs-absolute-wf_vblank@ab-dp2-hdmi-a3
igt@kms_flip@2x-flip-vs-absolute-wf_vblank@ab-dp2-hdmi-a3
xe-2899-8f917568adaeea8b649e337e7d0e03bd03332253

Starting subtest: 2x-flip-vs-absolute-wf_vblank
Starting dynamic subtest: AB-DP2-HDMI-A3
(kms_flip:4503) CRITICAL: Test assertion failure function __run_test_on_crtc_s...
(kms_flip:4503) CRITICAL: Failed assertion: !retried && needs_retry_after_link...
Dynamic subtest AB-DP2-HDMI-A3 failed.
**** DEBUG ****
(kms_flip:4503) igt_fb-DEBUG: igt_create_fb_with_bo_size(width=3840, height=21...
(kms_flip:4503) igt_fb-DEBUG: igt_create_fb_with_bo_size(handle=1, pitch=15360)
(kms_flip:4503) ioctl_wrappers-DEBUG: Test requirement passed: igt_has_fb_modi...
(kms_flip:4503) igt_fb-DEBUG: igt_create_fb_with_bo_size(width=3840, height=21...
(kms_flip:4503) igt_fb-DEBUG: igt_create_fb_with_bo_size(handle=2, pitch=15360)
(kms_flip:4503) ioctl_wrappers-DEBUG: Test requirement passed: igt_has_fb_modi...
(kms_flip:4503) intel_allocator_simple-DEBUG: Using simple allocator
(kms_flip:4503) intel_allocator_simple-DEBUG: <ial: 0x64f7c09652d0, fd: 5> obj...
(kms_flip:4503) intel_allocator_simple-DEBUG: <ial: 0x64f7c09652d0, fd: 5> obj...
(kms_flip:4503) intel_allocator_simple-DEBUG: Using simple allocator
(kms_flip:4503) intel_allocator_simple-DEBUG: <ial: 0x64f7c09ac230, fd: 5> obj...
...
igt@kms_flip@2x-plain-flip-fb-recreate-interruptible@ab-dp2-hdmi-a3
igt@kms_flip@2x-plain-flip-fb-recreate-interruptible@ab-dp2-hdmi-a3
xe-2899-8f917568adaeea8b649e337e7d0e03bd03332253

Starting subtest: 2x-plain-flip-fb-recreate-interruptible
Starting dynamic subtest: AB-DP2-HDMI-A3
(kms_flip:3196) CRITICAL: Test assertion failure function __run_test_on_crtc_s...
(kms_flip:3196) CRITICAL: Failed assertion: !retried && needs_retry_after_link...
(kms_flip:3196) CRITICAL: Last errno: 4, Interrupted system call
Dynamic subtest AB-DP2-HDMI-A3 failed.
**** DEBUG ****
(kms_flip:3196) igt_fb-DEBUG: igt_create_fb_with_bo_size(width=3840, height=21...
(kms_flip:3196) igt_fb-DEBUG: igt_create_fb_with_bo_size(handle=1, pitch=15360)
(kms_flip:3196) ioctl_wrappers-DEBUG: Test requirement passed: igt_has_fb_modi...
(kms_flip:3196) igt_fb-DEBUG: igt_create_fb_with_bo_size(width=3840, height=21...
(kms_flip:3196) igt_fb-DEBUG: igt_create_fb_with_bo_size(handle=2, pitch=15360)
(kms_flip:3196) ioctl_wrappers-DEBUG: Test requirement passed: igt_has_fb_modi...
(kms_flip:3196) intel_allocator_simple-DEBUG: Using simple allocator
(kms_flip:3196) intel_allocator_simple-DEBUG: <ial: 0x641897975eb0, fd: 5> obj...
(kms_flip:3196) intel_allocator_simple-DEBUG: <ial: 0x641897975eb0, fd: 5> obj...
(kms_flip:3196) intel_allocator_simple-DEBUG: Using simple allocator
...
igt@kms_flip@2x-plain-flip-fb-recreate-interruptible@ab-dp2-hdmi-a3
xe-2895-0d2ff6d7ad3b6bf64c5c0e9a921fcfa925029526

Starting subtest: 2x-plain-flip-fb-recreate-interruptible
Starting dynamic subtest: AB-DP2-HDMI-A3
(kms_flip:2497) CRITICAL: Test assertion failure function __run_test_on_crtc_s...
(kms_flip:2497) CRITICAL: Failed assertion: !retried && needs_retry_after_link...
(kms_flip:2497) CRITICAL: Last errno: 4, Interrupted system call
Dynamic subtest AB-DP2-HDMI-A3 failed.
**** DEBUG ****
(kms_flip:2497) igt_fb-DEBUG: igt_create_fb_with_bo_size(width=3840, height=21...
(kms_flip:2497) igt_fb-DEBUG: igt_create_fb_with_bo_size(handle=1, pitch=15360)
(kms_flip:2497) ioctl_wrappers-DEBUG: Test requirement passed: igt_has_fb_modi...
(kms_flip:2497) igt_fb-DEBUG: igt_create_fb_with_bo_size(width=3840, height=21...
(kms_flip:2497) igt_fb-DEBUG: igt_create_fb_with_bo_size(handle=2, pitch=15360)
(kms_flip:2497) ioctl_wrappers-DEBUG: Test requirement passed: igt_has_fb_modi...
(kms_flip:2497) intel_allocator_simple-DEBUG: Using simple allocator
(kms_flip:2497) intel_allocator_simple-DEBUG: <ial: 0x6454e483bb60, fd: 5> obj...
(kms_flip:2497) intel_allocator_simple-DEBUG: <ial: 0x6454e483bb60, fd: 5> obj...
(kms_flip:2497) intel_allocator_simple-DEBUG: Using simple allocator
...
igt@kms_flip@2x-plain-flip-fb-recreate-interruptible@ac-dp2-hdmi-a3
igt@kms_flip@2x-plain-flip-fb-recreate-interruptible@ac-dp2-hdmi-a3
xe-2895-0d2ff6d7ad3b6bf64c5c0e9a921fcfa925029526

Starting dynamic subtest: AC-DP2-HDMI-A3
(kms_flip:2497) CRITICAL: Test assertion failure function __run_test_on_crtc_s...
(kms_flip:2497) CRITICAL: Failed assertion: !retried && needs_retry_after_link...
(kms_flip:2497) CRITICAL: Last errno: 4, Interrupted system call
Dynamic subtest AC-DP2-HDMI-A3 failed.
**** DEBUG ****
(kms_flip:2497) igt_fb-DEBUG: igt_create_fb_with_bo_size(width=3840, height=21...
(kms_flip:2497) igt_fb-DEBUG: igt_create_fb_with_bo_size(handle=3, pitch=15360)
(kms_flip:2497) ioctl_wrappers-DEBUG: Test requirement passed: igt_has_fb_modi...
(kms_flip:2497) igt_fb-DEBUG: igt_create_fb_with_bo_size(width=3840, height=21...
(kms_flip:2497) igt_fb-DEBUG: igt_create_fb_with_bo_size(handle=4, pitch=15360)
(kms_flip:2497) ioctl_wrappers-DEBUG: Test requirement passed: igt_has_fb_modi...
(kms_flip:2497) intel_allocator_simple-DEBUG: Using simple allocator
(kms_flip:2497) intel_allocator_simple-DEBUG: <ial: 0x6454e488c9b0, fd: 5> obj...
(kms_flip:2497) intel_allocator_simple-DEBUG: <ial: 0x6454e488c9b0, fd: 5> obj...
(kms_flip:2497) intel_allocator_simple-DEBUG: Using simple allocator
(kms_flip:2497) intel_allocator_simple-DEBUG: <ial: 0x6454e488caf0, fd: 5> obj...
...
igt@kms_flip@2x-plain-flip-fb-recreate-interruptible@ad-dp2-hdmi-a3
igt@kms_flip@2x-plain-flip-fb-recreate-interruptible@ad-dp2-hdmi-a3
xe-2899-8f917568adaeea8b649e337e7d0e03bd03332253

Starting dynamic subtest: AD-DP2-HDMI-A3
(kms_flip:3196) CRITICAL: Test assertion failure function __run_test_on_crtc_s...
(kms_flip:3196) CRITICAL: Failed assertion: !retried && needs_retry_after_link...
(kms_flip:3196) CRITICAL: Last errno: 4, Interrupted system call
Dynamic subtest AD-DP2-HDMI-A3 failed.
**** DEBUG ****
(kms_flip:3196) igt_fb-DEBUG: igt_create_fb_with_bo_size(width=3840, height=21...
(kms_flip:3196) igt_fb-DEBUG: igt_create_fb_with_bo_size(handle=3, pitch=15360)
(kms_flip:3196) ioctl_wrappers-DEBUG: Test requirement passed: igt_has_fb_modi...
(kms_flip:3196) igt_fb-DEBUG: igt_create_fb_with_bo_size(width=3840, height=21...
(kms_flip:3196) igt_fb-DEBUG: igt_create_fb_with_bo_size(handle=4, pitch=15360)
(kms_flip:3196) ioctl_wrappers-DEBUG: Test requirement passed: igt_has_fb_modi...
(kms_flip:3196) intel_allocator_simple-DEBUG: Using simple allocator
(kms_flip:3196) intel_allocator_simple-DEBUG: <ial: 0x641897986f20, fd: 5> obj...
(kms_flip:3196) intel_allocator_simple-DEBUG: <ial: 0x641897986f20, fd: 5> obj...
(kms_flip:3196) intel_allocator_simple-DEBUG: Using simple allocator
(kms_flip:3196) intel_allocator_simple-DEBUG: <ial: 0x641897986f20, fd: 5> obj...
...
igt@kms_flip@2x-plain-flip-fb-recreate-interruptible@cd-dp2-hdmi-a3
igt@kms_flip@2x-plain-flip-fb-recreate-interruptible@cd-dp2-hdmi-a3
xe-2895-0d2ff6d7ad3b6bf64c5c0e9a921fcfa925029526

Starting dynamic subtest: CD-DP2-HDMI-A3
(kms_flip:2497) CRITICAL: Test assertion failure function __run_test_on_crtc_s...
(kms_flip:2497) CRITICAL: Failed assertion: !retried && needs_retry_after_link...
(kms_flip:2497) CRITICAL: Last errno: 4, Interrupted system call
Dynamic subtest CD-DP2-HDMI-A3 failed.
**** DEBUG ****
(kms_flip:2497) igt_fb-DEBUG: igt_create_fb_with_bo_size(width=3840, height=21...
(kms_flip:2497) igt_fb-DEBUG: igt_create_fb_with_bo_size(handle=5, pitch=15360)
(kms_flip:2497) ioctl_wrappers-DEBUG: Test requirement passed: igt_has_fb_modi...
(kms_flip:2497) igt_fb-DEBUG: igt_create_fb_with_bo_size(width=3840, height=21...
(kms_flip:2497) igt_fb-DEBUG: igt_create_fb_with_bo_size(handle=6, pitch=15360)
(kms_flip:2497) ioctl_wrappers-DEBUG: Test requirement passed: igt_has_fb_modi...
(kms_flip:2497) intel_allocator_simple-DEBUG: Using simple allocator
(kms_flip:2497) intel_allocator_simple-DEBUG: <ial: 0x6454e487f8c0, fd: 5> obj...
(kms_flip:2497) intel_allocator_simple-DEBUG: <ial: 0x6454e487f8c0, fd: 5> obj...
(kms_flip:2497) intel_allocator_simple-DEBUG: Using simple allocator
(kms_flip:2497) intel_allocator_simple-DEBUG: <ial: 0x6454e487f8c0, fd: 5> obj...
...
igt@kms_flip@2x-plain-flip-fb-recreate@ab-dp2-hdmi-a3
igt@kms_flip@2x-plain-flip-fb-recreate@ab-dp2-hdmi-a3
xe-2899-8f917568adaeea8b649e337e7d0e03bd03332253

Starting subtest: 2x-plain-flip-fb-recreate
Starting dynamic subtest: AB-DP2-HDMI-A3
(kms_flip:3126) CRITICAL: Test assertion failure function __run_test_on_crtc_s...
(kms_flip:3126) CRITICAL: Failed assertion: !retried && needs_retry_after_link...
Dynamic subtest AB-DP2-HDMI-A3 failed.
**** DEBUG ****
(kms_flip:3126) igt_fb-DEBUG: igt_create_fb_with_bo_size(width=3840, height=21...
(kms_flip:3126) igt_fb-DEBUG: igt_create_fb_with_bo_size(handle=1, pitch=15360)
(kms_flip:3126) ioctl_wrappers-DEBUG: Test requirement passed: igt_has_fb_modi...
(kms_flip:3126) igt_fb-DEBUG: igt_create_fb_with_bo_size(width=3840, height=21...
(kms_flip:3126) igt_fb-DEBUG: igt_create_fb_with_bo_size(handle=2, pitch=15360)
(kms_flip:3126) ioctl_wrappers-DEBUG: Test requirement passed: igt_has_fb_modi...
(kms_flip:3126) intel_allocator_simple-DEBUG: Using simple allocator
(kms_flip:3126) intel_allocator_simple-DEBUG: <ial: 0x635ffaaa5c00, fd: 5> obj...
(kms_flip:3126) intel_allocator_simple-DEBUG: <ial: 0x635ffaaa5c00, fd: 5> obj...
(kms_flip:3126) intel_allocator_simple-DEBUG: Using simple allocator
(kms_flip:3126) intel_allocator_simple-DEBUG: <ial: 0x635ffaab3060, fd: 5> obj...
...
igt@kms_flip@2x-plain-flip-fb-recreate@ab-dp2-hdmi-a3
xe-2895-0d2ff6d7ad3b6bf64c5c0e9a921fcfa925029526

Starting subtest: 2x-plain-flip-fb-recreate
Starting dynamic subtest: AB-DP2-HDMI-A3
(kms_flip:2426) CRITICAL: Test assertion failure function __run_test_on_crtc_s...
(kms_flip:2426) CRITICAL: Failed assertion: !retried && needs_retry_after_link...
Dynamic subtest AB-DP2-HDMI-A3 failed.
**** DEBUG ****
(kms_flip:2426) igt_fb-DEBUG: igt_create_fb_with_bo_size(width=3840, height=21...
(kms_flip:2426) igt_fb-DEBUG: igt_create_fb_with_bo_size(handle=1, pitch=15360)
(kms_flip:2426) ioctl_wrappers-DEBUG: Test requirement passed: igt_has_fb_modi...
(kms_flip:2426) igt_fb-DEBUG: igt_create_fb_with_bo_size(width=3840, height=21...
(kms_flip:2426) igt_fb-DEBUG: igt_create_fb_with_bo_size(handle=2, pitch=15360)
(kms_flip:2426) ioctl_wrappers-DEBUG: Test requirement passed: igt_has_fb_modi...
(kms_flip:2426) intel_allocator_simple-DEBUG: Using simple allocator
(kms_flip:2426) intel_allocator_simple-DEBUG: <ial: 0x57f0c8102cf0, fd: 5> obj...
(kms_flip:2426) intel_allocator_simple-DEBUG: <ial: 0x57f0c8102cf0, fd: 5> obj...
(kms_flip:2426) intel_allocator_simple-DEBUG: Using simple allocator
(kms_flip:2426) intel_allocator_simple-DEBUG: <ial: 0x57f0c810fe70, fd: 5> obj...
...
igt@kms_flip@2x-plain-flip-fb-recreate@ac-dp2-hdmi-a3
igt@kms_flip@2x-plain-flip-fb-recreate@ac-dp2-hdmi-a3
xe-2899-8f917568adaeea8b649e337e7d0e03bd03332253

Starting dynamic subtest: AC-DP2-HDMI-A3
(kms_flip:3126) CRITICAL: Test assertion failure function __run_test_on_crtc_s...
(kms_flip:3126) CRITICAL: Failed assertion: !retried && needs_retry_after_link...
Dynamic subtest AC-DP2-HDMI-A3 failed.
**** DEBUG ****
(kms_flip:3126) igt_fb-DEBUG: igt_create_fb_with_bo_size(width=3840, height=21...
(kms_flip:3126) igt_fb-DEBUG: igt_create_fb_with_bo_size(handle=3, pitch=15360)
(kms_flip:3126) ioctl_wrappers-DEBUG: Test requirement passed: igt_has_fb_modi...
(kms_flip:3126) igt_fb-DEBUG: igt_create_fb_with_bo_size(width=3840, height=21...
(kms_flip:3126) igt_fb-DEBUG: igt_create_fb_with_bo_size(handle=4, pitch=15360)
(kms_flip:3126) ioctl_wrappers-DEBUG: Test requirement passed: igt_has_fb_modi...
(kms_flip:3126) intel_allocator_simple-DEBUG: Using simple allocator
(kms_flip:3126) intel_allocator_simple-DEBUG: <ial: 0x635ffab2e350, fd: 5> obj...
(kms_flip:3126) intel_allocator_simple-DEBUG: <ial: 0x635ffab2e350, fd: 5> obj...
(kms_flip:3126) intel_allocator_simple-DEBUG: Using simple allocator
(kms_flip:3126) intel_allocator_simple-DEBUG: <ial: 0x635ffab2a260, fd: 5> obj...
(kms_flip:3126) intel_allocator_simple-DEBUG: <ial: 0x635ffab2a260, fd: 5> obj...
...
igt@kms_flip@2x-plain-flip-fb-recreate@ac-dp2-hdmi-a3
xe-2895-0d2ff6d7ad3b6bf64c5c0e9a921fcfa925029526

Starting dynamic subtest: AC-DP2-HDMI-A3
(kms_flip:2426) CRITICAL: Test assertion failure function __run_test_on_crtc_s...
(kms_flip:2426) CRITICAL: Failed assertion: !retried && needs_retry_after_link...
Dynamic subtest AC-DP2-HDMI-A3 failed.
**** DEBUG ****
(kms_flip:2426) igt_fb-DEBUG: igt_create_fb_with_bo_size(width=3840, height=21...
(kms_flip:2426) igt_fb-DEBUG: igt_create_fb_with_bo_size(handle=3, pitch=15360)
(kms_flip:2426) ioctl_wrappers-DEBUG: Test requirement passed: igt_has_fb_modi...
(kms_flip:2426) igt_fb-DEBUG: igt_create_fb_with_bo_size(width=3840, height=21...
(kms_flip:2426) igt_fb-DEBUG: igt_create_fb_with_bo_size(handle=4, pitch=15360)
(kms_flip:2426) ioctl_wrappers-DEBUG: Test requirement passed: igt_has_fb_modi...
(kms_flip:2426) intel_allocator_simple-DEBUG: Using simple allocator
(kms_flip:2426) intel_allocator_simple-DEBUG: <ial: 0x57f0c8189fa0, fd: 5> obj...
(kms_flip:2426) intel_allocator_simple-DEBUG: <ial: 0x57f0c8189fa0, fd: 5> obj...
(kms_flip:2426) intel_allocator_simple-DEBUG: Using simple allocator
(kms_flip:2426) intel_allocator_simple-DEBUG: <ial: 0x57f0c818a9e0, fd: 5> obj...
(kms_flip:2426) intel_allocator_simple-DEBUG: <ial: 0x57f0c818a9e0, fd: 5> obj...
...
igt@kms_flip@2x-plain-flip-fb-recreate@bc-dp2-hdmi-a3
igt@kms_flip@2x-plain-flip-fb-recreate@bc-dp2-hdmi-a3
xe-2899-8f917568adaeea8b649e337e7d0e03bd03332253

Starting dynamic subtest: BC-DP2-HDMI-A3
(kms_flip:3126) CRITICAL: Test assertion failure function __run_test_on_crtc_s...
(kms_flip:3126) CRITICAL: Failed assertion: !retried && needs_retry_after_link...
Dynamic subtest BC-DP2-HDMI-A3 failed.
**** DEBUG ****
(kms_flip:3126) igt_fb-DEBUG: igt_create_fb_with_bo_size(width=3840, height=21...
(kms_flip:3126) igt_fb-DEBUG: igt_create_fb_with_bo_size(handle=5, pitch=15360)
(kms_flip:3126) ioctl_wrappers-DEBUG: Test requirement passed: igt_has_fb_modi...
(kms_flip:3126) igt_fb-DEBUG: igt_create_fb_with_bo_size(width=3840, height=21...
(kms_flip:3126) igt_fb-DEBUG: igt_create_fb_with_bo_size(handle=6, pitch=15360)
(kms_flip:3126) ioctl_wrappers-DEBUG: Test requirement passed: igt_has_fb_modi...
(kms_flip:3126) intel_allocator_simple-DEBUG: Using simple allocator
(kms_flip:3126) intel_allocator_simple-DEBUG: <ial: 0x635ffaa700d0, fd: 5> obj...
(kms_flip:3126) intel_allocator_simple-DEBUG: <ial: 0x635ffaa700d0, fd: 5> obj...
(kms_flip:3126) intel_allocator_simple-DEBUG: Using simple allocator
(kms_flip:3126) intel_allocator_simple-DEBUG: <ial: 0x635ffaaf4780, fd: 5> obj...
(kms_flip:3126) intel_allocator_simple-DEBUG: <ial: 0x635ffaaf4780, fd: 5> obj...
...
igt@kms_flip@2x-plain-flip-fb-recreate@bd-dp2-hdmi-a3
igt@kms_flip@2x-plain-flip-fb-recreate@bd-dp2-hdmi-a3
xe-2899-8f917568adaeea8b649e337e7d0e03bd03332253

Starting dynamic subtest: BD-DP2-HDMI-A3
(kms_flip:3126) CRITICAL: Test assertion failure function __run_test_on_crtc_s...
(kms_flip:3126) CRITICAL: Failed assertion: !retried && needs_retry_after_link...
Dynamic subtest BD-DP2-HDMI-A3 failed.
**** DEBUG ****
(kms_flip:3126) igt_fb-DEBUG: igt_create_fb_with_bo_size(width=3840, height=21...
(kms_flip:3126) igt_fb-DEBUG: igt_create_fb_with_bo_size(handle=7, pitch=15360)
(kms_flip:3126) ioctl_wrappers-DEBUG: Test requirement passed: igt_has_fb_modi...
(kms_flip:3126) igt_fb-DEBUG: igt_create_fb_with_bo_size(width=3840, height=21...
(kms_flip:3126) igt_fb-DEBUG: igt_create_fb_with_bo_size(handle=8, pitch=15360)
(kms_flip:3126) ioctl_wrappers-DEBUG: Test requirement passed: igt_has_fb_modi...
(kms_flip:3126) intel_allocator_simple-DEBUG: Using simple allocator
(kms_flip:3126) intel_allocator_simple-DEBUG: <ial: 0x635ffaa7e760, fd: 5> obj...
(kms_flip:3126) intel_allocator_simple-DEBUG: <ial: 0x635ffaa7e760, fd: 5> obj...
(kms_flip:3126) intel_allocator_simple-DEBUG: Using simple allocator
(kms_flip:3126) intel_allocator_simple-DEBUG: <ial: 0x635ffaa7e760, fd: 5> obj...
(kms_flip:3126) intel_allocator_simple-DEBUG: <ial: 0x635ffaa7e760, fd: 5> obj...
...
igt@kms_flip@2x-plain-flip-fb-recreate@bd-dp2-hdmi-a3
xe-2895-0d2ff6d7ad3b6bf64c5c0e9a921fcfa925029526

Starting dynamic subtest: BD-DP2-HDMI-A3
(kms_flip:2426) CRITICAL: Test assertion failure function __run_test_on_crtc_s...
(kms_flip:2426) CRITICAL: Failed assertion: !retried && needs_retry_after_link...
Dynamic subtest BD-DP2-HDMI-A3 failed.
**** DEBUG ****
(kms_flip:2426) igt_fb-DEBUG: igt_create_fb_with_bo_size(width=3840, height=21...
(kms_flip:2426) igt_fb-DEBUG: igt_create_fb_with_bo_size(handle=5, pitch=15360)
(kms_flip:2426) ioctl_wrappers-DEBUG: Test requirement passed: igt_has_fb_modi...
(kms_flip:2426) igt_fb-DEBUG: igt_create_fb_with_bo_size(width=3840, height=21...
(kms_flip:2426) igt_fb-DEBUG: igt_create_fb_with_bo_size(handle=6, pitch=15360)
(kms_flip:2426) ioctl_wrappers-DEBUG: Test requirement passed: igt_has_fb_modi...
(kms_flip:2426) intel_allocator_simple-DEBUG: Using simple allocator
(kms_flip:2426) intel_allocator_simple-DEBUG: <ial: 0x57f0c8192870, fd: 5> obj...
(kms_flip:2426) intel_allocator_simple-DEBUG: <ial: 0x57f0c8192870, fd: 5> obj...
(kms_flip:2426) intel_allocator_simple-DEBUG: Using simple allocator
(kms_flip:2426) intel_allocator_simple-DEBUG: <ial: 0x57f0c8192870, fd: 5> obj...
(kms_flip:2426) intel_allocator_simple-DEBUG: <ial: 0x57f0c8192870, fd: 5> obj...
...
igt@kms_flip@2x-plain-flip-fb-recreate@cd-dp2-hdmi-a3
igt@kms_flip@2x-plain-flip-fb-recreate@cd-dp2-hdmi-a3
xe-2899-8f917568adaeea8b649e337e7d0e03bd03332253

Starting dynamic subtest: CD-DP2-HDMI-A3
(kms_flip:3126) CRITICAL: Test assertion failure function __run_test_on_crtc_s...
(kms_flip:3126) CRITICAL: Failed assertion: !retried && needs_retry_after_link...
Dynamic subtest CD-DP2-HDMI-A3 failed.
**** DEBUG ****
(kms_flip:3126) igt_fb-DEBUG: igt_create_fb_with_bo_size(width=3840, height=21...
(kms_flip:3126) igt_fb-DEBUG: igt_create_fb_with_bo_size(handle=9, pitch=15360)
(kms_flip:3126) ioctl_wrappers-DEBUG: Test requirement passed: igt_has_fb_modi...
(kms_flip:3126) igt_fb-DEBUG: igt_create_fb_with_bo_size(width=3840, height=21...
(kms_flip:3126) igt_fb-DEBUG: igt_create_fb_with_bo_size(handle=10, pitch=15360)
(kms_flip:3126) ioctl_wrappers-DEBUG: Test requirement passed: igt_has_fb_modi...
(kms_flip:3126) intel_allocator_simple-DEBUG: Using simple allocator
(kms_flip:3126) intel_allocator_simple-DEBUG: <ial: 0x635ffab17b60, fd: 5> obj...
(kms_flip:3126) intel_allocator_simple-DEBUG: <ial: 0x635ffab17b60, fd: 5> obj...
(kms_flip:3126) intel_allocator_simple-DEBUG: Using simple allocator
(kms_flip:3126) intel_allocator_simple-DEBUG: <ial: 0x635ffab16ea0, fd: 5> obj...
(kms_flip:3126) intel_allocator_simple-DEBUG: <ial: 0x635ffab16ea0, fd: 5> obj...
...
igt@kms_flip@2x-plain-flip-fb-recreate@cd-dp2-hdmi-a3
xe-2895-0d2ff6d7ad3b6bf64c5c0e9a921fcfa925029526

Starting dynamic subtest: CD-DP2-HDMI-A3
(kms_flip:2426) CRITICAL: Test assertion failure function __run_test_on_crtc_s...
(kms_flip:2426) CRITICAL: Failed assertion: !retried && needs_retry_after_link...
Dynamic subtest CD-DP2-HDMI-A3 failed.
**** DEBUG ****
(kms_flip:2426) igt_fb-DEBUG: igt_create_fb_with_bo_size(width=3840, height=21...
(kms_flip:2426) igt_fb-DEBUG: igt_create_fb_with_bo_size(handle=7, pitch=15360)
(kms_flip:2426) ioctl_wrappers-DEBUG: Test requirement passed: igt_has_fb_modi...
(kms_flip:2426) igt_fb-DEBUG: igt_create_fb_with_bo_size(width=3840, height=21...
(kms_flip:2426) igt_fb-DEBUG: igt_create_fb_with_bo_size(handle=8, pitch=15360)
(kms_flip:2426) ioctl_wrappers-DEBUG: Test requirement passed: igt_has_fb_modi...
(kms_flip:2426) intel_allocator_simple-DEBUG: Using simple allocator
(kms_flip:2426) intel_allocator_simple-DEBUG: <ial: 0x57f0c8192290, fd: 5> obj...
(kms_flip:2426) intel_allocator_simple-DEBUG: <ial: 0x57f0c8192290, fd: 5> obj...
(kms_flip:2426) intel_allocator_simple-DEBUG: Using simple allocator
(kms_flip:2426) intel_allocator_simple-DEBUG: <ial: 0x57f0c815df40, fd: 5> obj...
(kms_flip:2426) intel_allocator_simple-DEBUG: <ial: 0x57f0c815df40, fd: 5> obj...
...
Created at 2025-04-03 17:27:45