FAIL WARN PASS SKIP TIMEOUT NOT RUN INCOMPLETE ABORT CRASH
 
IGT_8303 xe-2901-71dac8dae6cc024b633bd6e584f4195c44c0dbc7 xe-2900-135e2838ed7d44d880e7e19971b1234e6ae04ded IGT_8302 xe-2899-8f917568adaeea8b649e337e7d0e03bd03332253 xe-2898-6deef7a0418bc26082804287b18c8db1e0810686 IGT_8301 xe-2897-883e4daea46ff15b470f138ee61573513243210d IGT_8300 IGT_8299 IGT_8298 xe-2896-f0fd77956987f035c79d08c812343a27a655a57b xe-2895-0d2ff6d7ad3b6bf64c5c0e9a921fcfa925029526
igt@kms_flip_scaled_crc@flip-64bpp-xtile-to-32bpp-xtile-upscaling
igt@kms_flip_scaled_crc@flip-64bpp-xtile-to-32bpp-xtile-upscaling
IGT_8302

Starting subtest: flip-64bpp-xtile-to-32bpp-xtile-upscaling
Starting dynamic subtest: pipe-A-default-mode
(kms_flip_scaled_crc:2517) igt_pipe_crc-CRITICAL: Test assertion failure funct...
(kms_flip_scaled_crc:2517) igt_pipe_crc-CRITICAL: Failed assertion: !mismatch ...
Dynamic subtest pipe-A-default-mode failed.
**** DEBUG ****
    populating plane data: C.0, fb 0
(kms_flip_scaled_crc:2517) igt_kms-DEBUG: plane C.0: Setting property "SRC_X" ...
(kms_flip_scaled_crc:2517) igt_kms-DEBUG: plane C.0: Setting property "SRC_Y" ...
(kms_flip_scaled_crc:2517) igt_kms-DEBUG: plane C.0: Setting property "SRC_W" ...
(kms_flip_scaled_crc:2517) igt_kms-DEBUG: plane C.0: Setting property "SRC_H" ...
(kms_flip_scaled_crc:2517) igt_kms-DEBUG: plane C.0: Setting property "CRTC_X"...
(kms_flip_scaled_crc:2517) igt_kms-DEBUG: plane C.0: Setting property "CRTC_Y"...
(kms_flip_scaled_crc:2517) igt_kms-DEBUG: plane C.0: Setting property "CRTC_W"...
(kms_flip_scaled_crc:2517) igt_kms-DEBUG: plane C.0: Setting property "CRTC_H"...
(kms_flip_scaled_crc:2517) igt_kms-DEBUG: plane C.0: Setting property "FB_ID" ...
(kms_flip_scaled_crc:2517) igt_kms-DEBUG: plane C.0: Setting property "CRTC_ID...
...
igt@kms_flip_scaled_crc@flip-64bpp-xtile-to-32bpp-xtile-upscaling
xe-2899-8f917568adaeea8b649e337e7d0e03bd03332253

Starting subtest: flip-64bpp-xtile-to-32bpp-xtile-upscaling
Starting dynamic subtest: pipe-A-default-mode
(kms_flip_scaled_crc:8243) igt_pipe_crc-CRITICAL: Test assertion failure funct...
(kms_flip_scaled_crc:8243) igt_pipe_crc-CRITICAL: Failed assertion: !mismatch ...
Dynamic subtest pipe-A-default-mode failed.
**** DEBUG ****
    populating plane data: C.0, fb 0
(kms_flip_scaled_crc:8243) igt_kms-DEBUG: plane C.0: Setting property "SRC_X" ...
(kms_flip_scaled_crc:8243) igt_kms-DEBUG: plane C.0: Setting property "SRC_Y" ...
(kms_flip_scaled_crc:8243) igt_kms-DEBUG: plane C.0: Setting property "SRC_W" ...
(kms_flip_scaled_crc:8243) igt_kms-DEBUG: plane C.0: Setting property "SRC_H" ...
(kms_flip_scaled_crc:8243) igt_kms-DEBUG: plane C.0: Setting property "CRTC_X"...
(kms_flip_scaled_crc:8243) igt_kms-DEBUG: plane C.0: Setting property "CRTC_Y"...
(kms_flip_scaled_crc:8243) igt_kms-DEBUG: plane C.0: Setting property "CRTC_W"...
(kms_flip_scaled_crc:8243) igt_kms-DEBUG: plane C.0: Setting property "CRTC_H"...
(kms_flip_scaled_crc:8243) igt_kms-DEBUG: plane C.0: Setting property "FB_ID" ...
(kms_flip_scaled_crc:8243) igt_kms-DEBUG: plane C.0: Setting property "CRTC_ID...
...
igt@kms_flip_scaled_crc@flip-64bpp-xtile-to-32bpp-xtile-upscaling
xe-2898-6deef7a0418bc26082804287b18c8db1e0810686

Starting subtest: flip-64bpp-xtile-to-32bpp-xtile-upscaling
Starting dynamic subtest: pipe-A-default-mode
(kms_flip_scaled_crc:8122) igt_pipe_crc-CRITICAL: Test assertion failure funct...
(kms_flip_scaled_crc:8122) igt_pipe_crc-CRITICAL: Failed assertion: !mismatch ...
Dynamic subtest pipe-A-default-mode failed.
**** DEBUG ****
    populating plane data: C.0, fb 0
(kms_flip_scaled_crc:8122) igt_kms-DEBUG: plane C.0: Setting property "SRC_X" ...
(kms_flip_scaled_crc:8122) igt_kms-DEBUG: plane C.0: Setting property "SRC_Y" ...
(kms_flip_scaled_crc:8122) igt_kms-DEBUG: plane C.0: Setting property "SRC_W" ...
(kms_flip_scaled_crc:8122) igt_kms-DEBUG: plane C.0: Setting property "SRC_H" ...
(kms_flip_scaled_crc:8122) igt_kms-DEBUG: plane C.0: Setting property "CRTC_X"...
(kms_flip_scaled_crc:8122) igt_kms-DEBUG: plane C.0: Setting property "CRTC_Y"...
(kms_flip_scaled_crc:8122) igt_kms-DEBUG: plane C.0: Setting property "CRTC_W"...
(kms_flip_scaled_crc:8122) igt_kms-DEBUG: plane C.0: Setting property "CRTC_H"...
(kms_flip_scaled_crc:8122) igt_kms-DEBUG: plane C.0: Setting property "FB_ID" ...
(kms_flip_scaled_crc:8122) igt_kms-DEBUG: plane C.0: Setting property "CRTC_ID...
...
igt@kms_flip_scaled_crc@flip-64bpp-xtile-to-32bpp-xtile-upscaling
IGT_8301

Starting subtest: flip-64bpp-xtile-to-32bpp-xtile-upscaling
Starting dynamic subtest: pipe-A-default-mode
(kms_flip_scaled_crc:8145) igt_pipe_crc-CRITICAL: Test assertion failure funct...
(kms_flip_scaled_crc:8145) igt_pipe_crc-CRITICAL: Failed assertion: !mismatch ...
Dynamic subtest pipe-A-default-mode failed.
**** DEBUG ****
    populating plane data: C.0, fb 0
(kms_flip_scaled_crc:8145) igt_kms-DEBUG: plane C.0: Setting property "SRC_X" ...
(kms_flip_scaled_crc:8145) igt_kms-DEBUG: plane C.0: Setting property "SRC_Y" ...
(kms_flip_scaled_crc:8145) igt_kms-DEBUG: plane C.0: Setting property "SRC_W" ...
(kms_flip_scaled_crc:8145) igt_kms-DEBUG: plane C.0: Setting property "SRC_H" ...
(kms_flip_scaled_crc:8145) igt_kms-DEBUG: plane C.0: Setting property "CRTC_X"...
(kms_flip_scaled_crc:8145) igt_kms-DEBUG: plane C.0: Setting property "CRTC_Y"...
(kms_flip_scaled_crc:8145) igt_kms-DEBUG: plane C.0: Setting property "CRTC_W"...
(kms_flip_scaled_crc:8145) igt_kms-DEBUG: plane C.0: Setting property "CRTC_H"...
(kms_flip_scaled_crc:8145) igt_kms-DEBUG: plane C.0: Setting property "FB_ID" ...
(kms_flip_scaled_crc:8145) igt_kms-DEBUG: plane C.0: Setting property "CRTC_ID...
...
igt@kms_flip_scaled_crc@flip-64bpp-xtile-to-32bpp-xtile-upscaling
IGT_8300

Starting subtest: flip-64bpp-xtile-to-32bpp-xtile-upscaling
Starting dynamic subtest: pipe-A-default-mode
(kms_flip_scaled_crc:3880) igt_pipe_crc-CRITICAL: Test assertion failure funct...
(kms_flip_scaled_crc:3880) igt_pipe_crc-CRITICAL: Failed assertion: !mismatch ...
Dynamic subtest pipe-A-default-mode failed.
**** DEBUG ****
    populating plane data: C.0, fb 0
(kms_flip_scaled_crc:3880) igt_kms-DEBUG: plane C.0: Setting property "SRC_X" ...
(kms_flip_scaled_crc:3880) igt_kms-DEBUG: plane C.0: Setting property "SRC_Y" ...
(kms_flip_scaled_crc:3880) igt_kms-DEBUG: plane C.0: Setting property "SRC_W" ...
(kms_flip_scaled_crc:3880) igt_kms-DEBUG: plane C.0: Setting property "SRC_H" ...
(kms_flip_scaled_crc:3880) igt_kms-DEBUG: plane C.0: Setting property "CRTC_X"...
(kms_flip_scaled_crc:3880) igt_kms-DEBUG: plane C.0: Setting property "CRTC_Y"...
(kms_flip_scaled_crc:3880) igt_kms-DEBUG: plane C.0: Setting property "CRTC_W"...
(kms_flip_scaled_crc:3880) igt_kms-DEBUG: plane C.0: Setting property "CRTC_H"...
(kms_flip_scaled_crc:3880) igt_kms-DEBUG: plane C.0: Setting property "FB_ID" ...
(kms_flip_scaled_crc:3880) igt_kms-DEBUG: plane C.0: Setting property "CRTC_ID...
...
igt@xe_fault_injection@vm-create-fail-xe_exec_queue_create_bind
D igt@xe_fault_injection@vm-create-fail-xe_exec_queue_create_bind
IGT_8300

<3> [186.581996] xe 0000:00:02.0: [drm] *ERROR* audio power refcount 1 after u...
igt@kms_plane_scaling@plane-downscale-factor-0-5-with-modifiers
igt@kms_plane_scaling@plane-downscale-factor-0-5-with-modifiers
IGT_8302

Using IGT_SRANDOM=1743647481 for randomisation
Opened device: /dev/dri/card0
Starting subtest: plane-downscale-factor-0-5-with-modifiers
Starting dynamic subtest: pipe-A
Trying on eDP-1
Required scaling operation not supported on eDP-1 trying on next output
Test requirement not met in function __igt_unique____real_main1350, file ../te...
Test requirement: !(ret == -ERANGE || ret == -EINVAL)
Unsupported scaling operation in driver with return value -EINVAL
Dynamic subtest pipe-A: SKIP (0.004s)
Starting dynamic subtest: pipe-B
Trying on eDP-1
Required scaling operation not supported on eDP-1 trying on next output
Test requirement not met in function __igt_unique____real_main1350, file ../te...
Test requirement: !(ret == -ERANGE || ret == -EINVAL)
Unsupported scaling operation in driver with return value -EINVAL
Dynamic subtest pipe-B: SKIP (0.011s)
...
D igt@kms_plane_scaling@plane-downscale-factor-0-5-with-modifiers
xe-2895-0d2ff6d7ad3b6bf64c5c0e9a921fcfa925029526

<3> [246.389692] xe 0000:00:02.0: [drm] *ERROR* GT1: Force wake domain 15 fail...
<4> [246.391340] xe 0000:00:02.0: [drm] GT1: Forcewake domain 0x8000 failed to...
<4> [246.391448] Modules linked in: vgem snd_hda_codec_hdmi xe drm_gpuvm drm_g...
igt@kms_plane_scaling@plane-downscale-factor-0-5-with-modifiers@pipe-a
igt@kms_plane_scaling@plane-downscale-factor-0-5-with-modifiers@pipe-a
IGT_8302

Using IGT_SRANDOM=1743647481 for randomisation
Opened device: /dev/dri/card0
Starting subtest: plane-downscale-factor-0-5-with-modifiers
Starting dynamic subtest: pipe-A
Trying on eDP-1
Required scaling operation not supported on eDP-1 trying on next output
Test requirement not met in function __igt_unique____real_main1350, file ../te...
Test requirement: !(ret == -ERANGE || ret == -EINVAL)
Unsupported scaling operation in driver with return value -EINVAL
Dynamic subtest pipe-A: SKIP (0.004s)
igt@kms_plane_scaling@plane-downscale-factor-0-5-with-modifiers@pipe-a
xe-2895-0d2ff6d7ad3b6bf64c5c0e9a921fcfa925029526

<3> [246.389692] xe 0000:00:02.0: [drm] *ERROR* GT1: Force wake domain 15 fail...
<4> [246.391337] ------------[ cut here ]------------
<4> [246.391340] xe 0000:00:02.0: [drm] GT1: Forcewake domain 0x8000 failed to...
<4> [246.391360] WARNING: CPU: 7 PID: 2986 at drivers/gpu/drm/xe/xe_force_wake...
<4> [246.391448] Modules linked in: vgem snd_hda_codec_hdmi xe drm_gpuvm drm_g...
<4> [246.391525]  processor_thermal_mbox intel_ishtp mei drm_shmem_helper drm_...
<4> [246.391566] CPU: 7 UID: 0 PID: 2986 Comm: kworker/u32:33 Tainted: G     U...
<4> [246.391569] Tainted: [U]=USER
<4> [246.391571] Hardware name: Intel Corporation Lunar Lake Client Platform/L...
<4> [246.391573] Workqueue: gsc-ordered-wq gsc_work [xe]
<4> [246.391633] RIP: 0010:xe_force_wake_get+0x8c9/0x8e0 [xe]
<4> [246.391687] Code: d2 75 03 48 8b 17 48 89 55 b8 e8 72 b8 43 e1 48 8b 55 b...
<4> [246.391690] RSP: 0018:ffffc9000d1c3c38 EFLAGS: 00010246
<4> [246.391692] RAX: 0000000000000000 RBX: 0000000000000001 RCX: 000000000000...
<4> [246.391694] RDX: 0000000000000000 RSI: 0000000000000000 RDI: 000000000000...
<4> [246.391696] RBP: ffffc9000d1c3d08 R08: 0000000000000000 R09: 000000000000...
<4> [246.391697] R10: 0000000000000000 R11: 0000000000000000 R12: 000000000000...
...
igt@kms_flip@flip-vs-expired-vblank-interruptible
igt@kms_flip@flip-vs-expired-vblank-interruptible
xe-2900-135e2838ed7d44d880e7e19971b1234e6ae04ded

Starting subtest: flip-vs-expired-vblank-interruptible
Starting dynamic subtest: A-eDP1
(kms_flip:3466) CRITICAL: Test assertion failure function run_test_step, file ...
(kms_flip:3466) CRITICAL: Failed assertion: end - start < 500
(kms_flip:3466) CRITICAL: Last errno: 4, Interrupted system call
Dynamic subtest A-eDP1 failed.
**** DEBUG ****
(kms_flip:3466) DEBUG: Vblank took 36us
(kms_flip:3466) DEBUG: name = flip
last_ts = 231.469604
last_received_ts = 231.468796
last_seq = 344
current_ts = 231.486282
current_received_ts = 231.485458
current_seq = 345
count = 240
seq_step = 1
...
igt@kms_vrr@cmrr
igt@kms_vrr@cmrr
xe-2901-71dac8dae6cc024b633bd6e584f4195c44c0dbc7

Starting subtest: cmrr
Starting dynamic subtest: pipe-A-eDP-1
(kms_vrr:3776) CRITICAL: Test assertion failure function test_cmrr, file ../te...
(kms_vrr:3776) CRITICAL: Failed assertion: result > 75
(kms_vrr:3776) CRITICAL: Refresh rate (60 Hz) 16666666ns: Target CMRR on thres...
Dynamic subtest pipe-A-eDP-1 failed.
**** DEBUG ****
(kms_vrr:3776) igt_kms-DEBUG: plane A.0: Setting property "CRTC_H" to 0x708/1800
(kms_vrr:3776) igt_kms-DEBUG: plane A.0: Setting property "FB_ID" to 0xe1/225
(kms_vrr:3776) igt_kms-DEBUG: plane A.0: Setting property "CRTC_ID" to 0x52/82
(kms_vrr:3776) igt_kms-DEBUG: plane A.0: Setting property "COLOR_ENCODING" to ...
(kms_vrr:3776) igt_kms-DEBUG: plane A.0: Setting property "COLOR_RANGE" to 0x0/0
(kms_vrr:3776) igt_kms-DEBUG: display: }
(kms_vrr:3776) DEBUG: event_ns - last_event_ns: 33343000 ns (29.99 Hz)
(kms_vrr:3776) igt_kms-DEBUG: display: A.0: plane_set_fb(228)
(kms_vrr:3776) igt_kms-DEBUG: display: A.0: plane_set_size (2880x1800)
(kms_vrr:3776) igt_kms-DEBUG: display: A.0: fb_set_position(0,0)
...
igt@kms_vrr@cmrr
xe-2900-135e2838ed7d44d880e7e19971b1234e6ae04ded

Starting subtest: cmrr
Starting dynamic subtest: pipe-A-eDP-1
(kms_vrr:3749) CRITICAL: Test assertion failure function test_cmrr, file ../te...
(kms_vrr:3749) CRITICAL: Failed assertion: result > 75
(kms_vrr:3749) CRITICAL: Refresh rate (60 Hz) 16666666ns: Target CMRR on thres...
Dynamic subtest pipe-A-eDP-1 failed.
**** DEBUG ****
(kms_vrr:3749) igt_kms-DEBUG: plane A.0: Setting property "CRTC_H" to 0x708/1800
(kms_vrr:3749) igt_kms-DEBUG: plane A.0: Setting property "FB_ID" to 0xe1/225
(kms_vrr:3749) igt_kms-DEBUG: plane A.0: Setting property "CRTC_ID" to 0x52/82
(kms_vrr:3749) igt_kms-DEBUG: plane A.0: Setting property "COLOR_ENCODING" to ...
(kms_vrr:3749) igt_kms-DEBUG: plane A.0: Setting property "COLOR_RANGE" to 0x0/0
(kms_vrr:3749) igt_kms-DEBUG: display: }
(kms_vrr:3749) DEBUG: event_ns - last_event_ns: 33349000 ns (29.99 Hz)
(kms_vrr:3749) igt_kms-DEBUG: display: A.0: plane_set_fb(228)
(kms_vrr:3749) igt_kms-DEBUG: display: A.0: plane_set_size (2880x1800)
(kms_vrr:3749) igt_kms-DEBUG: display: A.0: fb_set_position(0,0)
...
igt@kms_vrr@cmrr
IGT_8301

<6> [412.439011] Console: switching to colour dummy device 80x25
<6> [412.439288] [IGT] kms_vrr: executing
<7> [412.443980] xe 0000:00:02.0: [drm:drm_helper_probe_single_connector_modes...
<7> [412.443996] xe 0000:00:02.0: [drm:intel_dp_detect [xe]] [CONNECTOR:198:DP...
<7> [412.444123] xe 0000:00:02.0: [drm:intel_tc_port_reset_mode [xe]] Port D/T...
<7> [412.444206] xe 0000:00:02.0: [drm:drm_helper_probe_single_connector_modes...
<7> [412.445975] xe 0000:00:02.0: [drm:drm_helper_probe_single_connector_modes...
<7> [412.445985] xe 0000:00:02.0: [drm:intel_dp_detect [xe]] [CONNECTOR:210:DP...
<7> [412.446092] xe 0000:00:02.0: [drm:intel_tc_port_reset_mode [xe]] Port E/T...
<7> [412.446172] xe 0000:00:02.0: [drm:drm_helper_probe_single_connector_modes...
<7> [412.446409] xe 0000:00:02.0: [drm:drm_helper_probe_single_connector_modes...
<7> [412.446416] xe 0000:00:02.0: [drm:intel_dp_detect [xe]] [CONNECTOR:218:DP...
<7> [412.446515] xe 0000:00:02.0: [drm:intel_tc_port_reset_mode [xe]] Port F/T...
<7> [412.446590] xe 0000:00:02.0: [drm:drm_helper_probe_single_connector_modes...
<7> [412.446840] xe 0000:00:02.0: [drm:drm_helper_probe_single_connector_modes...
<7> [412.446847] xe 0000:00:02.0: [drm:intel_dp_detect [xe]] [CONNECTOR:189:eD...
<7> [412.447534] xe 0000:00:02.0: [drm:intel_dp_read_dsc_dpcd [xe]] DSC DPCD: ...
...
igt@kms_vrr@cmrr
xe-2897-883e4daea46ff15b470f138ee61573513243210d

Starting subtest: cmrr
Starting dynamic subtest: pipe-A-eDP-1
(kms_vrr:4403) CRITICAL: Test assertion failure function test_cmrr, file ../te...
(kms_vrr:4403) CRITICAL: Failed assertion: result > 75
(kms_vrr:4403) CRITICAL: Refresh rate (60 Hz) 16666666ns: Target CMRR on thres...
Dynamic subtest pipe-A-eDP-1 failed.
**** DEBUG ****
(kms_vrr:4403) igt_kms-DEBUG: plane A.0: Setting property "CRTC_H" to 0x708/1800
(kms_vrr:4403) igt_kms-DEBUG: plane A.0: Setting property "FB_ID" to 0xe1/225
(kms_vrr:4403) igt_kms-DEBUG: plane A.0: Setting property "CRTC_ID" to 0x52/82
(kms_vrr:4403) igt_kms-DEBUG: plane A.0: Setting property "COLOR_ENCODING" to ...
(kms_vrr:4403) igt_kms-DEBUG: plane A.0: Setting property "COLOR_RANGE" to 0x0/0
(kms_vrr:4403) igt_kms-DEBUG: display: }
(kms_vrr:4403) DEBUG: event_ns - last_event_ns: 33328000 ns (30.00 Hz)
(kms_vrr:4403) igt_kms-DEBUG: display: A.0: plane_set_fb(228)
(kms_vrr:4403) igt_kms-DEBUG: display: A.0: plane_set_size (2880x1800)
(kms_vrr:4403) igt_kms-DEBUG: display: A.0: fb_set_position(0,0)
...
igt@kms_pm_dc@deep-pkgc
igt@kms_pm_dc@deep-pkgc
IGT_8298

Starting subtest: deep-pkgc
(kms_pm_dc:2739) CRITICAL: Test assertion failure function test_deep_pkgc_stat...
(kms_pm_dc:2739) CRITICAL: Failed assertion: pkgc_flag
(kms_pm_dc:2739) CRITICAL: PKGC10 is not achieved.
Subtest deep-pkgc failed.
**** DEBUG ****
(kms_pm_dc:2739) igt_kms-DEBUG: display:     SetProp plane B.3 "SCALING_FILTER...
(kms_pm_dc:2739) igt_kms-DEBUG: Test requirement passed: plane_idx >= 0 && pla...
(kms_pm_dc:2739) igt_kms-DEBUG: display:     Fixing up initial rotation pipe B...
(kms_pm_dc:2739) igt_kms-DEBUG: display:     SetPlane pipe B, plane 4, disabling
(kms_pm_dc:2739) igt_kms-DEBUG: display:     SetProp plane B.4 "rotation" to 0...
(kms_pm_dc:2739) igt_kms-DEBUG: display:     SetProp plane B.4 "COLOR_ENCODING...
(kms_pm_dc:2739) igt_kms-DEBUG: display:     SetProp plane B.4 "COLOR_RANGE" t...
(kms_pm_dc:2739) igt_kms-DEBUG: display:     SetProp plane B.4 "pixel blend mo...
(kms_pm_dc:2739) igt_kms-DEBUG: display:     SetProp plane B.4 "alpha" to 0xff...
(kms_pm_dc:2739) igt_kms-DEBUG: display:     SetProp plane B.4 "FB_DAMAGE_CLIP...
(kms_pm_dc:2739) igt_kms-DEBUG: display:     SetProp plane B.4 "SCALING_FILTER...
...
igt@kms_dirtyfb@default-dirtyfb-ioctl
D igt@kms_dirtyfb@default-dirtyfb-ioctl
IGT_8299

<3> [126.720960] xe 0000:00:02.0: [drm] *ERROR* failed to submit GSC PXP messa...
<3> [126.721693] xe 0000:00:02.0: [drm] *ERROR* Failed to invalidate PXP strea...
<3> [126.721746] xe 0000:00:02.0: [drm] *ERROR* PXP termination failed: -ETIME
<3> [126.721960] xe 0000:00:02.0: [drm] *ERROR* PXP termination complete while...
<3> [128.043954] xe 0000:00:02.0: [drm] *ERROR* GT1: TLB invalidation fence ti...
<3> [130.404003] xe 0000:00:02.0: [drm] *ERROR* GT1: TLB invalidation fence ti...
<3> [132.750372] xe 0000:00:02.0: [drm] *ERROR* GT1: TLB invalidation fence ti...
<3> [132.750438] xe 0000:00:02.0: [drm] *ERROR* GT1: TLB invalidation fence ti...
<3> [135.086024] xe 0000:00:02.0: [drm] *ERROR* GT1: TLB invalidation fence ti...
<3> [135.086058] xe 0000:00:02.0: [drm] *ERROR* GT1: TLB invalidation fence ti...
<4> [136.379925] xe 0000:00:02.0: [drm] GT1: Schedule disable failed to respon...
<3> [136.430414] xe 0000:00:02.0: [drm] *ERROR* GT1: Force wake domain 3 faile...
<3> [136.480996] xe 0000:00:02.0: [drm] *ERROR* GT1: Force wake domain 11 fail...
<3> [136.531000] xe 0000:00:02.0: [drm] *ERROR* GT1: Force wake domain 15 fail...
<4> [136.531024] xe 0000:00:02.0: [drm] GT1: Forcewake domains 0x8808 failed t...
<4> [136.531100] Modules linked in: snd_hda_codec_hdmi xe drm_gpuvm drm_gpusvm...
<3> [136.531727] xe 0000:00:02.0: [drm] *ERROR* GT1: reset failed (-ETIMEDOUT)
...
igt@kms_vblank@ts-continuation-suspend
D igt@kms_vblank@ts-continuation-suspend
IGT_8300

<4> [220.069854] xe 0000:00:02.0: [drm] Use count on domain AUDIO_PLAYBACK is ...
<4> [220.069909] WARNING: CPU: 1 PID: 2355 at drivers/gpu/drm/i915/display/int...
<4> [220.070190] Modules linked in: snd_hda_intel snd_hda_codec_hdmi xe drm_gp...
<4> [220.070615] RIP: 0010:__intel_display_power_put_domain+0x1c1/0x200 [xe]
<4> [220.071062]  ? __intel_display_power_put_domain+0x1c1/0x200 [xe]
<4> [220.071433]  ? __intel_display_power_put_domain+0x1c1/0x200 [xe]
<4> [220.071703]  ? intel_audio_component_codec_wake_override+0xaf/0x120 [xe]
<4> [220.072004]  intel_display_power_put+0x35/0x60 [xe]
<4> [220.072273]  intel_audio_component_put_power+0x3e/0x70 [xe]
<4> [220.072964] xe 0000:00:02.0: [drm] Use count on power well PW_2 is alread...
<4> [220.072992] WARNING: CPU: 1 PID: 2355 at drivers/gpu/drm/i915/display/int...
<4> [220.073280] Modules linked in: snd_hda_intel snd_hda_codec_hdmi xe drm_gp...
<4> [220.073598] RIP: 0010:intel_power_well_put+0xa9/0xc0 [xe]
<4> [220.073949]  ? intel_power_well_put+0xa9/0xc0 [xe]
<4> [220.074288]  ? intel_power_well_put+0xa9/0xc0 [xe]
<4> [220.074542]  __intel_display_power_put_domain+0xee/0x200 [xe]
<4> [220.074778]  ? intel_audio_component_codec_wake_override+0xaf/0x120 [xe]
...
igt@kms_vblank@ts-continuation-suspend@pipe-a-edp-1
D igt@kms_vblank@ts-continuation-suspend@pipe-a-edp-1
IGT_8300

<4> [220.069854] xe 0000:00:02.0: [drm] Use count on domain AUDIO_PLAYBACK is ...
<4> [220.069909] WARNING: CPU: 1 PID: 2355 at drivers/gpu/drm/i915/display/int...
<4> [220.070190] Modules linked in: snd_hda_intel snd_hda_codec_hdmi xe drm_gp...
<4> [220.070615] RIP: 0010:__intel_display_power_put_domain+0x1c1/0x200 [xe]
<4> [220.071062]  ? __intel_display_power_put_domain+0x1c1/0x200 [xe]
<4> [220.071433]  ? __intel_display_power_put_domain+0x1c1/0x200 [xe]
<4> [220.071703]  ? intel_audio_component_codec_wake_override+0xaf/0x120 [xe]
<4> [220.072004]  intel_display_power_put+0x35/0x60 [xe]
<4> [220.072273]  intel_audio_component_put_power+0x3e/0x70 [xe]
<4> [220.072964] xe 0000:00:02.0: [drm] Use count on power well PW_2 is alread...
<4> [220.072992] WARNING: CPU: 1 PID: 2355 at drivers/gpu/drm/i915/display/int...
<4> [220.073280] Modules linked in: snd_hda_intel snd_hda_codec_hdmi xe drm_gp...
<4> [220.073598] RIP: 0010:intel_power_well_put+0xa9/0xc0 [xe]
<4> [220.073949]  ? intel_power_well_put+0xa9/0xc0 [xe]
<4> [220.074288]  ? intel_power_well_put+0xa9/0xc0 [xe]
<4> [220.074542]  __intel_display_power_put_domain+0xee/0x200 [xe]
<4> [220.074778]  ? intel_audio_component_codec_wake_override+0xaf/0x120 [xe]
...
igt@kms_vblank@ts-continuation-suspend@pipe-c-edp-1
D igt@kms_vblank@ts-continuation-suspend@pipe-c-edp-1
IGT_8300

<4> [236.129233] xe 0000:00:02.0: [drm] drm_WARN_ON(!timeout_expected)
<4> [236.129271] WARNING: CPU: 0 PID: 3145 at drivers/gpu/drm/i915/display/int...
<4> [236.129354] Modules linked in: snd_hda_intel snd_hda_codec_hdmi xe drm_gp...
<4> [236.129874]  intel_power_well_enable+0x5c/0x80 [xe]
<4> [236.129943]  intel_power_well_get+0x28/0x40 [xe]
<4> [236.130012]  __intel_display_power_get_domain.part.0+0x59/0x90 [xe]
<4> [236.130081]  intel_display_power_get_in_set+0x5f/0xf0 [xe]
<4> [236.130150]  intel_modeset_get_crtc_power_domains+0x1db/0x260 [xe]
<4> [236.130225]  intel_atomic_commit_tail+0x5c9/0x18c0 [xe]
<4> [236.130317]  intel_atomic_commit+0x2e5/0x330 [xe]
<4> [236.130400]  ? intel_atomic_commit+0x2e5/0x330 [xe]
<4> [236.130484]  drm_atomic_commit+0xad/0xf0
<4> [236.130488]  ? __pfx___drm_printfn_info+0x10/0x10
<4> [236.130493]  drm_atomic_helper_set_config+0x82/0xd0 [drm_kms_helper]
<4> [236.130508]  drm_mode_setcrtc+0x40c/0xa70
<4> [236.130524]  ? __pfx_drm_mode_setcrtc+0x10/0x10
<4> [236.130527]  drm_ioctl_kernel+0xb2/0x120
...
igt@intel_sysfs_debugfs@xe-debugfs-read-all-entries
D igt@intel_sysfs_debugfs@xe-debugfs-read-all-entries
xe-2896-f0fd77956987f035c79d08c812343a27a655a57b

<3> [244.057050] xe 0000:00:02.0: [drm] *ERROR* GT1: Force wake domain 15 fail...
<4> [244.058120] xe 0000:00:02.0: [drm] GT1: Forcewake domain 0x8000 failed to...
<4> [244.058243] Modules linked in: vgem snd_hda_codec_hdmi xe drm_gpuvm drm_g...
igt@kms_cursor_legacy@cursor-vs-flip-atomic
igt@kms_cursor_legacy@cursor-vs-flip-atomic
xe-2897-883e4daea46ff15b470f138ee61573513243210d

<6> [442.725235] Console: switching to colour dummy device 80x25
<6> [442.725499] [IGT] kms_cursor_legacy: executing
<7> [442.731326] xe 0000:00:02.0: [drm:drm_helper_probe_single_connector_modes...
<7> [442.731343] xe 0000:00:02.0: [drm:intel_dp_detect [xe]] [CONNECTOR:198:DP...
<7> [442.731500] xe 0000:00:02.0: [drm:intel_tc_port_reset_mode [xe]] Port D/T...
<7> [442.731605] xe 0000:00:02.0: [drm:drm_helper_probe_single_connector_modes...
<7> [442.731859] xe 0000:00:02.0: [drm:drm_helper_probe_single_connector_modes...
<7> [442.731867] xe 0000:00:02.0: [drm:intel_dp_detect [xe]] [CONNECTOR:210:DP...
<7> [442.731977] xe 0000:00:02.0: [drm:intel_tc_port_reset_mode [xe]] Port E/T...
<7> [442.732056] xe 0000:00:02.0: [drm:drm_helper_probe_single_connector_modes...
<7> [442.732270] xe 0000:00:02.0: [drm:drm_helper_probe_single_connector_modes...
<7> [442.732277] xe 0000:00:02.0: [drm:intel_dp_detect [xe]] [CONNECTOR:218:DP...
<7> [442.732379] xe 0000:00:02.0: [drm:intel_tc_port_reset_mode [xe]] Port F/T...
<7> [442.732472] xe 0000:00:02.0: [drm:drm_helper_probe_single_connector_modes...
<7> [442.732764] xe 0000:00:02.0: [drm:drm_helper_probe_single_connector_modes...
<7> [442.732770] xe 0000:00:02.0: [drm:intel_dp_detect [xe]] [CONNECTOR:189:eD...
<7> [442.733459] xe 0000:00:02.0: [drm:intel_dp_read_dsc_dpcd [xe]] DSC DPCD: ...
...
igt@kms_pm_dc@dc5-dpms
igt@kms_pm_dc@dc5-dpms
xe-2900-135e2838ed7d44d880e7e19971b1234e6ae04ded

Starting subtest: dc5-dpms
(kms_pm_dc:5924) CRITICAL: Test assertion failure function check_dc_counter, f...
(kms_pm_dc:5924) CRITICAL: Failed assertion: dc_state_wait_entry(data->debugfs...
(kms_pm_dc:5924) CRITICAL: DC5 state is not achieved
i915_power_domain_info:
Runtime power status: enabled
Power well/domain         Use count
always-on                 0
  DISPLAY_CORE            0
  PIPE_A                  0
  PIPE_B                  0
  PIPE_C                  0
  PIPE_D                  0
  PIPE_PANEL_FITTER_A     0
  PIPE_PANEL_FITTER_B     0
  PIPE_PANEL_FITTER_C     0
  PIPE_PANEL_FITTER_D     0
...
igt@kms_pm_dc@dc5-dpms
xe-2898-6deef7a0418bc26082804287b18c8db1e0810686

Starting subtest: dc5-dpms
(kms_pm_dc:2767) CRITICAL: Test assertion failure function check_dc_counter, f...
(kms_pm_dc:2767) CRITICAL: Failed assertion: dc_state_wait_entry(data->debugfs...
(kms_pm_dc:2767) CRITICAL: DC5 state is not achieved
i915_power_domain_info:
Runtime power status: enabled
Power well/domain         Use count
always-on                 0
  DISPLAY_CORE            0
  PIPE_A                  0
  PIPE_B                  0
  PIPE_C                  0
  PIPE_D                  0
  PIPE_PANEL_FITTER_A     0
  PIPE_PANEL_FITTER_B     0
  PIPE_PANEL_FITTER_C     0
  PIPE_PANEL_FITTER_D     0
...
igt@kms_pm_dc@dc5-psr
igt@kms_pm_dc@dc5-psr
xe-2896-f0fd77956987f035c79d08c812343a27a655a57b

Starting subtest: dc5-psr
(kms_pm_dc:3704) CRITICAL: Test assertion failure function check_dc_counter, f...
(kms_pm_dc:3704) CRITICAL: Failed assertion: dc_state_wait_entry(data->debugfs...
(kms_pm_dc:3704) CRITICAL: DC5 state is not achieved
i915_power_domain_info:
Runtime power status: enabled
Power well/domain         Use count
always-on                 4
  DISPLAY_CORE            0
  PIPE_A                  1
  PIPE_B                  0
  PIPE_C                  0
  PIPE_D                  0
  PIPE_PANEL_FITTER_A     0
  PIPE_PANEL_FITTER_B     0
  PIPE_PANEL_FITTER_C     0
  PIPE_PANEL_FITTER_D     0
...
igt@kms_flip_scaled_crc@flip-32bpp-xtile-to-64bpp-xtile-upscaling
igt@kms_flip_scaled_crc@flip-32bpp-xtile-to-64bpp-xtile-upscaling
xe-2900-135e2838ed7d44d880e7e19971b1234e6ae04ded

Starting subtest: flip-32bpp-xtile-to-64bpp-xtile-upscaling
Starting dynamic subtest: pipe-A-default-mode
(kms_flip_scaled_crc:2162) igt_pipe_crc-CRITICAL: Test assertion failure funct...
(kms_flip_scaled_crc:2162) igt_pipe_crc-CRITICAL: Failed assertion: !mismatch ...
Dynamic subtest pipe-A-default-mode failed.
**** DEBUG ****
    populating plane data: C.0, fb 0
(kms_flip_scaled_crc:2162) igt_kms-DEBUG: plane C.0: Setting property "SRC_X" ...
(kms_flip_scaled_crc:2162) igt_kms-DEBUG: plane C.0: Setting property "SRC_Y" ...
(kms_flip_scaled_crc:2162) igt_kms-DEBUG: plane C.0: Setting property "SRC_W" ...
(kms_flip_scaled_crc:2162) igt_kms-DEBUG: plane C.0: Setting property "SRC_H" ...
(kms_flip_scaled_crc:2162) igt_kms-DEBUG: plane C.0: Setting property "CRTC_X"...
(kms_flip_scaled_crc:2162) igt_kms-DEBUG: plane C.0: Setting property "CRTC_Y"...
(kms_flip_scaled_crc:2162) igt_kms-DEBUG: plane C.0: Setting property "CRTC_W"...
(kms_flip_scaled_crc:2162) igt_kms-DEBUG: plane C.0: Setting property "CRTC_H"...
(kms_flip_scaled_crc:2162) igt_kms-DEBUG: plane C.0: Setting property "FB_ID" ...
(kms_flip_scaled_crc:2162) igt_kms-DEBUG: plane C.0: Setting property "CRTC_ID...
...
igt@kms_flip_scaled_crc@flip-32bpp-xtile-to-64bpp-xtile-upscaling
xe-2897-883e4daea46ff15b470f138ee61573513243210d

Starting subtest: flip-32bpp-xtile-to-64bpp-xtile-upscaling
Starting dynamic subtest: pipe-A-default-mode
(kms_flip_scaled_crc:3171) igt_pipe_crc-CRITICAL: Test assertion failure funct...
(kms_flip_scaled_crc:3171) igt_pipe_crc-CRITICAL: Failed assertion: !mismatch ...
Dynamic subtest pipe-A-default-mode failed.
**** DEBUG ****
    populating plane data: C.0, fb 0
(kms_flip_scaled_crc:3171) igt_kms-DEBUG: plane C.0: Setting property "SRC_X" ...
(kms_flip_scaled_crc:3171) igt_kms-DEBUG: plane C.0: Setting property "SRC_Y" ...
(kms_flip_scaled_crc:3171) igt_kms-DEBUG: plane C.0: Setting property "SRC_W" ...
(kms_flip_scaled_crc:3171) igt_kms-DEBUG: plane C.0: Setting property "SRC_H" ...
(kms_flip_scaled_crc:3171) igt_kms-DEBUG: plane C.0: Setting property "CRTC_X"...
(kms_flip_scaled_crc:3171) igt_kms-DEBUG: plane C.0: Setting property "CRTC_Y"...
(kms_flip_scaled_crc:3171) igt_kms-DEBUG: plane C.0: Setting property "CRTC_W"...
(kms_flip_scaled_crc:3171) igt_kms-DEBUG: plane C.0: Setting property "CRTC_H"...
(kms_flip_scaled_crc:3171) igt_kms-DEBUG: plane C.0: Setting property "FB_ID" ...
(kms_flip_scaled_crc:3171) igt_kms-DEBUG: plane C.0: Setting property "CRTC_ID...
...
igt@kms_flip@bo-too-big-interruptible
T igt@kms_flip@bo-too-big-interruptible
xe-2900-135e2838ed7d44d880e7e19971b1234e6ae04ded

<6> [330.905508] Console: switching to colour dummy device 80x25
<6> [330.905801] [IGT] kms_flip: executing
<7> [330.911942] xe 0000:00:02.0: [drm:drm_helper_probe_single_connector_modes...
<7> [330.911958] xe 0000:00:02.0: [drm:intel_dp_detect [xe]] [CONNECTOR:198:DP...
<7> [330.912088] xe 0000:00:02.0: [drm:drm_helper_probe_single_connector_modes...
<7> [330.912304] xe 0000:00:02.0: [drm:drm_helper_probe_single_connector_modes...
<7> [330.912310] xe 0000:00:02.0: [drm:intel_dp_detect [xe]] [CONNECTOR:210:DP...
<7> [330.912412] xe 0000:00:02.0: [drm:drm_helper_probe_single_connector_modes...
<7> [330.912631] xe 0000:00:02.0: [drm:drm_helper_probe_single_connector_modes...
<7> [330.912639] xe 0000:00:02.0: [drm:intel_dp_detect [xe]] [CONNECTOR:218:DP...
<7> [330.912762] xe 0000:00:02.0: [drm:drm_helper_probe_single_connector_modes...
<7> [330.913012] xe 0000:00:02.0: [drm:drm_helper_probe_single_connector_modes...
<7> [330.913018] xe 0000:00:02.0: [drm:intel_dp_detect [xe]] [CONNECTOR:189:eD...
<7> [330.913711] xe 0000:00:02.0: [drm:intel_dp_read_dsc_dpcd [xe]] DSC DPCD: ...
<7> [330.914223] xe 0000:00:02.0: [drm:intel_dp_print_rates [xe]] source rates...
<7> [330.914315] xe 0000:00:02.0: [drm:intel_dp_print_rates [xe]] sink rates: ...
<7> [330.914404] xe 0000:00:02.0: [drm:intel_dp_print_rates [xe]] common rates...
...
T igt@kms_flip@bo-too-big-interruptible
IGT_8301

<6> [171.200223] Console: switching to colour dummy device 80x25
<6> [171.200307] [IGT] kms_flip: executing
<7> [171.206250] xe 0000:00:02.0: [drm:drm_helper_probe_single_connector_modes...
<7> [171.206271] xe 0000:00:02.0: [drm:intel_dp_detect [xe]] [CONNECTOR:198:DP...
<7> [171.206428] xe 0000:00:02.0: [drm:drm_helper_probe_single_connector_modes...
<7> [171.206739] xe 0000:00:02.0: [drm:drm_helper_probe_single_connector_modes...
<7> [171.206748] xe 0000:00:02.0: [drm:intel_dp_detect [xe]] [CONNECTOR:210:DP...
<7> [171.206881] xe 0000:00:02.0: [drm:drm_helper_probe_single_connector_modes...
<7> [171.207180] xe 0000:00:02.0: [drm:drm_helper_probe_single_connector_modes...
<7> [171.207188] xe 0000:00:02.0: [drm:intel_dp_detect [xe]] [CONNECTOR:218:DP...
<7> [171.207320] xe 0000:00:02.0: [drm:drm_helper_probe_single_connector_modes...
<7> [171.207685] xe 0000:00:02.0: [drm:drm_helper_probe_single_connector_modes...
<7> [171.207695] xe 0000:00:02.0: [drm:intel_dp_detect [xe]] [CONNECTOR:189:eD...
<7> [171.208440] xe 0000:00:02.0: [drm:intel_dp_read_dsc_dpcd [xe]] DSC DPCD: ...
<7> [171.209319] xe 0000:00:02.0: [drm:intel_dp_print_rates [xe]] source rates...
<7> [171.209604] xe 0000:00:02.0: [drm:intel_dp_print_rates [xe]] sink rates: ...
<7> [171.209877] xe 0000:00:02.0: [drm:intel_dp_print_rates [xe]] common rates...
...
T igt@kms_flip@bo-too-big-interruptible
IGT_8300

<6> [199.991640] Console: switching to colour dummy device 80x25
<6> [199.991766] [IGT] kms_flip: executing
<7> [199.997412] xe 0000:00:02.0: [drm:drm_helper_probe_single_connector_modes...
<7> [199.997429] xe 0000:00:02.0: [drm:intel_dp_detect [xe]] [CONNECTOR:198:DP...
<7> [199.997559] xe 0000:00:02.0: [drm:drm_helper_probe_single_connector_modes...
<7> [199.997818] xe 0000:00:02.0: [drm:drm_helper_probe_single_connector_modes...
<7> [199.997828] xe 0000:00:02.0: [drm:intel_dp_detect [xe]] [CONNECTOR:210:DP...
<7> [199.997955] xe 0000:00:02.0: [drm:drm_helper_probe_single_connector_modes...
<7> [199.998182] xe 0000:00:02.0: [drm:drm_helper_probe_single_connector_modes...
<7> [199.998188] xe 0000:00:02.0: [drm:intel_dp_detect [xe]] [CONNECTOR:218:DP...
<7> [199.998287] xe 0000:00:02.0: [drm:drm_helper_probe_single_connector_modes...
<7> [199.998531] xe 0000:00:02.0: [drm:drm_helper_probe_single_connector_modes...
<7> [199.998537] xe 0000:00:02.0: [drm:intel_dp_detect [xe]] [CONNECTOR:189:eD...
<7> [199.999238] xe 0000:00:02.0: [drm:intel_dp_read_dsc_dpcd [xe]] DSC DPCD: ...
<7> [199.999765] xe 0000:00:02.0: [drm:intel_dp_print_rates [xe]] source rates...
<7> [199.999989] xe 0000:00:02.0: [drm:intel_dp_print_rates [xe]] sink rates: ...
<7> [200.000194] xe 0000:00:02.0: [drm:intel_dp_print_rates [xe]] common rates...
...
igt@kms_pm_dc@dc6-psr
igt@kms_pm_dc@dc6-psr
xe-2900-135e2838ed7d44d880e7e19971b1234e6ae04ded

Starting subtest: dc6-psr
(kms_pm_dc:2370) CRITICAL: Test assertion failure function test_pkgc_state_psr...
(kms_pm_dc:2370) CRITICAL: Failed assertion: cur_value > prev_value
(kms_pm_dc:2370) CRITICAL: PKGC10 is not achieved.
Subtest dc6-psr failed.
**** DEBUG ****
(kms_pm_dc:2370) igt_kms-DEBUG: display:     SetProp plane C.1 "pixel blend mo...
(kms_pm_dc:2370) igt_kms-DEBUG: display:     SetProp plane C.1 "alpha" to 0xff...
(kms_pm_dc:2370) igt_kms-DEBUG: display:     SetProp plane C.1 "FB_DAMAGE_CLIP...
(kms_pm_dc:2370) igt_kms-DEBUG: display:     SetProp plane C.1 "SCALING_FILTER...
(kms_pm_dc:2370) igt_kms-DEBUG: Test requirement passed: plane_idx >= 0 && pla...
(kms_pm_dc:2370) igt_kms-DEBUG: display:     Fixing up initial rotation pipe C...
(kms_pm_dc:2370) igt_kms-DEBUG: display:     SetPlane pipe C, plane 2, disabling
(kms_pm_dc:2370) igt_kms-DEBUG: display:     SetProp plane C.2 "rotation" to 0...
(kms_pm_dc:2370) igt_kms-DEBUG: display:     SetProp plane C.2 "COLOR_ENCODING...
(kms_pm_dc:2370) igt_kms-DEBUG: display:     SetProp plane C.2 "COLOR_RANGE" t...
(kms_pm_dc:2370) igt_kms-DEBUG: display:     SetProp plane C.2 "pixel blend mo...
...
igt@kms_pm_dc@dc6-psr
IGT_8301

Starting subtest: dc6-psr
(kms_pm_dc:2054) CRITICAL: Test assertion failure function test_pkgc_state_psr...
(kms_pm_dc:2054) CRITICAL: Failed assertion: cur_value > prev_value
(kms_pm_dc:2054) CRITICAL: PKGC10 is not achieved.
Subtest dc6-psr failed.
**** DEBUG ****
    SetProp plane C.1 "pixel blend mode" to 0x0/0
(kms_pm_dc:2054) igt_kms-DEBUG: display:     SetProp plane C.1 "alpha" to 0xff...
(kms_pm_dc:2054) igt_kms-DEBUG: display:     SetProp plane C.1 "FB_DAMAGE_CLIP...
(kms_pm_dc:2054) igt_kms-DEBUG: display:     SetProp plane C.1 "SCALING_FILTER...
(kms_pm_dc:2054) igt_kms-DEBUG: Test requirement passed: plane_idx >= 0 && pla...
(kms_pm_dc:2054) igt_kms-DEBUG: display:     Fixing up initial rotation pipe C...
(kms_pm_dc:2054) igt_kms-DEBUG: display:     SetPlane pipe C, plane 2, disabling
(kms_pm_dc:2054) igt_kms-DEBUG: display:     SetProp plane C.2 "rotation" to 0...
(kms_pm_dc:2054) igt_kms-DEBUG: display:     SetProp plane C.2 "COLOR_ENCODING...
(kms_pm_dc:2054) igt_kms-DEBUG: display:     SetProp plane C.2 "COLOR_RANGE" t...
(kms_pm_dc:2054) igt_kms-DEBUG: display:     SetProp plane C.2 "pixel blend mo...
...
igt@kms_pm_dc@dc6-psr
IGT_8300

Starting subtest: dc6-psr
(kms_pm_dc:2751) CRITICAL: Test assertion failure function test_pkgc_state_psr...
(kms_pm_dc:2751) CRITICAL: Failed assertion: cur_value > prev_value
(kms_pm_dc:2751) CRITICAL: PKGC10 is not achieved.
Subtest dc6-psr failed.
**** DEBUG ****
(kms_pm_dc:2751) igt_kms-DEBUG: display:     SetProp plane C.1 "pixel blend mo...
(kms_pm_dc:2751) igt_kms-DEBUG: display:     SetProp plane C.1 "alpha" to 0xff...
(kms_pm_dc:2751) igt_kms-DEBUG: display:     SetProp plane C.1 "FB_DAMAGE_CLIP...
(kms_pm_dc:2751) igt_kms-DEBUG: display:     SetProp plane C.1 "SCALING_FILTER...
(kms_pm_dc:2751) igt_kms-DEBUG: Test requirement passed: plane_idx >= 0 && pla...
(kms_pm_dc:2751) igt_kms-DEBUG: display:     Fixing up initial rotation pipe C...
(kms_pm_dc:2751) igt_kms-DEBUG: display:     SetPlane pipe C, plane 2, disabling
(kms_pm_dc:2751) igt_kms-DEBUG: display:     SetProp plane C.2 "rotation" to 0...
(kms_pm_dc:2751) igt_kms-DEBUG: display:     SetProp plane C.2 "COLOR_ENCODING...
(kms_pm_dc:2751) igt_kms-DEBUG: display:     SetProp plane C.2 "COLOR_RANGE" t...
(kms_pm_dc:2751) igt_kms-DEBUG: display:     SetProp plane C.2 "pixel blend mo...
...
igt@kms_plane@pixel-format-source-clamping
igt@kms_plane@pixel-format-source-clamping
xe-2900-135e2838ed7d44d880e7e19971b1234e6ae04ded

<6> [119.399526] Console: switching to colour dummy device 80x25
<6> [119.399611] [IGT] kms_plane: executing
<7> [119.404298] xe 0000:00:02.0: [drm:drm_helper_probe_single_connector_modes...
<7> [119.404313] xe 0000:00:02.0: [drm:intel_dp_detect [xe]] [CONNECTOR:198:DP...
<7> [119.404443] xe 0000:00:02.0: [drm:drm_helper_probe_single_connector_modes...
<7> [119.404684] xe 0000:00:02.0: [drm:drm_helper_probe_single_connector_modes...
<7> [119.404692] xe 0000:00:02.0: [drm:intel_dp_detect [xe]] [CONNECTOR:210:DP...
<7> [119.404825] xe 0000:00:02.0: [drm:drm_helper_probe_single_connector_modes...
<7> [119.405070] xe 0000:00:02.0: [drm:drm_helper_probe_single_connector_modes...
<7> [119.405077] xe 0000:00:02.0: [drm:intel_dp_detect [xe]] [CONNECTOR:218:DP...
<7> [119.405178] xe 0000:00:02.0: [drm:drm_helper_probe_single_connector_modes...
<7> [119.405425] xe 0000:00:02.0: [drm:drm_helper_probe_single_connector_modes...
<7> [119.405431] xe 0000:00:02.0: [drm:intel_dp_detect [xe]] [CONNECTOR:189:eD...
<7> [119.406132] xe 0000:00:02.0: [drm:intel_dp_read_dsc_dpcd [xe]] DSC DPCD: ...
<7> [119.406637] xe 0000:00:02.0: [drm:intel_dp_print_rates [xe]] source rates...
<7> [119.406751] xe 0000:00:02.0: [drm:intel_dp_print_rates [xe]] sink rates: ...
<7> [119.406854] xe 0000:00:02.0: [drm:intel_dp_print_rates [xe]] common rates...
...
igt@kms_plane@pixel-format-source-clamping@pipe-a-plane-0
igt@kms_plane@pixel-format-source-clamping@pipe-a-plane-0
xe-2900-135e2838ed7d44d880e7e19971b1234e6ae04ded

Starting subtest: pixel-format-source-clamping
Starting dynamic subtest: pipe-A-plane-0
(kms_plane:2507) WARNING: Warning on condition crc_mismatch_count in function ...
(kms_plane:2507) WARNING: CRC mismatches with format XR4H(0x48345258) on A.0 w...
(kms_plane:2507) WARNING: Warning on condition crc_mismatch_count in function ...
(kms_plane:2507) WARNING: CRC mismatches with format XV36(0x36335658) on A.0 w...
(kms_plane:2507) WARNING: Warning on condition crc_mismatch_count in function ...
(kms_plane:2507) WARNING: CRC mismatches with format XV36(0x36335658) on A.0 w...
(kms_plane:2507) WARNING: Warning on condition crc_mismatch_count in function ...
(kms_plane:2507) WARNING: CRC mismatches with format XV36(0x36335658) on A.0 w...
(kms_plane:2507) WARNING: Warning on condition crc_mismatch_count in function ...
(kms_plane:2507) WARNING: CRC mismatches with format XV36(0x36335658) on A.0 w...
(kms_plane:2507) WARNING: Warning on condition crc_mismatch_count in function ...
(kms_plane:2507) WARNING: CRC mismatches with format XV36(0x36335658) on A.0 w...
(kms_plane:2507) WARNING: Warning on condition crc_mismatch_count in function ...
(kms_plane:2507) WARNING: CRC mismatches with format XV36(0x36335658) on A.0 w...
Dynamic subtest pipe-A-plane-0: SUCCESS (7.249s)
...
igt@kms_universal_plane@cursor-fb-leak
igt@kms_universal_plane@cursor-fb-leak
xe-2900-135e2838ed7d44d880e7e19971b1234e6ae04ded

Starting subtest: cursor-fb-leak
Starting dynamic subtest: pipe-A-eDP-1
Dynamic subtest pipe-A-eDP-1: SUCCESS (0.301s)
Starting dynamic subtest: pipe-B-eDP-1
Dynamic subtest pipe-B-eDP-1: SUCCESS (1.482s)
Starting dynamic subtest: pipe-C-eDP-1
(kms_universal_plane:3185) CRITICAL: Test assertion failure function cursor_le...
(kms_universal_plane:3185) CRITICAL: Failed assertion: count1 == count2
(kms_universal_plane:3185) CRITICAL: Last errno: 9, Bad file descriptor
(kms_universal_plane:3185) CRITICAL: error: 1 != 2
Dynamic subtest pipe-C-eDP-1 failed.
**** DEBUG ****
(kms_universal_plane:3185) igt_kms-DEBUG: display: C.5: plane_set_size (64x64)
(kms_universal_plane:3185) igt_kms-DEBUG: display: C.5: fb_set_position(0,0)
(kms_universal_plane:3185) igt_kms-DEBUG: display: C.5: fb_set_size(64x64)
(kms_universal_plane:3185) igt_kms-DEBUG: display: commit {
(kms_universal_plane:3185) igt_kms-DEBUG: Test requirement passed: plane_idx >...
...
igt@kms_universal_plane@cursor-fb-leak
IGT_8299

Starting subtest: cursor-fb-leak
Starting dynamic subtest: pipe-A-eDP-1
(kms_universal_plane:3782) CRITICAL: Test assertion failure function cursor_le...
(kms_universal_plane:3782) CRITICAL: Failed assertion: count1 == count2
(kms_universal_plane:3782) CRITICAL: Last errno: 9, Bad file descriptor
(kms_universal_plane:3782) CRITICAL: error: 1 != 2
Dynamic subtest pipe-A-eDP-1 failed.
**** DEBUG ****
(kms_universal_plane:3782) igt_kms-DEBUG: display: A.5: plane_set_size (64x64)
(kms_universal_plane:3782) igt_kms-DEBUG: display: A.5: fb_set_position(0,0)
(kms_universal_plane:3782) igt_kms-DEBUG: display: A.5: fb_set_size(64x64)
(kms_universal_plane:3782) igt_kms-DEBUG: display: commit {
(kms_universal_plane:3782) igt_kms-DEBUG: Test requirement passed: plane_idx >...
(kms_universal_plane:3782) igt_kms-DEBUG: Test requirement passed: plane_idx >...
(kms_universal_plane:3782) igt_kms-DEBUG: Test requirement passed: plane_idx >...
(kms_universal_plane:3782) igt_kms-DEBUG: Test requirement passed: plane_idx >...
(kms_universal_plane:3782) igt_kms-DEBUG: Test requirement passed: plane_idx >...
...
igt@kms_flip@flip-vs-blocking-wf-vblank
igt@kms_flip@flip-vs-blocking-wf-vblank
xe-2900-135e2838ed7d44d880e7e19971b1234e6ae04ded

Starting subtest: flip-vs-blocking-wf-vblank
Starting dynamic subtest: A-eDP1
(kms_flip:3343) CRITICAL: Test assertion failure function __run_test_on_crtc_s...
(kms_flip:3343) CRITICAL: Failed assertion: !retried && needs_retry_after_link...
Dynamic subtest A-eDP1 failed.
**** DEBUG ****
(kms_flip:3343) igt_fb-DEBUG: igt_create_fb_with_bo_size(width=2880, height=18...
(kms_flip:3343) igt_fb-DEBUG: igt_create_fb_with_bo_size(handle=1, pitch=11520)
(kms_flip:3343) ioctl_wrappers-DEBUG: Test requirement passed: igt_has_fb_modi...
(kms_flip:3343) igt_fb-DEBUG: igt_create_fb_with_bo_size(width=2880, height=18...
(kms_flip:3343) igt_fb-DEBUG: igt_create_fb_with_bo_size(handle=2, pitch=11520)
(kms_flip:3343) ioctl_wrappers-DEBUG: Test requirement passed: igt_has_fb_modi...
(kms_flip:3343) igt_fb-DEBUG: Test requirement passed: cairo_surface_status(fb...
(kms_flip:3343) igt_fb-DEBUG: Test requirement passed: cairo_surface_status(fb...
(kms_flip:3343) igt_kms-INFO:   2880x1800: 60 347710 2880 2928 2960 3040 1800 ...
(kms_flip:3343) DEBUG: No stale events found
(kms_flip:3343) i915/intel_drrs-DEBUG: Manually disabling DRRS. 0
...
igt@kms_flip_scaled_crc@flip-32bpp-xtile-to-64bpp-xtile-upscaling@pipe-a-default-mode
igt@kms_flip_scaled_crc@flip-32bpp-xtile-to-64bpp-xtile-upscaling@pipe-a-default-mode
xe-2900-135e2838ed7d44d880e7e19971b1234e6ae04ded

Starting subtest: flip-32bpp-xtile-to-64bpp-xtile-upscaling
Starting dynamic subtest: pipe-A-default-mode
(kms_flip_scaled_crc:2162) igt_pipe_crc-CRITICAL: Test assertion failure funct...
(kms_flip_scaled_crc:2162) igt_pipe_crc-CRITICAL: Failed assertion: !mismatch ...
Dynamic subtest pipe-A-default-mode failed.
**** DEBUG ****
    populating plane data: C.0, fb 0
(kms_flip_scaled_crc:2162) igt_kms-DEBUG: plane C.0: Setting property "SRC_X" ...
(kms_flip_scaled_crc:2162) igt_kms-DEBUG: plane C.0: Setting property "SRC_Y" ...
(kms_flip_scaled_crc:2162) igt_kms-DEBUG: plane C.0: Setting property "SRC_W" ...
(kms_flip_scaled_crc:2162) igt_kms-DEBUG: plane C.0: Setting property "SRC_H" ...
(kms_flip_scaled_crc:2162) igt_kms-DEBUG: plane C.0: Setting property "CRTC_X"...
(kms_flip_scaled_crc:2162) igt_kms-DEBUG: plane C.0: Setting property "CRTC_Y"...
(kms_flip_scaled_crc:2162) igt_kms-DEBUG: plane C.0: Setting property "CRTC_W"...
(kms_flip_scaled_crc:2162) igt_kms-DEBUG: plane C.0: Setting property "CRTC_H"...
(kms_flip_scaled_crc:2162) igt_kms-DEBUG: plane C.0: Setting property "FB_ID" ...
(kms_flip_scaled_crc:2162) igt_kms-DEBUG: plane C.0: Setting property "CRTC_ID...
...
igt@kms_flip_scaled_crc@flip-32bpp-xtile-to-64bpp-xtile-upscaling@pipe-a-default-mode
xe-2897-883e4daea46ff15b470f138ee61573513243210d

Starting subtest: flip-32bpp-xtile-to-64bpp-xtile-upscaling
Starting dynamic subtest: pipe-A-default-mode
(kms_flip_scaled_crc:3171) igt_pipe_crc-CRITICAL: Test assertion failure funct...
(kms_flip_scaled_crc:3171) igt_pipe_crc-CRITICAL: Failed assertion: !mismatch ...
Dynamic subtest pipe-A-default-mode failed.
**** DEBUG ****
    populating plane data: C.0, fb 0
(kms_flip_scaled_crc:3171) igt_kms-DEBUG: plane C.0: Setting property "SRC_X" ...
(kms_flip_scaled_crc:3171) igt_kms-DEBUG: plane C.0: Setting property "SRC_Y" ...
(kms_flip_scaled_crc:3171) igt_kms-DEBUG: plane C.0: Setting property "SRC_W" ...
(kms_flip_scaled_crc:3171) igt_kms-DEBUG: plane C.0: Setting property "SRC_H" ...
(kms_flip_scaled_crc:3171) igt_kms-DEBUG: plane C.0: Setting property "CRTC_X"...
(kms_flip_scaled_crc:3171) igt_kms-DEBUG: plane C.0: Setting property "CRTC_Y"...
(kms_flip_scaled_crc:3171) igt_kms-DEBUG: plane C.0: Setting property "CRTC_W"...
(kms_flip_scaled_crc:3171) igt_kms-DEBUG: plane C.0: Setting property "CRTC_H"...
(kms_flip_scaled_crc:3171) igt_kms-DEBUG: plane C.0: Setting property "FB_ID" ...
(kms_flip_scaled_crc:3171) igt_kms-DEBUG: plane C.0: Setting property "CRTC_ID...
...
igt@kms_universal_plane@cursor-fb-leak@pipe-a-edp-1
igt@kms_universal_plane@cursor-fb-leak@pipe-a-edp-1
IGT_8299

Starting subtest: cursor-fb-leak
Starting dynamic subtest: pipe-A-eDP-1
(kms_universal_plane:3782) CRITICAL: Test assertion failure function cursor_le...
(kms_universal_plane:3782) CRITICAL: Failed assertion: count1 == count2
(kms_universal_plane:3782) CRITICAL: Last errno: 9, Bad file descriptor
(kms_universal_plane:3782) CRITICAL: error: 1 != 2
Dynamic subtest pipe-A-eDP-1 failed.
**** DEBUG ****
(kms_universal_plane:3782) igt_kms-DEBUG: display: A.5: plane_set_size (64x64)
(kms_universal_plane:3782) igt_kms-DEBUG: display: A.5: fb_set_position(0,0)
(kms_universal_plane:3782) igt_kms-DEBUG: display: A.5: fb_set_size(64x64)
(kms_universal_plane:3782) igt_kms-DEBUG: display: commit {
(kms_universal_plane:3782) igt_kms-DEBUG: Test requirement passed: plane_idx >...
(kms_universal_plane:3782) igt_kms-DEBUG: Test requirement passed: plane_idx >...
(kms_universal_plane:3782) igt_kms-DEBUG: Test requirement passed: plane_idx >...
(kms_universal_plane:3782) igt_kms-DEBUG: Test requirement passed: plane_idx >...
(kms_universal_plane:3782) igt_kms-DEBUG: Test requirement passed: plane_idx >...
...
igt@kms_universal_plane@cursor-fb-leak@pipe-b-edp-1
igt@kms_universal_plane@cursor-fb-leak@pipe-b-edp-1
IGT_8299

Starting dynamic subtest: pipe-B-eDP-1
(kms_universal_plane:3782) CRITICAL: Test assertion failure function cursor_le...
(kms_universal_plane:3782) CRITICAL: Failed assertion: count1 == count2
(kms_universal_plane:3782) CRITICAL: Last errno: 9, Bad file descriptor
(kms_universal_plane:3782) CRITICAL: error: 1 != 2
Dynamic subtest pipe-B-eDP-1 failed.
**** DEBUG ****
(kms_universal_plane:3782) igt_kms-DEBUG: display: B.5: plane_set_size (64x64)
(kms_universal_plane:3782) igt_kms-DEBUG: display: B.5: fb_set_position(0,0)
(kms_universal_plane:3782) igt_kms-DEBUG: display: B.5: fb_set_size(64x64)
(kms_universal_plane:3782) igt_kms-DEBUG: display: commit {
(kms_universal_plane:3782) igt_kms-DEBUG: Test requirement passed: plane_idx >...
(kms_universal_plane:3782) igt_kms-DEBUG: Test requirement passed: plane_idx >...
(kms_universal_plane:3782) igt_kms-DEBUG: Test requirement passed: plane_idx >...
(kms_universal_plane:3782) igt_kms-DEBUG: Test requirement passed: plane_idx >...
(kms_universal_plane:3782) igt_kms-DEBUG: Test requirement passed: plane_idx >...
(kms_universal_plane:3782) igt_kms-DEBUG: Test requirement passed: plane_idx >...
...
igt@kms_universal_plane@cursor-fb-leak@pipe-c-edp-1
igt@kms_universal_plane@cursor-fb-leak@pipe-c-edp-1
xe-2900-135e2838ed7d44d880e7e19971b1234e6ae04ded

Starting dynamic subtest: pipe-C-eDP-1
(kms_universal_plane:3185) CRITICAL: Test assertion failure function cursor_le...
(kms_universal_plane:3185) CRITICAL: Failed assertion: count1 == count2
(kms_universal_plane:3185) CRITICAL: Last errno: 9, Bad file descriptor
(kms_universal_plane:3185) CRITICAL: error: 1 != 2
Dynamic subtest pipe-C-eDP-1 failed.
**** DEBUG ****
(kms_universal_plane:3185) igt_kms-DEBUG: display: C.5: plane_set_size (64x64)
(kms_universal_plane:3185) igt_kms-DEBUG: display: C.5: fb_set_position(0,0)
(kms_universal_plane:3185) igt_kms-DEBUG: display: C.5: fb_set_size(64x64)
(kms_universal_plane:3185) igt_kms-DEBUG: display: commit {
(kms_universal_plane:3185) igt_kms-DEBUG: Test requirement passed: plane_idx >...
(kms_universal_plane:3185) igt_kms-DEBUG: Test requirement passed: plane_idx >...
(kms_universal_plane:3185) igt_kms-DEBUG: Test requirement passed: plane_idx >...
(kms_universal_plane:3185) igt_kms-DEBUG: Test requirement passed: plane_idx >...
(kms_universal_plane:3185) igt_kms-DEBUG: Test requirement passed: plane_idx >...
(kms_universal_plane:3185) igt_kms-DEBUG: Test requirement passed: plane_idx >...
...
igt@kms_flip@flip-vs-blocking-wf-vblank@a-edp1
igt@kms_flip@flip-vs-blocking-wf-vblank@a-edp1
xe-2900-135e2838ed7d44d880e7e19971b1234e6ae04ded

Starting subtest: flip-vs-blocking-wf-vblank
Starting dynamic subtest: A-eDP1
(kms_flip:3343) CRITICAL: Test assertion failure function __run_test_on_crtc_s...
(kms_flip:3343) CRITICAL: Failed assertion: !retried && needs_retry_after_link...
Dynamic subtest A-eDP1 failed.
**** DEBUG ****
(kms_flip:3343) igt_fb-DEBUG: igt_create_fb_with_bo_size(width=2880, height=18...
(kms_flip:3343) igt_fb-DEBUG: igt_create_fb_with_bo_size(handle=1, pitch=11520)
(kms_flip:3343) ioctl_wrappers-DEBUG: Test requirement passed: igt_has_fb_modi...
(kms_flip:3343) igt_fb-DEBUG: igt_create_fb_with_bo_size(width=2880, height=18...
(kms_flip:3343) igt_fb-DEBUG: igt_create_fb_with_bo_size(handle=2, pitch=11520)
(kms_flip:3343) ioctl_wrappers-DEBUG: Test requirement passed: igt_has_fb_modi...
(kms_flip:3343) igt_fb-DEBUG: Test requirement passed: cairo_surface_status(fb...
(kms_flip:3343) igt_fb-DEBUG: Test requirement passed: cairo_surface_status(fb...
(kms_flip:3343) igt_kms-INFO:   2880x1800: 60 347710 2880 2928 2960 3040 1800 ...
(kms_flip:3343) DEBUG: No stale events found
(kms_flip:3343) i915/intel_drrs-DEBUG: Manually disabling DRRS. 0
...
igt@kms_flip@flip-vs-blocking-wf-vblank@b-edp1
igt@kms_flip@flip-vs-blocking-wf-vblank@b-edp1
xe-2900-135e2838ed7d44d880e7e19971b1234e6ae04ded

Starting dynamic subtest: B-eDP1
(kms_flip:3343) CRITICAL: Test assertion failure function __run_test_on_crtc_s...
(kms_flip:3343) CRITICAL: Failed assertion: !retried && needs_retry_after_link...
Dynamic subtest B-eDP1 failed.
**** DEBUG ****
(kms_flip:3343) igt_fb-DEBUG: igt_create_fb_with_bo_size(width=2880, height=18...
(kms_flip:3343) igt_fb-DEBUG: igt_create_fb_with_bo_size(handle=3, pitch=11520)
(kms_flip:3343) ioctl_wrappers-DEBUG: Test requirement passed: igt_has_fb_modi...
(kms_flip:3343) igt_fb-DEBUG: igt_create_fb_with_bo_size(width=2880, height=18...
(kms_flip:3343) igt_fb-DEBUG: igt_create_fb_with_bo_size(handle=4, pitch=11520)
(kms_flip:3343) ioctl_wrappers-DEBUG: Test requirement passed: igt_has_fb_modi...
(kms_flip:3343) igt_fb-DEBUG: Test requirement passed: cairo_surface_status(fb...
(kms_flip:3343) igt_fb-DEBUG: Test requirement passed: cairo_surface_status(fb...
(kms_flip:3343) igt_kms-INFO:   2880x1800: 60 347710 2880 2928 2960 3040 1800 ...
(kms_flip:3343) DEBUG: No stale events found
(kms_flip:3343) i915/intel_drrs-DEBUG: Manually disabling DRRS. 0
(kms_flip:3343) i915/intel_drrs-DEBUG: Test requirement passed: dir >= 0
...
igt@kms_flip@bo-too-big-interruptible@a-edp1
T igt@kms_flip@bo-too-big-interruptible@a-edp1
xe-2900-135e2838ed7d44d880e7e19971b1234e6ae04ded

<6> [330.905508] Console: switching to colour dummy device 80x25
<6> [330.905801] [IGT] kms_flip: executing
<7> [330.911942] xe 0000:00:02.0: [drm:drm_helper_probe_single_connector_modes...
<7> [330.911958] xe 0000:00:02.0: [drm:intel_dp_detect [xe]] [CONNECTOR:198:DP...
<7> [330.912088] xe 0000:00:02.0: [drm:drm_helper_probe_single_connector_modes...
<7> [330.912304] xe 0000:00:02.0: [drm:drm_helper_probe_single_connector_modes...
<7> [330.912310] xe 0000:00:02.0: [drm:intel_dp_detect [xe]] [CONNECTOR:210:DP...
<7> [330.912412] xe 0000:00:02.0: [drm:drm_helper_probe_single_connector_modes...
<7> [330.912631] xe 0000:00:02.0: [drm:drm_helper_probe_single_connector_modes...
<7> [330.912639] xe 0000:00:02.0: [drm:intel_dp_detect [xe]] [CONNECTOR:218:DP...
<7> [330.912762] xe 0000:00:02.0: [drm:drm_helper_probe_single_connector_modes...
<7> [330.913012] xe 0000:00:02.0: [drm:drm_helper_probe_single_connector_modes...
<7> [330.913018] xe 0000:00:02.0: [drm:intel_dp_detect [xe]] [CONNECTOR:189:eD...
<7> [330.913711] xe 0000:00:02.0: [drm:intel_dp_read_dsc_dpcd [xe]] DSC DPCD: ...
<7> [330.914223] xe 0000:00:02.0: [drm:intel_dp_print_rates [xe]] source rates...
<7> [330.914315] xe 0000:00:02.0: [drm:intel_dp_print_rates [xe]] sink rates: ...
<7> [330.914404] xe 0000:00:02.0: [drm:intel_dp_print_rates [xe]] common rates...
...
T igt@kms_flip@bo-too-big-interruptible@a-edp1
IGT_8301

<6> [171.200223] Console: switching to colour dummy device 80x25
<6> [171.200307] [IGT] kms_flip: executing
<7> [171.206250] xe 0000:00:02.0: [drm:drm_helper_probe_single_connector_modes...
<7> [171.206271] xe 0000:00:02.0: [drm:intel_dp_detect [xe]] [CONNECTOR:198:DP...
<7> [171.206428] xe 0000:00:02.0: [drm:drm_helper_probe_single_connector_modes...
<7> [171.206739] xe 0000:00:02.0: [drm:drm_helper_probe_single_connector_modes...
<7> [171.206748] xe 0000:00:02.0: [drm:intel_dp_detect [xe]] [CONNECTOR:210:DP...
<7> [171.206881] xe 0000:00:02.0: [drm:drm_helper_probe_single_connector_modes...
<7> [171.207180] xe 0000:00:02.0: [drm:drm_helper_probe_single_connector_modes...
<7> [171.207188] xe 0000:00:02.0: [drm:intel_dp_detect [xe]] [CONNECTOR:218:DP...
<7> [171.207320] xe 0000:00:02.0: [drm:drm_helper_probe_single_connector_modes...
<7> [171.207685] xe 0000:00:02.0: [drm:drm_helper_probe_single_connector_modes...
<7> [171.207695] xe 0000:00:02.0: [drm:intel_dp_detect [xe]] [CONNECTOR:189:eD...
<7> [171.208440] xe 0000:00:02.0: [drm:intel_dp_read_dsc_dpcd [xe]] DSC DPCD: ...
<7> [171.209319] xe 0000:00:02.0: [drm:intel_dp_print_rates [xe]] source rates...
<7> [171.209604] xe 0000:00:02.0: [drm:intel_dp_print_rates [xe]] sink rates: ...
<7> [171.209877] xe 0000:00:02.0: [drm:intel_dp_print_rates [xe]] common rates...
...
T igt@kms_flip@bo-too-big-interruptible@a-edp1
IGT_8300

<6> [199.991640] Console: switching to colour dummy device 80x25
<6> [199.991766] [IGT] kms_flip: executing
<7> [199.997412] xe 0000:00:02.0: [drm:drm_helper_probe_single_connector_modes...
<7> [199.997429] xe 0000:00:02.0: [drm:intel_dp_detect [xe]] [CONNECTOR:198:DP...
<7> [199.997559] xe 0000:00:02.0: [drm:drm_helper_probe_single_connector_modes...
<7> [199.997818] xe 0000:00:02.0: [drm:drm_helper_probe_single_connector_modes...
<7> [199.997828] xe 0000:00:02.0: [drm:intel_dp_detect [xe]] [CONNECTOR:210:DP...
<7> [199.997955] xe 0000:00:02.0: [drm:drm_helper_probe_single_connector_modes...
<7> [199.998182] xe 0000:00:02.0: [drm:drm_helper_probe_single_connector_modes...
<7> [199.998188] xe 0000:00:02.0: [drm:intel_dp_detect [xe]] [CONNECTOR:218:DP...
<7> [199.998287] xe 0000:00:02.0: [drm:drm_helper_probe_single_connector_modes...
<7> [199.998531] xe 0000:00:02.0: [drm:drm_helper_probe_single_connector_modes...
<7> [199.998537] xe 0000:00:02.0: [drm:intel_dp_detect [xe]] [CONNECTOR:189:eD...
<7> [199.999238] xe 0000:00:02.0: [drm:intel_dp_read_dsc_dpcd [xe]] DSC DPCD: ...
<7> [199.999765] xe 0000:00:02.0: [drm:intel_dp_print_rates [xe]] source rates...
<7> [199.999989] xe 0000:00:02.0: [drm:intel_dp_print_rates [xe]] sink rates: ...
<7> [200.000194] xe 0000:00:02.0: [drm:intel_dp_print_rates [xe]] common rates...
...
igt@kms_flip_scaled_crc@flip-64bpp-xtile-to-32bpp-xtile-upscaling@pipe-a-default-mode
igt@kms_flip_scaled_crc@flip-64bpp-xtile-to-32bpp-xtile-upscaling@pipe-a-default-mode
IGT_8302

Starting subtest: flip-64bpp-xtile-to-32bpp-xtile-upscaling
Starting dynamic subtest: pipe-A-default-mode
(kms_flip_scaled_crc:2517) igt_pipe_crc-CRITICAL: Test assertion failure funct...
(kms_flip_scaled_crc:2517) igt_pipe_crc-CRITICAL: Failed assertion: !mismatch ...
Dynamic subtest pipe-A-default-mode failed.
**** DEBUG ****
    populating plane data: C.0, fb 0
(kms_flip_scaled_crc:2517) igt_kms-DEBUG: plane C.0: Setting property "SRC_X" ...
(kms_flip_scaled_crc:2517) igt_kms-DEBUG: plane C.0: Setting property "SRC_Y" ...
(kms_flip_scaled_crc:2517) igt_kms-DEBUG: plane C.0: Setting property "SRC_W" ...
(kms_flip_scaled_crc:2517) igt_kms-DEBUG: plane C.0: Setting property "SRC_H" ...
(kms_flip_scaled_crc:2517) igt_kms-DEBUG: plane C.0: Setting property "CRTC_X"...
(kms_flip_scaled_crc:2517) igt_kms-DEBUG: plane C.0: Setting property "CRTC_Y"...
(kms_flip_scaled_crc:2517) igt_kms-DEBUG: plane C.0: Setting property "CRTC_W"...
(kms_flip_scaled_crc:2517) igt_kms-DEBUG: plane C.0: Setting property "CRTC_H"...
(kms_flip_scaled_crc:2517) igt_kms-DEBUG: plane C.0: Setting property "FB_ID" ...
(kms_flip_scaled_crc:2517) igt_kms-DEBUG: plane C.0: Setting property "CRTC_ID...
...
igt@kms_flip_scaled_crc@flip-64bpp-xtile-to-32bpp-xtile-upscaling@pipe-a-default-mode
xe-2899-8f917568adaeea8b649e337e7d0e03bd03332253

Starting subtest: flip-64bpp-xtile-to-32bpp-xtile-upscaling
Starting dynamic subtest: pipe-A-default-mode
(kms_flip_scaled_crc:8243) igt_pipe_crc-CRITICAL: Test assertion failure funct...
(kms_flip_scaled_crc:8243) igt_pipe_crc-CRITICAL: Failed assertion: !mismatch ...
Dynamic subtest pipe-A-default-mode failed.
**** DEBUG ****
    populating plane data: C.0, fb 0
(kms_flip_scaled_crc:8243) igt_kms-DEBUG: plane C.0: Setting property "SRC_X" ...
(kms_flip_scaled_crc:8243) igt_kms-DEBUG: plane C.0: Setting property "SRC_Y" ...
(kms_flip_scaled_crc:8243) igt_kms-DEBUG: plane C.0: Setting property "SRC_W" ...
(kms_flip_scaled_crc:8243) igt_kms-DEBUG: plane C.0: Setting property "SRC_H" ...
(kms_flip_scaled_crc:8243) igt_kms-DEBUG: plane C.0: Setting property "CRTC_X"...
(kms_flip_scaled_crc:8243) igt_kms-DEBUG: plane C.0: Setting property "CRTC_Y"...
(kms_flip_scaled_crc:8243) igt_kms-DEBUG: plane C.0: Setting property "CRTC_W"...
(kms_flip_scaled_crc:8243) igt_kms-DEBUG: plane C.0: Setting property "CRTC_H"...
(kms_flip_scaled_crc:8243) igt_kms-DEBUG: plane C.0: Setting property "FB_ID" ...
(kms_flip_scaled_crc:8243) igt_kms-DEBUG: plane C.0: Setting property "CRTC_ID...
...
igt@kms_flip_scaled_crc@flip-64bpp-xtile-to-32bpp-xtile-upscaling@pipe-a-default-mode
xe-2898-6deef7a0418bc26082804287b18c8db1e0810686

Starting subtest: flip-64bpp-xtile-to-32bpp-xtile-upscaling
Starting dynamic subtest: pipe-A-default-mode
(kms_flip_scaled_crc:8122) igt_pipe_crc-CRITICAL: Test assertion failure funct...
(kms_flip_scaled_crc:8122) igt_pipe_crc-CRITICAL: Failed assertion: !mismatch ...
Dynamic subtest pipe-A-default-mode failed.
**** DEBUG ****
    populating plane data: C.0, fb 0
(kms_flip_scaled_crc:8122) igt_kms-DEBUG: plane C.0: Setting property "SRC_X" ...
(kms_flip_scaled_crc:8122) igt_kms-DEBUG: plane C.0: Setting property "SRC_Y" ...
(kms_flip_scaled_crc:8122) igt_kms-DEBUG: plane C.0: Setting property "SRC_W" ...
(kms_flip_scaled_crc:8122) igt_kms-DEBUG: plane C.0: Setting property "SRC_H" ...
(kms_flip_scaled_crc:8122) igt_kms-DEBUG: plane C.0: Setting property "CRTC_X"...
(kms_flip_scaled_crc:8122) igt_kms-DEBUG: plane C.0: Setting property "CRTC_Y"...
(kms_flip_scaled_crc:8122) igt_kms-DEBUG: plane C.0: Setting property "CRTC_W"...
(kms_flip_scaled_crc:8122) igt_kms-DEBUG: plane C.0: Setting property "CRTC_H"...
(kms_flip_scaled_crc:8122) igt_kms-DEBUG: plane C.0: Setting property "FB_ID" ...
(kms_flip_scaled_crc:8122) igt_kms-DEBUG: plane C.0: Setting property "CRTC_ID...
...
igt@kms_flip_scaled_crc@flip-64bpp-xtile-to-32bpp-xtile-upscaling@pipe-a-default-mode
IGT_8301

Starting subtest: flip-64bpp-xtile-to-32bpp-xtile-upscaling
Starting dynamic subtest: pipe-A-default-mode
(kms_flip_scaled_crc:8145) igt_pipe_crc-CRITICAL: Test assertion failure funct...
(kms_flip_scaled_crc:8145) igt_pipe_crc-CRITICAL: Failed assertion: !mismatch ...
Dynamic subtest pipe-A-default-mode failed.
**** DEBUG ****
    populating plane data: C.0, fb 0
(kms_flip_scaled_crc:8145) igt_kms-DEBUG: plane C.0: Setting property "SRC_X" ...
(kms_flip_scaled_crc:8145) igt_kms-DEBUG: plane C.0: Setting property "SRC_Y" ...
(kms_flip_scaled_crc:8145) igt_kms-DEBUG: plane C.0: Setting property "SRC_W" ...
(kms_flip_scaled_crc:8145) igt_kms-DEBUG: plane C.0: Setting property "SRC_H" ...
(kms_flip_scaled_crc:8145) igt_kms-DEBUG: plane C.0: Setting property "CRTC_X"...
(kms_flip_scaled_crc:8145) igt_kms-DEBUG: plane C.0: Setting property "CRTC_Y"...
(kms_flip_scaled_crc:8145) igt_kms-DEBUG: plane C.0: Setting property "CRTC_W"...
(kms_flip_scaled_crc:8145) igt_kms-DEBUG: plane C.0: Setting property "CRTC_H"...
(kms_flip_scaled_crc:8145) igt_kms-DEBUG: plane C.0: Setting property "FB_ID" ...
(kms_flip_scaled_crc:8145) igt_kms-DEBUG: plane C.0: Setting property "CRTC_ID...
...
igt@kms_flip_scaled_crc@flip-64bpp-xtile-to-32bpp-xtile-upscaling@pipe-a-default-mode
IGT_8300

Starting subtest: flip-64bpp-xtile-to-32bpp-xtile-upscaling
Starting dynamic subtest: pipe-A-default-mode
(kms_flip_scaled_crc:3880) igt_pipe_crc-CRITICAL: Test assertion failure funct...
(kms_flip_scaled_crc:3880) igt_pipe_crc-CRITICAL: Failed assertion: !mismatch ...
Dynamic subtest pipe-A-default-mode failed.
**** DEBUG ****
    populating plane data: C.0, fb 0
(kms_flip_scaled_crc:3880) igt_kms-DEBUG: plane C.0: Setting property "SRC_X" ...
(kms_flip_scaled_crc:3880) igt_kms-DEBUG: plane C.0: Setting property "SRC_Y" ...
(kms_flip_scaled_crc:3880) igt_kms-DEBUG: plane C.0: Setting property "SRC_W" ...
(kms_flip_scaled_crc:3880) igt_kms-DEBUG: plane C.0: Setting property "SRC_H" ...
(kms_flip_scaled_crc:3880) igt_kms-DEBUG: plane C.0: Setting property "CRTC_X"...
(kms_flip_scaled_crc:3880) igt_kms-DEBUG: plane C.0: Setting property "CRTC_Y"...
(kms_flip_scaled_crc:3880) igt_kms-DEBUG: plane C.0: Setting property "CRTC_W"...
(kms_flip_scaled_crc:3880) igt_kms-DEBUG: plane C.0: Setting property "CRTC_H"...
(kms_flip_scaled_crc:3880) igt_kms-DEBUG: plane C.0: Setting property "FB_ID" ...
(kms_flip_scaled_crc:3880) igt_kms-DEBUG: plane C.0: Setting property "CRTC_ID...
...
igt@kms_flip@flip-vs-expired-vblank
igt@kms_flip@flip-vs-expired-vblank
xe-2899-8f917568adaeea8b649e337e7d0e03bd03332253

Starting subtest: flip-vs-expired-vblank
Starting dynamic subtest: A-eDP1
(kms_flip:2054) CRITICAL: Test assertion failure function run_test_step, file ...
(kms_flip:2054) CRITICAL: Failed assertion: end - start < 500
Dynamic subtest A-eDP1 failed.
**** DEBUG ****
(kms_flip:2054) igt_fb-DEBUG: igt_create_fb_with_bo_size(width=2880, height=18...
(kms_flip:2054) igt_fb-DEBUG: igt_create_fb_with_bo_size(handle=1, pitch=11520)
(kms_flip:2054) ioctl_wrappers-DEBUG: Test requirement passed: igt_has_fb_modi...
(kms_flip:2054) igt_fb-DEBUG: igt_create_fb_with_bo_size(width=2880, height=18...
(kms_flip:2054) igt_fb-DEBUG: igt_create_fb_with_bo_size(handle=2, pitch=11520)
(kms_flip:2054) ioctl_wrappers-DEBUG: Test requirement passed: igt_has_fb_modi...
(kms_flip:2054) igt_fb-DEBUG: Test requirement passed: cairo_surface_status(fb...
(kms_flip:2054) igt_fb-DEBUG: Test requirement passed: cairo_surface_status(fb...
(kms_flip:2054) igt_kms-INFO:   2880x1800: 60 347710 2880 2928 2960 3040 1800 ...
(kms_flip:2054) DEBUG: No stale events found
(kms_flip:2054) i915/intel_drrs-DEBUG: Manually disabling DRRS. 0
...
igt@kms_flip@flip-vs-expired-vblank@a-edp1
igt@kms_flip@flip-vs-expired-vblank@a-edp1
xe-2899-8f917568adaeea8b649e337e7d0e03bd03332253

Starting subtest: flip-vs-expired-vblank
Starting dynamic subtest: A-eDP1
(kms_flip:2054) CRITICAL: Test assertion failure function run_test_step, file ...
(kms_flip:2054) CRITICAL: Failed assertion: end - start < 500
Dynamic subtest A-eDP1 failed.
**** DEBUG ****
(kms_flip:2054) igt_fb-DEBUG: igt_create_fb_with_bo_size(width=2880, height=18...
(kms_flip:2054) igt_fb-DEBUG: igt_create_fb_with_bo_size(handle=1, pitch=11520)
(kms_flip:2054) ioctl_wrappers-DEBUG: Test requirement passed: igt_has_fb_modi...
(kms_flip:2054) igt_fb-DEBUG: igt_create_fb_with_bo_size(width=2880, height=18...
(kms_flip:2054) igt_fb-DEBUG: igt_create_fb_with_bo_size(handle=2, pitch=11520)
(kms_flip:2054) ioctl_wrappers-DEBUG: Test requirement passed: igt_has_fb_modi...
(kms_flip:2054) igt_fb-DEBUG: Test requirement passed: cairo_surface_status(fb...
(kms_flip:2054) igt_fb-DEBUG: Test requirement passed: cairo_surface_status(fb...
(kms_flip:2054) igt_kms-INFO:   2880x1800: 60 347710 2880 2928 2960 3040 1800 ...
(kms_flip:2054) DEBUG: No stale events found
(kms_flip:2054) i915/intel_drrs-DEBUG: Manually disabling DRRS. 0
...
igt@kms_dirtyfb@default-dirtyfb-ioctl@a-edp-1
D igt@kms_dirtyfb@default-dirtyfb-ioctl@a-edp-1
IGT_8299

<3> [126.720960] xe 0000:00:02.0: [drm] *ERROR* failed to submit GSC PXP messa...
<3> [126.721693] xe 0000:00:02.0: [drm] *ERROR* Failed to invalidate PXP strea...
<3> [126.721746] xe 0000:00:02.0: [drm] *ERROR* PXP termination failed: -ETIME
<3> [126.721960] xe 0000:00:02.0: [drm] *ERROR* PXP termination complete while...
<3> [128.043954] xe 0000:00:02.0: [drm] *ERROR* GT1: TLB invalidation fence ti...
<3> [130.404003] xe 0000:00:02.0: [drm] *ERROR* GT1: TLB invalidation fence ti...
<3> [132.750372] xe 0000:00:02.0: [drm] *ERROR* GT1: TLB invalidation fence ti...
<3> [132.750438] xe 0000:00:02.0: [drm] *ERROR* GT1: TLB invalidation fence ti...
<3> [135.086024] xe 0000:00:02.0: [drm] *ERROR* GT1: TLB invalidation fence ti...
<3> [135.086058] xe 0000:00:02.0: [drm] *ERROR* GT1: TLB invalidation fence ti...
<4> [136.379925] xe 0000:00:02.0: [drm] GT1: Schedule disable failed to respon...
<3> [136.430414] xe 0000:00:02.0: [drm] *ERROR* GT1: Force wake domain 3 faile...
<3> [136.480996] xe 0000:00:02.0: [drm] *ERROR* GT1: Force wake domain 11 fail...
<3> [136.531000] xe 0000:00:02.0: [drm] *ERROR* GT1: Force wake domain 15 fail...
<4> [136.531024] xe 0000:00:02.0: [drm] GT1: Forcewake domains 0x8808 failed t...
<4> [136.531100] Modules linked in: snd_hda_codec_hdmi xe drm_gpuvm drm_gpusvm...
<3> [136.531727] xe 0000:00:02.0: [drm] *ERROR* GT1: reset failed (-ETIMEDOUT)
...
igt@kms_flip@flip-vs-expired-vblank-interruptible@a-edp1
igt@kms_flip@flip-vs-expired-vblank-interruptible@a-edp1
xe-2900-135e2838ed7d44d880e7e19971b1234e6ae04ded

Starting subtest: flip-vs-expired-vblank-interruptible
Starting dynamic subtest: A-eDP1
(kms_flip:3466) CRITICAL: Test assertion failure function run_test_step, file ...
(kms_flip:3466) CRITICAL: Failed assertion: end - start < 500
(kms_flip:3466) CRITICAL: Last errno: 4, Interrupted system call
Dynamic subtest A-eDP1 failed.
**** DEBUG ****
(kms_flip:3466) DEBUG: Vblank took 36us
(kms_flip:3466) DEBUG: name = flip
last_ts = 231.469604
last_received_ts = 231.468796
last_seq = 344
current_ts = 231.486282
current_received_ts = 231.485458
current_seq = 345
count = 240
seq_step = 1
...
igt@kms_flip@flip-vs-expired-vblank-interruptible@b-edp1
igt@kms_flip@flip-vs-expired-vblank-interruptible@b-edp1
xe-2900-135e2838ed7d44d880e7e19971b1234e6ae04ded

Starting dynamic subtest: B-eDP1
(kms_flip:3466) CRITICAL: Test assertion failure function run_test_step, file ...
(kms_flip:3466) CRITICAL: Failed assertion: end - start < 500
(kms_flip:3466) CRITICAL: Last errno: 4, Interrupted system call
Dynamic subtest B-eDP1 failed.
**** DEBUG ****
(kms_flip:3466) DEBUG: Vblank took 245us
(kms_flip:3466) DEBUG: name = flip
last_ts = 242.304367
last_received_ts = 242.303726
last_seq = 459
current_ts = 242.321045
current_received_ts = 242.320374
current_seq = 460
count = 453
seq_step = 1
(kms_flip:3466) DEBUG: Vblank took 108us
...
igt@kms_vrr@cmrr@pipe-a-edp-1
igt@kms_vrr@cmrr@pipe-a-edp-1
xe-2901-71dac8dae6cc024b633bd6e584f4195c44c0dbc7

Starting subtest: cmrr
Starting dynamic subtest: pipe-A-eDP-1
(kms_vrr:3776) CRITICAL: Test assertion failure function test_cmrr, file ../te...
(kms_vrr:3776) CRITICAL: Failed assertion: result > 75
(kms_vrr:3776) CRITICAL: Refresh rate (60 Hz) 16666666ns: Target CMRR on thres...
Dynamic subtest pipe-A-eDP-1 failed.
**** DEBUG ****
(kms_vrr:3776) igt_kms-DEBUG: plane A.0: Setting property "CRTC_H" to 0x708/1800
(kms_vrr:3776) igt_kms-DEBUG: plane A.0: Setting property "FB_ID" to 0xe1/225
(kms_vrr:3776) igt_kms-DEBUG: plane A.0: Setting property "CRTC_ID" to 0x52/82
(kms_vrr:3776) igt_kms-DEBUG: plane A.0: Setting property "COLOR_ENCODING" to ...
(kms_vrr:3776) igt_kms-DEBUG: plane A.0: Setting property "COLOR_RANGE" to 0x0/0
(kms_vrr:3776) igt_kms-DEBUG: display: }
(kms_vrr:3776) DEBUG: event_ns - last_event_ns: 33343000 ns (29.99 Hz)
(kms_vrr:3776) igt_kms-DEBUG: display: A.0: plane_set_fb(228)
(kms_vrr:3776) igt_kms-DEBUG: display: A.0: plane_set_size (2880x1800)
(kms_vrr:3776) igt_kms-DEBUG: display: A.0: fb_set_position(0,0)
...
igt@kms_vrr@cmrr@pipe-a-edp-1
xe-2900-135e2838ed7d44d880e7e19971b1234e6ae04ded

Starting subtest: cmrr
Starting dynamic subtest: pipe-A-eDP-1
(kms_vrr:3749) CRITICAL: Test assertion failure function test_cmrr, file ../te...
(kms_vrr:3749) CRITICAL: Failed assertion: result > 75
(kms_vrr:3749) CRITICAL: Refresh rate (60 Hz) 16666666ns: Target CMRR on thres...
Dynamic subtest pipe-A-eDP-1 failed.
**** DEBUG ****
(kms_vrr:3749) igt_kms-DEBUG: plane A.0: Setting property "CRTC_H" to 0x708/1800
(kms_vrr:3749) igt_kms-DEBUG: plane A.0: Setting property "FB_ID" to 0xe1/225
(kms_vrr:3749) igt_kms-DEBUG: plane A.0: Setting property "CRTC_ID" to 0x52/82
(kms_vrr:3749) igt_kms-DEBUG: plane A.0: Setting property "COLOR_ENCODING" to ...
(kms_vrr:3749) igt_kms-DEBUG: plane A.0: Setting property "COLOR_RANGE" to 0x0/0
(kms_vrr:3749) igt_kms-DEBUG: display: }
(kms_vrr:3749) DEBUG: event_ns - last_event_ns: 33349000 ns (29.99 Hz)
(kms_vrr:3749) igt_kms-DEBUG: display: A.0: plane_set_fb(228)
(kms_vrr:3749) igt_kms-DEBUG: display: A.0: plane_set_size (2880x1800)
(kms_vrr:3749) igt_kms-DEBUG: display: A.0: fb_set_position(0,0)
...
igt@kms_vrr@cmrr@pipe-a-edp-1
IGT_8301

<6> [412.439011] Console: switching to colour dummy device 80x25
<6> [412.439288] [IGT] kms_vrr: executing
<7> [412.443980] xe 0000:00:02.0: [drm:drm_helper_probe_single_connector_modes...
<7> [412.443996] xe 0000:00:02.0: [drm:intel_dp_detect [xe]] [CONNECTOR:198:DP...
<7> [412.444123] xe 0000:00:02.0: [drm:intel_tc_port_reset_mode [xe]] Port D/T...
<7> [412.444206] xe 0000:00:02.0: [drm:drm_helper_probe_single_connector_modes...
<7> [412.445975] xe 0000:00:02.0: [drm:drm_helper_probe_single_connector_modes...
<7> [412.445985] xe 0000:00:02.0: [drm:intel_dp_detect [xe]] [CONNECTOR:210:DP...
<7> [412.446092] xe 0000:00:02.0: [drm:intel_tc_port_reset_mode [xe]] Port E/T...
<7> [412.446172] xe 0000:00:02.0: [drm:drm_helper_probe_single_connector_modes...
<7> [412.446409] xe 0000:00:02.0: [drm:drm_helper_probe_single_connector_modes...
<7> [412.446416] xe 0000:00:02.0: [drm:intel_dp_detect [xe]] [CONNECTOR:218:DP...
<7> [412.446515] xe 0000:00:02.0: [drm:intel_tc_port_reset_mode [xe]] Port F/T...
<7> [412.446590] xe 0000:00:02.0: [drm:drm_helper_probe_single_connector_modes...
<7> [412.446840] xe 0000:00:02.0: [drm:drm_helper_probe_single_connector_modes...
<7> [412.446847] xe 0000:00:02.0: [drm:intel_dp_detect [xe]] [CONNECTOR:189:eD...
<7> [412.447534] xe 0000:00:02.0: [drm:intel_dp_read_dsc_dpcd [xe]] DSC DPCD: ...
...
igt@kms_vrr@cmrr@pipe-a-edp-1
xe-2897-883e4daea46ff15b470f138ee61573513243210d

Starting subtest: cmrr
Starting dynamic subtest: pipe-A-eDP-1
(kms_vrr:4403) CRITICAL: Test assertion failure function test_cmrr, file ../te...
(kms_vrr:4403) CRITICAL: Failed assertion: result > 75
(kms_vrr:4403) CRITICAL: Refresh rate (60 Hz) 16666666ns: Target CMRR on thres...
Dynamic subtest pipe-A-eDP-1 failed.
**** DEBUG ****
(kms_vrr:4403) igt_kms-DEBUG: plane A.0: Setting property "CRTC_H" to 0x708/1800
(kms_vrr:4403) igt_kms-DEBUG: plane A.0: Setting property "FB_ID" to 0xe1/225
(kms_vrr:4403) igt_kms-DEBUG: plane A.0: Setting property "CRTC_ID" to 0x52/82
(kms_vrr:4403) igt_kms-DEBUG: plane A.0: Setting property "COLOR_ENCODING" to ...
(kms_vrr:4403) igt_kms-DEBUG: plane A.0: Setting property "COLOR_RANGE" to 0x0/0
(kms_vrr:4403) igt_kms-DEBUG: display: }
(kms_vrr:4403) DEBUG: event_ns - last_event_ns: 33328000 ns (30.00 Hz)
(kms_vrr:4403) igt_kms-DEBUG: display: A.0: plane_set_fb(228)
(kms_vrr:4403) igt_kms-DEBUG: display: A.0: plane_set_size (2880x1800)
(kms_vrr:4403) igt_kms-DEBUG: display: A.0: fb_set_position(0,0)
...
Created at 2025-04-03 17:27:47