FAIL WARN PASS SKIP TIMEOUT NOT RUN INCOMPLETE ABORT CRASH
 
xe-2825-a958e31a81b3267201c85b6f171419586afa792c
igt@xe_pm@s2idle-vm-bind-userptr
igt@xe_pm@s2idle-vm-bind-userptr
xe-2825-a958e31a81b3267201c85b6f171419586afa792c

<6> [125.713714] [IGT] xe_pm: executing
<7> [125.758061] xe 0000:aa:00.0: [drm:xe_gt_resume [xe]] GT0: resuming
<7> [125.758916] xe 0000:aa:00.0: [drm:xe_reg_sr_apply_mmio [xe]] GT0: Applyin...
<7> [125.759343] xe 0000:aa:00.0: [drm:xe_reg_sr_apply_mmio [xe]] GT0: REG[0x9...
<7> [125.759772] xe 0000:aa:00.0: [drm:xe_reg_sr_apply_mmio [xe]] GT0: REG[0xb...
<7> [125.760154] xe 0000:aa:00.0: [drm:xe_reg_sr_apply_mmio [xe]] GT0: REG[0xc...
<7> [125.760379] xe 0000:aa:00.0: [drm:xe_reg_sr_apply_mmio [xe]] GT0: REG[0xc...
<7> [125.760526] xe 0000:aa:00.0: [drm:xe_reg_sr_apply_mmio [xe]] GT0: REG[0xc...
<7> [125.760675] xe 0000:aa:00.0: [drm:xe_reg_sr_apply_mmio [xe]] GT0: REG[0xc...
<7> [125.760813] xe 0000:aa:00.0: [drm:xe_wopcm_init [xe]] WOPCM: 4096K
<7> [125.760986] xe 0000:aa:00.0: [drm:xe_wopcm_init [xe]] GuC WOPCM is alread...
<7> [125.762375] xe 0000:aa:00.0: [drm:xe_guc_ads_populate [xe]] GT0: ADS capt...
<7> [125.763518] xe 0000:aa:00.0: [drm:__xe_guc_upload [xe]] GT0: load still i...
<7> [125.763681] xe 0000:aa:00.0: [drm:__xe_guc_upload [xe]] GT0: load still i...
<7> [125.773676] xe 0000:aa:00.0: [drm:__xe_guc_upload [xe]] GT0: init took 10...
<7> [125.774723] xe 0000:aa:00.0: [drm:xe_guc_ct_enable [xe]] GT0: GuC CT comm...
<7> [125.777272] xe 0000:aa:00.0: [drm:xe_mocs_init [xe]] GT0: flag:0x2
...
igt@kms_cursor_edge_walk@128x128-top-bottom
igt@kms_cursor_edge_walk@128x128-top-bottom
xe-2825-a958e31a81b3267201c85b6f171419586afa792c

(kms_cursor_edge_walk:5511) CRITICAL: Test assertion failure function __igt_un...
(kms_cursor_edge_walk:5511) CRITICAL: Failed assertion: ret == 0 || errno == E...
(kms_cursor_edge_walk:5511) CRITICAL: Last errno: 95, Operation not supported
Test kms_cursor_edge_walk failed.
**** DEBUG ****
(kms_cursor_edge_walk:5511) igt_core-DEBUG: Notice: using IGT_DEVICE env:
(kms_cursor_edge_walk:5511) igt_core-DEBUG: [pci:vendor=intel,device=discrete,...
(kms_cursor_edge_walk:5511) igt_core-INFO: Using IGT_SRANDOM=1742091165 for ra...
(kms_cursor_edge_walk:5511) drmtest-DEBUG: Looking for devices to open using f...
(kms_cursor_edge_walk:5511) drmtest-DEBUG: Filter matched /dev/dri/card0 | /de...
(kms_cursor_edge_walk:5511) drmtest-INFO: Opened device: /dev/dri/card0
(kms_cursor_edge_walk:5511) drmtest-DEBUG: Test requirement passed: !(fd<0)
(kms_cursor_edge_walk:5511) CRITICAL: Test assertion failure function __igt_un...
(kms_cursor_edge_walk:5511) CRITICAL: Failed assertion: ret == 0 || errno == E...
(kms_cursor_edge_walk:5511) CRITICAL: Last errno: 95, Operation not supported
(kms_cursor_edge_walk:5511) igt_core-INFO: Stack trace:
(kms_cursor_edge_walk:5511) igt_core-INFO:   #0 ../lib/igt_core.c:2055 __igt_f...
...
igt@xe_pm@s4-d3hot-basic-exec
igt@xe_pm@s4-d3hot-basic-exec
xe-2825-a958e31a81b3267201c85b6f171419586afa792c

<6> [137.222055] [IGT] xe_pm: executing
<7> [138.467190] xe 0000:aa:00.0: [drm:xe_gt_suspend [xe]] GT0: suspending
<7> [138.467793] xe 0000:aa:00.0: [drm:xe_gt_suspend [xe]] GT0: suspended
<7> [146.122033] xe 0000:aa:00.0: [drm:xe_gt_resume [xe]] GT0: resuming
<7> [146.122481] xe 0000:aa:00.0: [drm:xe_reg_sr_apply_mmio [xe]] GT0: Applyin...
<7> [146.122917] xe 0000:aa:00.0: [drm:xe_reg_sr_apply_mmio [xe]] GT0: REG[0x9...
<7> [146.123359] xe 0000:aa:00.0: [drm:xe_reg_sr_apply_mmio [xe]] GT0: REG[0xb...
<7> [146.123597] xe 0000:aa:00.0: [drm:xe_reg_sr_apply_mmio [xe]] GT0: REG[0xc...
<7> [146.123746] xe 0000:aa:00.0: [drm:xe_reg_sr_apply_mmio [xe]] GT0: REG[0xc...
<7> [146.123873] xe 0000:aa:00.0: [drm:xe_reg_sr_apply_mmio [xe]] GT0: REG[0xc...
<7> [146.124006] xe 0000:aa:00.0: [drm:xe_reg_sr_apply_mmio [xe]] GT0: REG[0xc...
<7> [146.124141] xe 0000:aa:00.0: [drm:xe_wopcm_init [xe]] WOPCM: 4096K
<7> [146.124332] xe 0000:aa:00.0: [drm:xe_wopcm_init [xe]] GuC WOPCM is alread...
<7> [146.125605] xe 0000:aa:00.0: [drm:xe_guc_ads_populate [xe]] GT0: ADS capt...
<7> [146.126439] xe 0000:aa:00.0: [drm:__xe_guc_upload [xe]] GT0: load still i...
<7> [146.126574] xe 0000:aa:00.0: [drm:__xe_guc_upload [xe]] GT0: load still i...
<7> [146.136973] xe 0000:aa:00.0: [drm:__xe_guc_upload [xe]] GT0: init took 10...
...
igt@kms_cursor_edge_walk@64x64-right-edge
igt@kms_cursor_edge_walk@64x64-right-edge
xe-2825-a958e31a81b3267201c85b6f171419586afa792c

(kms_cursor_edge_walk:5521) CRITICAL: Test assertion failure function __igt_un...
(kms_cursor_edge_walk:5521) CRITICAL: Failed assertion: ret == 0 || errno == E...
(kms_cursor_edge_walk:5521) CRITICAL: Last errno: 95, Operation not supported
Test kms_cursor_edge_walk failed.
**** DEBUG ****
(kms_cursor_edge_walk:5521) igt_core-DEBUG: Notice: using IGT_DEVICE env:
(kms_cursor_edge_walk:5521) igt_core-DEBUG: [pci:vendor=intel,device=discrete,...
(kms_cursor_edge_walk:5521) igt_core-INFO: Using IGT_SRANDOM=1742091167 for ra...
(kms_cursor_edge_walk:5521) drmtest-DEBUG: Looking for devices to open using f...
(kms_cursor_edge_walk:5521) drmtest-DEBUG: Filter matched /dev/dri/card0 | /de...
(kms_cursor_edge_walk:5521) drmtest-INFO: Opened device: /dev/dri/card0
(kms_cursor_edge_walk:5521) drmtest-DEBUG: Test requirement passed: !(fd<0)
(kms_cursor_edge_walk:5521) CRITICAL: Test assertion failure function __igt_un...
(kms_cursor_edge_walk:5521) CRITICAL: Failed assertion: ret == 0 || errno == E...
(kms_cursor_edge_walk:5521) CRITICAL: Last errno: 95, Operation not supported
(kms_cursor_edge_walk:5521) igt_core-INFO: Stack trace:
(kms_cursor_edge_walk:5521) igt_core-INFO:   #0 ../lib/igt_core.c:2055 __igt_f...
...
igt@xe_wedged@wedged-mode-toggle
D igt@xe_wedged@wedged-mode-toggle
xe-2825-a958e31a81b3267201c85b6f171419586afa792c

<3> [274.099655] xe 0000:aa:00.0: [drm] *ERROR* GT0: GUC ID manager unclean (1...
<4> [274.106024]  drm_managed_release+0x88/0x170
<4> [274.106041]  drm_dev_put.part.0+0x52/0x90
<4> [274.106054]  drm_minor_release+0x17/0x30
<4> [274.106061]  drm_release_noglobal+0x7a/0x90
<4> [274.106617] WARNING: CPU: 173 PID: 6840 at drivers/gpu/drm/drm_buddy.c:34...
<4> [274.106945] RIP: 0010:drm_buddy_fini+0xe6/0x120 [drm_buddy]
<4> [274.107039]  ? drm_buddy_fini+0xe6/0x120 [drm_buddy]
<4> [274.107090]  ? drm_buddy_fini+0xe6/0x120 [drm_buddy]
<4> [274.107099]  ? drm_buddy_fini+0x66/0x120 [drm_buddy]
<4> [274.107331]  drm_managed_release+0x88/0x170
<4> [274.107340]  drm_dev_put.part.0+0x52/0x90
<4> [274.107348]  drm_minor_release+0x17/0x30
<4> [274.107356]  drm_release_noglobal+0x7a/0x90
<4> [274.107646] WARNING: CPU: 173 PID: 6840 at drivers/gpu/drm/drm_buddy.c:34...
<4> [274.107819] RIP: 0010:drm_buddy_fini+0x119/0x120 [drm_buddy]
<4> [274.107870]  ? drm_buddy_fini+0x119/0x120 [drm_buddy]
...
igt@kms_cursor_edge_walk@256x256-left-edge
igt@kms_cursor_edge_walk@256x256-left-edge
xe-2825-a958e31a81b3267201c85b6f171419586afa792c

(kms_cursor_edge_walk:5513) CRITICAL: Test assertion failure function __igt_un...
(kms_cursor_edge_walk:5513) CRITICAL: Failed assertion: ret == 0 || errno == E...
(kms_cursor_edge_walk:5513) CRITICAL: Last errno: 95, Operation not supported
Test kms_cursor_edge_walk failed.
**** DEBUG ****
(kms_cursor_edge_walk:5513) igt_core-DEBUG: Notice: using IGT_DEVICE env:
(kms_cursor_edge_walk:5513) igt_core-DEBUG: [pci:vendor=intel,device=discrete,...
(kms_cursor_edge_walk:5513) igt_core-INFO: Using IGT_SRANDOM=1742091166 for ra...
(kms_cursor_edge_walk:5513) drmtest-DEBUG: Looking for devices to open using f...
(kms_cursor_edge_walk:5513) drmtest-DEBUG: Filter matched /dev/dri/card0 | /de...
(kms_cursor_edge_walk:5513) drmtest-INFO: Opened device: /dev/dri/card0
(kms_cursor_edge_walk:5513) drmtest-DEBUG: Test requirement passed: !(fd<0)
(kms_cursor_edge_walk:5513) CRITICAL: Test assertion failure function __igt_un...
(kms_cursor_edge_walk:5513) CRITICAL: Failed assertion: ret == 0 || errno == E...
(kms_cursor_edge_walk:5513) CRITICAL: Last errno: 95, Operation not supported
(kms_cursor_edge_walk:5513) igt_core-INFO: Stack trace:
(kms_cursor_edge_walk:5513) igt_core-INFO:   #0 ../lib/igt_core.c:2055 __igt_f...
...
igt@xe_pm@s4-vm-bind-userptr
igt@xe_pm@s4-vm-bind-userptr
xe-2825-a958e31a81b3267201c85b6f171419586afa792c

<6> [117.837467] [IGT] xe_pm: executing
<7> [117.882659] xe 0000:aa:00.0: [drm:xe_gt_resume [xe]] GT0: resuming
<7> [117.883070] xe 0000:aa:00.0: [drm:xe_reg_sr_apply_mmio [xe]] GT0: Applyin...
<7> [117.883255] xe 0000:aa:00.0: [drm:xe_reg_sr_apply_mmio [xe]] GT0: REG[0x9...
<7> [117.883435] xe 0000:aa:00.0: [drm:xe_reg_sr_apply_mmio [xe]] GT0: REG[0xb...
<7> [117.883589] xe 0000:aa:00.0: [drm:xe_reg_sr_apply_mmio [xe]] GT0: REG[0xc...
<7> [117.883724] xe 0000:aa:00.0: [drm:xe_reg_sr_apply_mmio [xe]] GT0: REG[0xc...
<7> [117.883858] xe 0000:aa:00.0: [drm:xe_reg_sr_apply_mmio [xe]] GT0: REG[0xc...
<7> [117.883990] xe 0000:aa:00.0: [drm:xe_reg_sr_apply_mmio [xe]] GT0: REG[0xc...
<7> [117.884123] xe 0000:aa:00.0: [drm:xe_wopcm_init [xe]] WOPCM: 4096K
<7> [117.884293] xe 0000:aa:00.0: [drm:xe_wopcm_init [xe]] GuC WOPCM is alread...
<7> [117.885515] xe 0000:aa:00.0: [drm:xe_guc_ads_populate [xe]] GT0: ADS capt...
<7> [117.886652] xe 0000:aa:00.0: [drm:__xe_guc_upload [xe]] GT0: load still i...
<7> [117.886794] xe 0000:aa:00.0: [drm:__xe_guc_upload [xe]] GT0: load still i...
<7> [117.896410] xe 0000:aa:00.0: [drm:__xe_guc_upload [xe]] GT0: init took 9m...
<7> [117.896917] xe 0000:aa:00.0: [drm:xe_guc_ct_enable [xe]] GT0: GuC CT comm...
<7> [117.898794] xe 0000:aa:00.0: [drm:xe_mocs_init [xe]] GT0: flag:0x2
...
igt@xe_pm@s2idle-exec-after
igt@xe_pm@s2idle-exec-after
xe-2825-a958e31a81b3267201c85b6f171419586afa792c

<6> [124.739189] [IGT] xe_pm: executing
<7> [124.782081] xe 0000:aa:00.0: [drm:xe_gt_resume [xe]] GT0: resuming
<7> [124.782509] xe 0000:aa:00.0: [drm:xe_reg_sr_apply_mmio [xe]] GT0: Applyin...
<7> [124.782699] xe 0000:aa:00.0: [drm:xe_reg_sr_apply_mmio [xe]] GT0: REG[0x9...
<7> [124.782870] xe 0000:aa:00.0: [drm:xe_reg_sr_apply_mmio [xe]] GT0: REG[0xb...
<7> [124.783014] xe 0000:aa:00.0: [drm:xe_reg_sr_apply_mmio [xe]] GT0: REG[0xc...
<7> [124.783135] xe 0000:aa:00.0: [drm:xe_reg_sr_apply_mmio [xe]] GT0: REG[0xc...
<7> [124.783252] xe 0000:aa:00.0: [drm:xe_reg_sr_apply_mmio [xe]] GT0: REG[0xc...
<7> [124.783369] xe 0000:aa:00.0: [drm:xe_reg_sr_apply_mmio [xe]] GT0: REG[0xc...
<7> [124.783489] xe 0000:aa:00.0: [drm:xe_wopcm_init [xe]] WOPCM: 4096K
<7> [124.783652] xe 0000:aa:00.0: [drm:xe_wopcm_init [xe]] GuC WOPCM is alread...
<7> [124.784831] xe 0000:aa:00.0: [drm:xe_guc_ads_populate [xe]] GT0: ADS capt...
<7> [124.785990] xe 0000:aa:00.0: [drm:__xe_guc_upload [xe]] GT0: load still i...
<7> [124.786077] xe 0000:aa:00.0: [drm:__xe_guc_upload [xe]] GT0: load still i...
<7> [124.796084] xe 0000:aa:00.0: [drm:__xe_guc_upload [xe]] GT0: init took 10...
<7> [124.796639] xe 0000:aa:00.0: [drm:xe_guc_ct_enable [xe]] GT0: GuC CT comm...
<7> [124.799486] xe 0000:aa:00.0: [drm:xe_mocs_init [xe]] GT0: flag:0x2
...
igt@xe_pm@s2idle-multiple-execs
igt@xe_pm@s2idle-multiple-execs
xe-2825-a958e31a81b3267201c85b6f171419586afa792c

<6> [125.278874] [IGT] xe_pm: executing
<7> [125.320831] xe 0000:aa:00.0: [drm:xe_gt_resume [xe]] GT0: resuming
<7> [125.321463] xe 0000:aa:00.0: [drm:xe_reg_sr_apply_mmio [xe]] GT0: Applyin...
<7> [125.321681] xe 0000:aa:00.0: [drm:xe_reg_sr_apply_mmio [xe]] GT0: REG[0x9...
<7> [125.321841] xe 0000:aa:00.0: [drm:xe_reg_sr_apply_mmio [xe]] GT0: REG[0xb...
<7> [125.321998] xe 0000:aa:00.0: [drm:xe_reg_sr_apply_mmio [xe]] GT0: REG[0xc...
<7> [125.322134] xe 0000:aa:00.0: [drm:xe_reg_sr_apply_mmio [xe]] GT0: REG[0xc...
<7> [125.322269] xe 0000:aa:00.0: [drm:xe_reg_sr_apply_mmio [xe]] GT0: REG[0xc...
<7> [125.322428] xe 0000:aa:00.0: [drm:xe_reg_sr_apply_mmio [xe]] GT0: REG[0xc...
<7> [125.322569] xe 0000:aa:00.0: [drm:xe_wopcm_init [xe]] WOPCM: 4096K
<7> [125.322745] xe 0000:aa:00.0: [drm:xe_wopcm_init [xe]] GuC WOPCM is alread...
<7> [125.324598] xe 0000:aa:00.0: [drm:xe_guc_ads_populate [xe]] GT0: ADS capt...
<7> [125.325547] xe 0000:aa:00.0: [drm:__xe_guc_upload [xe]] GT0: load still i...
<7> [125.325696] xe 0000:aa:00.0: [drm:__xe_guc_upload [xe]] GT0: load still i...
<7> [125.335469] xe 0000:aa:00.0: [drm:__xe_guc_upload [xe]] GT0: init took 9m...
<7> [125.336356] xe 0000:aa:00.0: [drm:xe_guc_ct_enable [xe]] GT0: GuC CT comm...
<7> [125.341637] xe 0000:aa:00.0: [drm:xe_mocs_init [xe]] GT0: flag:0x2
...
igt@kms_plane_cursor@overlay
igt@kms_plane_cursor@overlay
xe-2825-a958e31a81b3267201c85b6f171419586afa792c

(kms_plane_cursor:6673) CRITICAL: Test assertion failure function __igt_unique...
(kms_plane_cursor:6673) CRITICAL: Failed assertion: ret == 0 || errno == EINVAL
(kms_plane_cursor:6673) CRITICAL: Last errno: 95, Operation not supported
Test kms_plane_cursor failed.
**** DEBUG ****
(kms_plane_cursor:6673) igt_core-DEBUG: Notice: using IGT_DEVICE env:
(kms_plane_cursor:6673) igt_core-DEBUG: [pci:vendor=intel,device=discrete,card...
(kms_plane_cursor:6673) igt_core-INFO: Using IGT_SRANDOM=1742091376 for random...
(kms_plane_cursor:6673) drmtest-DEBUG: Looking for devices to open using filte...
(kms_plane_cursor:6673) drmtest-DEBUG: Filter matched /dev/dri/card0 | /dev/dr...
(kms_plane_cursor:6673) drmtest-INFO: Opened device: /dev/dri/card0
(kms_plane_cursor:6673) drmtest-DEBUG: Test requirement passed: !(fd<0)
(kms_plane_cursor:6673) CRITICAL: Test assertion failure function __igt_unique...
(kms_plane_cursor:6673) CRITICAL: Failed assertion: ret == 0 || errno == EINVAL
(kms_plane_cursor:6673) CRITICAL: Last errno: 95, Operation not supported
(kms_plane_cursor:6673) igt_core-INFO: Stack trace:
(kms_plane_cursor:6673) igt_core-INFO:   #0 ../lib/igt_core.c:2055 __igt_fail_...
...
igt@xe_pmu@engine-activity-load-idle
igt@xe_pmu@engine-activity-load-idle
xe-2825-a958e31a81b3267201c85b6f171419586afa792c

Starting subtest: engine-activity-load-idle
Starting dynamic subtest: engine-DRM_XE_ENGINE_CLASS_COPY0
(xe_pmu:4516) CRITICAL: Test assertion failure function get_event_config, file...
(xe_pmu:4516) CRITICAL: Failed assertion: ret >= 0
(xe_pmu:4516) CRITICAL: Last errno: 2, No such file or directory
Dynamic subtest engine-DRM_XE_ENGINE_CLASS_COPY0 failed.
**** DEBUG ****
(xe_pmu:4516) CRITICAL: Test assertion failure function get_event_config, file...
(xe_pmu:4516) CRITICAL: Failed assertion: ret >= 0
(xe_pmu:4516) CRITICAL: Last errno: 2, No such file or directory
(xe_pmu:4516) igt_core-INFO: Stack trace:
(xe_pmu:4516) igt_core-INFO:   #0 ../lib/igt_core.c:2055 __igt_fail_assert()
(xe_pmu:4516) igt_core-INFO:   #1 ../tests/intel/xe_pmu.c:126 get_event_config()
(xe_pmu:4516) igt_core-INFO:   #2 ../tests/intel/xe_pmu.c:148 engine_activity()
(xe_pmu:4516) igt_core-INFO:   #3 ../tests/intel/xe_pmu.c:250 __igt_unique____...
(xe_pmu:4516) igt_core-INFO:   #4 ../tests/intel/xe_pmu.c:229 main()
(xe_pmu:4516) igt_core-INFO:   #5 [__libc_init_first+0x8a]
...
igt@xe_pmu@engine-activity-load-idle@engine-drm_xe_engine_class_copy0
igt@xe_pmu@engine-activity-load-idle@engine-drm_xe_engine_class_copy0
xe-2825-a958e31a81b3267201c85b6f171419586afa792c

Starting subtest: engine-activity-load-idle
Starting dynamic subtest: engine-DRM_XE_ENGINE_CLASS_COPY0
(xe_pmu:4516) CRITICAL: Test assertion failure function get_event_config, file...
(xe_pmu:4516) CRITICAL: Failed assertion: ret >= 0
(xe_pmu:4516) CRITICAL: Last errno: 2, No such file or directory
Dynamic subtest engine-DRM_XE_ENGINE_CLASS_COPY0 failed.
**** DEBUG ****
(xe_pmu:4516) CRITICAL: Test assertion failure function get_event_config, file...
(xe_pmu:4516) CRITICAL: Failed assertion: ret >= 0
(xe_pmu:4516) CRITICAL: Last errno: 2, No such file or directory
(xe_pmu:4516) igt_core-INFO: Stack trace:
(xe_pmu:4516) igt_core-INFO:   #0 ../lib/igt_core.c:2055 __igt_fail_assert()
(xe_pmu:4516) igt_core-INFO:   #1 ../tests/intel/xe_pmu.c:126 get_event_config()
(xe_pmu:4516) igt_core-INFO:   #2 ../tests/intel/xe_pmu.c:148 engine_activity()
(xe_pmu:4516) igt_core-INFO:   #3 ../tests/intel/xe_pmu.c:250 __igt_unique____...
(xe_pmu:4516) igt_core-INFO:   #4 ../tests/intel/xe_pmu.c:229 main()
(xe_pmu:4516) igt_core-INFO:   #5 [__libc_init_first+0x8a]
...
igt@xe_pmu@engine-activity-load-idle@engine-drm_xe_engine_class_compute0
igt@xe_pmu@engine-activity-load-idle@engine-drm_xe_engine_class_compute0
xe-2825-a958e31a81b3267201c85b6f171419586afa792c

Starting dynamic subtest: engine-DRM_XE_ENGINE_CLASS_COMPUTE0
(xe_pmu:4516) CRITICAL: Test assertion failure function get_event_config, file...
(xe_pmu:4516) CRITICAL: Failed assertion: ret >= 0
(xe_pmu:4516) CRITICAL: Last errno: 2, No such file or directory
Dynamic subtest engine-DRM_XE_ENGINE_CLASS_COMPUTE0 failed.
**** DEBUG ****
(xe_pmu:4516) CRITICAL: Test assertion failure function get_event_config, file...
(xe_pmu:4516) CRITICAL: Failed assertion: ret >= 0
(xe_pmu:4516) CRITICAL: Last errno: 2, No such file or directory
(xe_pmu:4516) igt_core-INFO: Stack trace:
(xe_pmu:4516) igt_core-INFO:   #0 ../lib/igt_core.c:2055 __igt_fail_assert()
(xe_pmu:4516) igt_core-INFO:   #1 ../tests/intel/xe_pmu.c:126 get_event_config()
(xe_pmu:4516) igt_core-INFO:   #2 ../tests/intel/xe_pmu.c:148 engine_activity()
(xe_pmu:4516) igt_core-INFO:   #3 ../tests/intel/xe_pmu.c:250 __igt_unique____...
(xe_pmu:4516) igt_core-INFO:   #4 ../tests/intel/xe_pmu.c:229 main()
(xe_pmu:4516) igt_core-INFO:   #5 [__libc_init_first+0x8a]
(xe_pmu:4516) igt_core-INFO:   #6 [__libc_start_main+0x8b]
...
igt@kms_plane_cursor@primary
igt@kms_plane_cursor@primary
xe-2825-a958e31a81b3267201c85b6f171419586afa792c

(kms_plane_cursor:6674) CRITICAL: Test assertion failure function __igt_unique...
(kms_plane_cursor:6674) CRITICAL: Failed assertion: ret == 0 || errno == EINVAL
(kms_plane_cursor:6674) CRITICAL: Last errno: 95, Operation not supported
Test kms_plane_cursor failed.
**** DEBUG ****
(kms_plane_cursor:6674) igt_core-DEBUG: Notice: using IGT_DEVICE env:
(kms_plane_cursor:6674) igt_core-DEBUG: [pci:vendor=intel,device=discrete,card...
(kms_plane_cursor:6674) igt_core-INFO: Using IGT_SRANDOM=1742091376 for random...
(kms_plane_cursor:6674) drmtest-DEBUG: Looking for devices to open using filte...
(kms_plane_cursor:6674) drmtest-DEBUG: Filter matched /dev/dri/card0 | /dev/dr...
(kms_plane_cursor:6674) drmtest-INFO: Opened device: /dev/dri/card0
(kms_plane_cursor:6674) drmtest-DEBUG: Test requirement passed: !(fd<0)
(kms_plane_cursor:6674) CRITICAL: Test assertion failure function __igt_unique...
(kms_plane_cursor:6674) CRITICAL: Failed assertion: ret == 0 || errno == EINVAL
(kms_plane_cursor:6674) CRITICAL: Last errno: 95, Operation not supported
(kms_plane_cursor:6674) igt_core-INFO: Stack trace:
(kms_plane_cursor:6674) igt_core-INFO:   #0 ../lib/igt_core.c:2055 __igt_fail_...
...
igt@kms_cursor_edge_walk@256x256-right-edge
igt@kms_cursor_edge_walk@256x256-right-edge
xe-2825-a958e31a81b3267201c85b6f171419586afa792c

(kms_cursor_edge_walk:5515) CRITICAL: Test assertion failure function __igt_un...
(kms_cursor_edge_walk:5515) CRITICAL: Failed assertion: ret == 0 || errno == E...
(kms_cursor_edge_walk:5515) CRITICAL: Last errno: 95, Operation not supported
Test kms_cursor_edge_walk failed.
**** DEBUG ****
(kms_cursor_edge_walk:5515) igt_core-DEBUG: Notice: using IGT_DEVICE env:
(kms_cursor_edge_walk:5515) igt_core-DEBUG: [pci:vendor=intel,device=discrete,...
(kms_cursor_edge_walk:5515) igt_core-INFO: Using IGT_SRANDOM=1742091166 for ra...
(kms_cursor_edge_walk:5515) drmtest-DEBUG: Looking for devices to open using f...
(kms_cursor_edge_walk:5515) drmtest-DEBUG: Filter matched /dev/dri/card0 | /de...
(kms_cursor_edge_walk:5515) drmtest-INFO: Opened device: /dev/dri/card0
(kms_cursor_edge_walk:5515) drmtest-DEBUG: Test requirement passed: !(fd<0)
(kms_cursor_edge_walk:5515) CRITICAL: Test assertion failure function __igt_un...
(kms_cursor_edge_walk:5515) CRITICAL: Failed assertion: ret == 0 || errno == E...
(kms_cursor_edge_walk:5515) CRITICAL: Last errno: 95, Operation not supported
(kms_cursor_edge_walk:5515) igt_core-INFO: Stack trace:
(kms_cursor_edge_walk:5515) igt_core-INFO:   #0 ../lib/igt_core.c:2055 __igt_f...
...
igt@kms_cursor_edge_walk@64x64-left-edge
igt@kms_cursor_edge_walk@64x64-left-edge
xe-2825-a958e31a81b3267201c85b6f171419586afa792c

(kms_cursor_edge_walk:5520) CRITICAL: Test assertion failure function __igt_un...
(kms_cursor_edge_walk:5520) CRITICAL: Failed assertion: ret == 0 || errno == E...
(kms_cursor_edge_walk:5520) CRITICAL: Last errno: 95, Operation not supported
Test kms_cursor_edge_walk failed.
**** DEBUG ****
(kms_cursor_edge_walk:5520) igt_core-DEBUG: Notice: using IGT_DEVICE env:
(kms_cursor_edge_walk:5520) igt_core-DEBUG: [pci:vendor=intel,device=discrete,...
(kms_cursor_edge_walk:5520) igt_core-INFO: Using IGT_SRANDOM=1742091167 for ra...
(kms_cursor_edge_walk:5520) drmtest-DEBUG: Looking for devices to open using f...
(kms_cursor_edge_walk:5520) drmtest-DEBUG: Filter matched /dev/dri/card0 | /de...
(kms_cursor_edge_walk:5520) drmtest-INFO: Opened device: /dev/dri/card0
(kms_cursor_edge_walk:5520) drmtest-DEBUG: Test requirement passed: !(fd<0)
(kms_cursor_edge_walk:5520) CRITICAL: Test assertion failure function __igt_un...
(kms_cursor_edge_walk:5520) CRITICAL: Failed assertion: ret == 0 || errno == E...
(kms_cursor_edge_walk:5520) CRITICAL: Last errno: 95, Operation not supported
(kms_cursor_edge_walk:5520) igt_core-INFO: Stack trace:
(kms_cursor_edge_walk:5520) igt_core-INFO:   #0 ../lib/igt_core.c:2055 __igt_f...
...
igt@xe_pm@s4-vm-bind-unbind-all
igt@xe_pm@s4-vm-bind-unbind-all
xe-2825-a958e31a81b3267201c85b6f171419586afa792c

<6> [121.431282] [IGT] xe_pm: executing
<7> [121.475995] xe 0000:aa:00.0: [drm:xe_gt_resume [xe]] GT0: resuming
<7> [121.476575] xe 0000:aa:00.0: [drm:xe_reg_sr_apply_mmio [xe]] GT0: Applyin...
<7> [121.476938] xe 0000:aa:00.0: [drm:xe_reg_sr_apply_mmio [xe]] GT0: REG[0x9...
<7> [121.477221] xe 0000:aa:00.0: [drm:xe_reg_sr_apply_mmio [xe]] GT0: REG[0xb...
<7> [121.477488] xe 0000:aa:00.0: [drm:xe_reg_sr_apply_mmio [xe]] GT0: REG[0xc...
<7> [121.477746] xe 0000:aa:00.0: [drm:xe_reg_sr_apply_mmio [xe]] GT0: REG[0xc...
<7> [121.477986] xe 0000:aa:00.0: [drm:xe_reg_sr_apply_mmio [xe]] GT0: REG[0xc...
<7> [121.478220] xe 0000:aa:00.0: [drm:xe_reg_sr_apply_mmio [xe]] GT0: REG[0xc...
<7> [121.478455] xe 0000:aa:00.0: [drm:xe_wopcm_init [xe]] WOPCM: 4096K
<7> [121.478700] xe 0000:aa:00.0: [drm:xe_wopcm_init [xe]] GuC WOPCM is alread...
<7> [121.479836] xe 0000:aa:00.0: [drm:xe_guc_ads_populate [xe]] GT0: ADS capt...
<7> [121.480917] xe 0000:aa:00.0: [drm:__xe_guc_upload [xe]] GT0: load still i...
<7> [121.481055] xe 0000:aa:00.0: [drm:__xe_guc_upload [xe]] GT0: load still i...
<7> [121.490690] xe 0000:aa:00.0: [drm:__xe_guc_upload [xe]] GT0: init took 9m...
<7> [121.491281] xe 0000:aa:00.0: [drm:xe_guc_ct_enable [xe]] GT0: GuC CT comm...
<7> [121.492636] xe 0000:aa:00.0: [drm:xe_mocs_init [xe]] GT0: flag:0x2
...
igt@xe_pm@s4-basic-exec
igt@xe_pm@s4-basic-exec
xe-2825-a958e31a81b3267201c85b6f171419586afa792c

<6> [126.252008] [IGT] xe_pm: executing
<7> [126.295431] xe 0000:aa:00.0: [drm:xe_gt_resume [xe]] GT0: resuming
<7> [126.295804] xe 0000:aa:00.0: [drm:xe_reg_sr_apply_mmio [xe]] GT0: Applyin...
<7> [126.295980] xe 0000:aa:00.0: [drm:xe_reg_sr_apply_mmio [xe]] GT0: REG[0x9...
<7> [126.296131] xe 0000:aa:00.0: [drm:xe_reg_sr_apply_mmio [xe]] GT0: REG[0xb...
<7> [126.296315] xe 0000:aa:00.0: [drm:xe_reg_sr_apply_mmio [xe]] GT0: REG[0xc...
<7> [126.296452] xe 0000:aa:00.0: [drm:xe_reg_sr_apply_mmio [xe]] GT0: REG[0xc...
<7> [126.296587] xe 0000:aa:00.0: [drm:xe_reg_sr_apply_mmio [xe]] GT0: REG[0xc...
<7> [126.296721] xe 0000:aa:00.0: [drm:xe_reg_sr_apply_mmio [xe]] GT0: REG[0xc...
<7> [126.296856] xe 0000:aa:00.0: [drm:xe_wopcm_init [xe]] WOPCM: 4096K
<7> [126.297028] xe 0000:aa:00.0: [drm:xe_wopcm_init [xe]] GuC WOPCM is alread...
<7> [126.298233] xe 0000:aa:00.0: [drm:xe_guc_ads_populate [xe]] GT0: ADS capt...
<7> [126.299412] xe 0000:aa:00.0: [drm:__xe_guc_upload [xe]] GT0: load still i...
<7> [126.299550] xe 0000:aa:00.0: [drm:__xe_guc_upload [xe]] GT0: load still i...
<7> [126.309255] xe 0000:aa:00.0: [drm:__xe_guc_upload [xe]] GT0: init took 9m...
<7> [126.310225] xe 0000:aa:00.0: [drm:xe_guc_ct_enable [xe]] GT0: GuC CT comm...
<7> [126.311879] xe 0000:aa:00.0: [drm:xe_mocs_init [xe]] GT0: flag:0x2
...
igt@xe_pm@s2idle-basic
igt@xe_pm@s2idle-basic
xe-2825-a958e31a81b3267201c85b6f171419586afa792c

<6> [852.741161] [IGT] xe_pm: executing
<7> [854.009393] xe 0000:aa:00.0: [drm:xe_gt_suspend [xe]] GT0: suspending
<7> [854.010106] xe 0000:aa:00.0: [drm:xe_gt_suspend [xe]] GT0: suspended
<7> [864.003968] xe 0000:aa:00.0: [drm:xe_gt_resume [xe]] GT0: resuming
<7> [864.004321] xe 0000:aa:00.0: [drm:xe_reg_sr_apply_mmio [xe]] GT0: Applyin...
<7> [864.004745] xe 0000:aa:00.0: [drm:xe_reg_sr_apply_mmio [xe]] GT0: REG[0x9...
<7> [864.005217] xe 0000:aa:00.0: [drm:xe_reg_sr_apply_mmio [xe]] GT0: REG[0xb...
<7> [864.005597] xe 0000:aa:00.0: [drm:xe_reg_sr_apply_mmio [xe]] GT0: REG[0xc...
<7> [864.005981] xe 0000:aa:00.0: [drm:xe_reg_sr_apply_mmio [xe]] GT0: REG[0xc...
<7> [864.006316] xe 0000:aa:00.0: [drm:xe_reg_sr_apply_mmio [xe]] GT0: REG[0xc...
<7> [864.006644] xe 0000:aa:00.0: [drm:xe_reg_sr_apply_mmio [xe]] GT0: REG[0xc...
<7> [864.007046] xe 0000:aa:00.0: [drm:xe_wopcm_init [xe]] WOPCM: 4096K
<7> [864.007472] xe 0000:aa:00.0: [drm:xe_wopcm_init [xe]] GuC WOPCM is alread...
<7> [864.009238] xe 0000:aa:00.0: [drm:xe_guc_ads_populate [xe]] GT0: ADS capt...
<7> [864.010075] xe 0000:aa:00.0: [drm:__xe_guc_upload [xe]] GT0: load still i...
<7> [864.010153] xe 0000:aa:00.0: [drm:__xe_guc_upload [xe]] GT0: load still i...
<7> [864.010220] xe 0000:aa:00.0: [drm:__xe_guc_upload [xe]] GT0: load still i...
...
igt@kms_cursor_edge_walk@128x128-right-edge
igt@kms_cursor_edge_walk@128x128-right-edge
xe-2825-a958e31a81b3267201c85b6f171419586afa792c

(kms_cursor_edge_walk:5510) CRITICAL: Test assertion failure function __igt_un...
(kms_cursor_edge_walk:5510) CRITICAL: Failed assertion: ret == 0 || errno == E...
(kms_cursor_edge_walk:5510) CRITICAL: Last errno: 95, Operation not supported
Test kms_cursor_edge_walk failed.
**** DEBUG ****
(kms_cursor_edge_walk:5510) igt_core-DEBUG: Notice: using IGT_DEVICE env:
(kms_cursor_edge_walk:5510) igt_core-DEBUG: [pci:vendor=intel,device=discrete,...
(kms_cursor_edge_walk:5510) igt_core-INFO: Using IGT_SRANDOM=1742091165 for ra...
(kms_cursor_edge_walk:5510) drmtest-DEBUG: Looking for devices to open using f...
(kms_cursor_edge_walk:5510) drmtest-DEBUG: Filter matched /dev/dri/card0 | /de...
(kms_cursor_edge_walk:5510) drmtest-INFO: Opened device: /dev/dri/card0
(kms_cursor_edge_walk:5510) drmtest-DEBUG: Test requirement passed: !(fd<0)
(kms_cursor_edge_walk:5510) CRITICAL: Test assertion failure function __igt_un...
(kms_cursor_edge_walk:5510) CRITICAL: Failed assertion: ret == 0 || errno == E...
(kms_cursor_edge_walk:5510) CRITICAL: Last errno: 95, Operation not supported
(kms_cursor_edge_walk:5510) igt_core-INFO: Stack trace:
(kms_cursor_edge_walk:5510) igt_core-INFO:   #0 ../lib/igt_core.c:2055 __igt_f...
...
igt@xe_pm@s2idle-mocs
igt@xe_pm@s2idle-mocs
xe-2825-a958e31a81b3267201c85b6f171419586afa792c

<6> [125.579406] [IGT] xe_pm: executing
<7> [125.630043] xe 0000:aa:00.0: [drm:xe_gt_resume [xe]] GT0: resuming
<7> [125.630969] xe 0000:aa:00.0: [drm:xe_reg_sr_apply_mmio [xe]] GT0: Applyin...
<7> [125.631416] xe 0000:aa:00.0: [drm:xe_reg_sr_apply_mmio [xe]] GT0: REG[0x9...
<7> [125.631868] xe 0000:aa:00.0: [drm:xe_reg_sr_apply_mmio [xe]] GT0: REG[0xb...
<7> [125.632269] xe 0000:aa:00.0: [drm:xe_reg_sr_apply_mmio [xe]] GT0: REG[0xc...
<7> [125.632645] xe 0000:aa:00.0: [drm:xe_reg_sr_apply_mmio [xe]] GT0: REG[0xc...
<7> [125.632870] xe 0000:aa:00.0: [drm:xe_reg_sr_apply_mmio [xe]] GT0: REG[0xc...
<7> [125.633014] xe 0000:aa:00.0: [drm:xe_reg_sr_apply_mmio [xe]] GT0: REG[0xc...
<7> [125.633146] xe 0000:aa:00.0: [drm:xe_wopcm_init [xe]] WOPCM: 4096K
<7> [125.633318] xe 0000:aa:00.0: [drm:xe_wopcm_init [xe]] GuC WOPCM is alread...
<7> [125.635212] xe 0000:aa:00.0: [drm:xe_guc_ads_populate [xe]] GT0: ADS capt...
<7> [125.636374] xe 0000:aa:00.0: [drm:__xe_guc_upload [xe]] GT0: load still i...
<7> [125.636553] xe 0000:aa:00.0: [drm:__xe_guc_upload [xe]] GT0: load still i...
<7> [125.647302] xe 0000:aa:00.0: [drm:__xe_guc_upload [xe]] GT0: init took 10...
<7> [125.648589] xe 0000:aa:00.0: [drm:xe_guc_ct_enable [xe]] GT0: GuC CT comm...
<7> [125.653554] xe 0000:aa:00.0: [drm:xe_mocs_init [xe]] GT0: flag:0x2
...
igt@xe_mmap@pci-membarrier-parallel
igt@xe_mmap@pci-membarrier-parallel
xe-2825-a958e31a81b3267201c85b6f171419586afa792c

Starting subtest: pci-membarrier-parallel
(xe_mmap:39366) CRITICAL: Test assertion failure function test_pci_membarrier_...
(xe_mmap:39366) CRITICAL: Failed assertion: (*(volatile typeof(ptr[i]) *)(&(pt...
(xe_mmap:39366) CRITICAL: error: 0xffffffff != 0xdeadbeef
(xe_mmap:39367) CRITICAL: Test assertion failure function test_pci_membarrier_...
(xe_mmap:39367) CRITICAL: Failed assertion: (*(volatile typeof(ptr[i]) *)(&(pt...
(xe_mmap:39367) CRITICAL: error: 0xffffffff != 0xdeadbeef
Subtest pci-membarrier-parallel failed.
**** DEBUG ****
(xe_mmap:39366) DEBUG: Test requirement passed: is_pci_membarrier_supported(fd)
(xe_mmap:39366) drmtest-DEBUG: Looking for devices to open using filter 0: pci...
(xe_mmap:39366) drmtest-DEBUG: Filter matched /dev/dri/card0 | /dev/dri/render...
(xe_mmap:39366) drmtest-DEBUG: Opened previously opened device: /dev/dri/card0
(xe_mmap:39366) drmtest-DEBUG: Test requirement passed: !(fd<0)
(xe_mmap:39366) CRITICAL: Test assertion failure function test_pci_membarrier_...
(xe_mmap:39366) CRITICAL: Failed assertion: (*(volatile typeof(ptr[i]) *)(&(pt...
(xe_mmap:39366) CRITICAL: error: 0xffffffff != 0xdeadbeef
...
igt@xe_pm@s4-basic
igt@xe_pm@s4-basic
xe-2825-a958e31a81b3267201c85b6f171419586afa792c

<6> [315.915305] [IGT] xe_pm: executing
<7> [317.463036] xe 0000:aa:00.0: [drm:xe_gt_suspend [xe]] GT0: suspending
<7> [317.463376] xe 0000:aa:00.0: [drm:xe_gt_suspend [xe]] GT0: suspended
<7> [317.724199] xe 0000:aa:00.0: [drm:xe_gt_resume [xe]] GT0: resuming
<7> [317.724504] xe 0000:aa:00.0: [drm:xe_reg_sr_apply_mmio [xe]] GT0: Applyin...
<7> [317.724887] xe 0000:aa:00.0: [drm:xe_reg_sr_apply_mmio [xe]] GT0: REG[0x9...
<7> [317.725336] xe 0000:aa:00.0: [drm:xe_reg_sr_apply_mmio [xe]] GT0: REG[0xb...
<7> [317.725685] xe 0000:aa:00.0: [drm:xe_reg_sr_apply_mmio [xe]] GT0: REG[0xc...
<7> [317.726032] xe 0000:aa:00.0: [drm:xe_reg_sr_apply_mmio [xe]] GT0: REG[0xc...
<7> [317.726328] xe 0000:aa:00.0: [drm:xe_reg_sr_apply_mmio [xe]] GT0: REG[0xc...
<7> [317.726621] xe 0000:aa:00.0: [drm:xe_reg_sr_apply_mmio [xe]] GT0: REG[0xc...
<7> [317.726915] xe 0000:aa:00.0: [drm:xe_wopcm_init [xe]] WOPCM: 4096K
<7> [317.727354] xe 0000:aa:00.0: [drm:xe_wopcm_init [xe]] GuC WOPCM is alread...
<7> [317.729210] xe 0000:aa:00.0: [drm:xe_guc_ads_populate [xe]] GT0: ADS capt...
<7> [317.730085] xe 0000:aa:00.0: [drm:__xe_guc_upload [xe]] GT0: load still i...
<7> [317.730220] xe 0000:aa:00.0: [drm:__xe_guc_upload [xe]] GT0: load still i...
<7> [317.741038] xe 0000:aa:00.0: [drm:__xe_guc_upload [xe]] GT0: init took 10...
...
igt@kms_cursor_edge_walk@128x128-top-edge
igt@kms_cursor_edge_walk@128x128-top-edge
xe-2825-a958e31a81b3267201c85b6f171419586afa792c

(kms_cursor_edge_walk:5512) CRITICAL: Test assertion failure function __igt_un...
(kms_cursor_edge_walk:5512) CRITICAL: Failed assertion: ret == 0 || errno == E...
(kms_cursor_edge_walk:5512) CRITICAL: Last errno: 95, Operation not supported
Test kms_cursor_edge_walk failed.
**** DEBUG ****
(kms_cursor_edge_walk:5512) igt_core-DEBUG: Notice: using IGT_DEVICE env:
(kms_cursor_edge_walk:5512) igt_core-DEBUG: [pci:vendor=intel,device=discrete,...
(kms_cursor_edge_walk:5512) igt_core-INFO: Using IGT_SRANDOM=1742091165 for ra...
(kms_cursor_edge_walk:5512) drmtest-DEBUG: Looking for devices to open using f...
(kms_cursor_edge_walk:5512) drmtest-DEBUG: Filter matched /dev/dri/card0 | /de...
(kms_cursor_edge_walk:5512) drmtest-INFO: Opened device: /dev/dri/card0
(kms_cursor_edge_walk:5512) drmtest-DEBUG: Test requirement passed: !(fd<0)
(kms_cursor_edge_walk:5512) CRITICAL: Test assertion failure function __igt_un...
(kms_cursor_edge_walk:5512) CRITICAL: Failed assertion: ret == 0 || errno == E...
(kms_cursor_edge_walk:5512) CRITICAL: Last errno: 95, Operation not supported
(kms_cursor_edge_walk:5512) igt_core-INFO: Stack trace:
(kms_cursor_edge_walk:5512) igt_core-INFO:   #0 ../lib/igt_core.c:2055 __igt_f...
...
igt@xe_pm@s2idle-d3hot-basic-exec
igt@xe_pm@s2idle-d3hot-basic-exec
xe-2825-a958e31a81b3267201c85b6f171419586afa792c

<6> [151.137051] [IGT] xe_pm: executing
<7> [152.405800] xe 0000:aa:00.0: [drm:xe_gt_suspend [xe]] GT0: suspending
<7> [152.406147] xe 0000:aa:00.0: [drm:xe_gt_suspend [xe]] GT0: suspended
<7> [162.335007] xe 0000:aa:00.0: [drm:xe_gt_resume [xe]] GT0: resuming
<7> [162.335497] xe 0000:aa:00.0: [drm:xe_reg_sr_apply_mmio [xe]] GT0: Applyin...
<7> [162.335902] xe 0000:aa:00.0: [drm:xe_reg_sr_apply_mmio [xe]] GT0: REG[0x9...
<7> [162.336135] xe 0000:aa:00.0: [drm:xe_reg_sr_apply_mmio [xe]] GT0: REG[0xb...
<7> [162.336356] xe 0000:aa:00.0: [drm:xe_reg_sr_apply_mmio [xe]] GT0: REG[0xc...
<7> [162.336549] xe 0000:aa:00.0: [drm:xe_reg_sr_apply_mmio [xe]] GT0: REG[0xc...
<7> [162.336774] xe 0000:aa:00.0: [drm:xe_reg_sr_apply_mmio [xe]] GT0: REG[0xc...
<7> [162.336969] xe 0000:aa:00.0: [drm:xe_reg_sr_apply_mmio [xe]] GT0: REG[0xc...
<7> [162.337158] xe 0000:aa:00.0: [drm:xe_wopcm_init [xe]] WOPCM: 4096K
<7> [162.337397] xe 0000:aa:00.0: [drm:xe_wopcm_init [xe]] GuC WOPCM is alread...
<7> [162.339487] xe 0000:aa:00.0: [drm:xe_guc_ads_populate [xe]] GT0: ADS capt...
<7> [162.340372] xe 0000:aa:00.0: [drm:__xe_guc_upload [xe]] GT0: load still i...
<7> [162.340507] xe 0000:aa:00.0: [drm:__xe_guc_upload [xe]] GT0: load still i...
<7> [162.351604] xe 0000:aa:00.0: [drm:__xe_guc_upload [xe]] GT0: init took 11...
...
igt@xe_pmu@engine-activity-idle
igt@xe_pmu@engine-activity-idle
xe-2825-a958e31a81b3267201c85b6f171419586afa792c

Starting subtest: engine-activity-idle
Starting dynamic subtest: engine-DRM_XE_ENGINE_CLASS_COPY0
(xe_pmu:4513) CRITICAL: Test assertion failure function get_event_config, file...
(xe_pmu:4513) CRITICAL: Failed assertion: ret >= 0
(xe_pmu:4513) CRITICAL: Last errno: 2, No such file or directory
Dynamic subtest engine-DRM_XE_ENGINE_CLASS_COPY0 failed.
**** DEBUG ****
(xe_pmu:4513) CRITICAL: Test assertion failure function get_event_config, file...
(xe_pmu:4513) CRITICAL: Failed assertion: ret >= 0
(xe_pmu:4513) CRITICAL: Last errno: 2, No such file or directory
(xe_pmu:4513) igt_core-INFO: Stack trace:
(xe_pmu:4513) igt_core-INFO:   #0 ../lib/igt_core.c:2055 __igt_fail_assert()
(xe_pmu:4513) igt_core-INFO:   #1 ../tests/intel/xe_pmu.c:126 get_event_config()
(xe_pmu:4513) igt_core-INFO:   #2 ../tests/intel/xe_pmu.c:148 engine_activity()
(xe_pmu:4513) igt_core-INFO:   #3 ../tests/intel/xe_pmu.c:246 __igt_unique____...
(xe_pmu:4513) igt_core-INFO:   #4 ../tests/intel/xe_pmu.c:229 main()
(xe_pmu:4513) igt_core-INFO:   #5 [__libc_init_first+0x8a]
...
igt@xe_pmu@engine-activity-idle@engine-drm_xe_engine_class_copy0
igt@xe_pmu@engine-activity-idle@engine-drm_xe_engine_class_copy0
xe-2825-a958e31a81b3267201c85b6f171419586afa792c

Starting subtest: engine-activity-idle
Starting dynamic subtest: engine-DRM_XE_ENGINE_CLASS_COPY0
(xe_pmu:4513) CRITICAL: Test assertion failure function get_event_config, file...
(xe_pmu:4513) CRITICAL: Failed assertion: ret >= 0
(xe_pmu:4513) CRITICAL: Last errno: 2, No such file or directory
Dynamic subtest engine-DRM_XE_ENGINE_CLASS_COPY0 failed.
**** DEBUG ****
(xe_pmu:4513) CRITICAL: Test assertion failure function get_event_config, file...
(xe_pmu:4513) CRITICAL: Failed assertion: ret >= 0
(xe_pmu:4513) CRITICAL: Last errno: 2, No such file or directory
(xe_pmu:4513) igt_core-INFO: Stack trace:
(xe_pmu:4513) igt_core-INFO:   #0 ../lib/igt_core.c:2055 __igt_fail_assert()
(xe_pmu:4513) igt_core-INFO:   #1 ../tests/intel/xe_pmu.c:126 get_event_config()
(xe_pmu:4513) igt_core-INFO:   #2 ../tests/intel/xe_pmu.c:148 engine_activity()
(xe_pmu:4513) igt_core-INFO:   #3 ../tests/intel/xe_pmu.c:246 __igt_unique____...
(xe_pmu:4513) igt_core-INFO:   #4 ../tests/intel/xe_pmu.c:229 main()
(xe_pmu:4513) igt_core-INFO:   #5 [__libc_init_first+0x8a]
...
igt@xe_pmu@engine-activity-idle@engine-drm_xe_engine_class_compute0
igt@xe_pmu@engine-activity-idle@engine-drm_xe_engine_class_compute0
xe-2825-a958e31a81b3267201c85b6f171419586afa792c

Starting dynamic subtest: engine-DRM_XE_ENGINE_CLASS_COMPUTE0
(xe_pmu:4513) CRITICAL: Test assertion failure function get_event_config, file...
(xe_pmu:4513) CRITICAL: Failed assertion: ret >= 0
(xe_pmu:4513) CRITICAL: Last errno: 2, No such file or directory
Dynamic subtest engine-DRM_XE_ENGINE_CLASS_COMPUTE0 failed.
**** DEBUG ****
(xe_pmu:4513) CRITICAL: Test assertion failure function get_event_config, file...
(xe_pmu:4513) CRITICAL: Failed assertion: ret >= 0
(xe_pmu:4513) CRITICAL: Last errno: 2, No such file or directory
(xe_pmu:4513) igt_core-INFO: Stack trace:
(xe_pmu:4513) igt_core-INFO:   #0 ../lib/igt_core.c:2055 __igt_fail_assert()
(xe_pmu:4513) igt_core-INFO:   #1 ../tests/intel/xe_pmu.c:126 get_event_config()
(xe_pmu:4513) igt_core-INFO:   #2 ../tests/intel/xe_pmu.c:148 engine_activity()
(xe_pmu:4513) igt_core-INFO:   #3 ../tests/intel/xe_pmu.c:246 __igt_unique____...
(xe_pmu:4513) igt_core-INFO:   #4 ../tests/intel/xe_pmu.c:229 main()
(xe_pmu:4513) igt_core-INFO:   #5 [__libc_init_first+0x8a]
(xe_pmu:4513) igt_core-INFO:   #6 [__libc_start_main+0x8b]
...
igt@kms_cursor_edge_walk@256x256-top-bottom
igt@kms_cursor_edge_walk@256x256-top-bottom
xe-2825-a958e31a81b3267201c85b6f171419586afa792c

(kms_cursor_edge_walk:5516) CRITICAL: Test assertion failure function __igt_un...
(kms_cursor_edge_walk:5516) CRITICAL: Failed assertion: ret == 0 || errno == E...
(kms_cursor_edge_walk:5516) CRITICAL: Last errno: 95, Operation not supported
Test kms_cursor_edge_walk failed.
**** DEBUG ****
(kms_cursor_edge_walk:5516) igt_core-DEBUG: Notice: using IGT_DEVICE env:
(kms_cursor_edge_walk:5516) igt_core-DEBUG: [pci:vendor=intel,device=discrete,...
(kms_cursor_edge_walk:5516) igt_core-INFO: Using IGT_SRANDOM=1742091166 for ra...
(kms_cursor_edge_walk:5516) drmtest-DEBUG: Looking for devices to open using f...
(kms_cursor_edge_walk:5516) drmtest-DEBUG: Filter matched /dev/dri/card0 | /de...
(kms_cursor_edge_walk:5516) drmtest-INFO: Opened device: /dev/dri/card0
(kms_cursor_edge_walk:5516) drmtest-DEBUG: Test requirement passed: !(fd<0)
(kms_cursor_edge_walk:5516) CRITICAL: Test assertion failure function __igt_un...
(kms_cursor_edge_walk:5516) CRITICAL: Failed assertion: ret == 0 || errno == E...
(kms_cursor_edge_walk:5516) CRITICAL: Last errno: 95, Operation not supported
(kms_cursor_edge_walk:5516) igt_core-INFO: Stack trace:
(kms_cursor_edge_walk:5516) igt_core-INFO:   #0 ../lib/igt_core.c:2055 __igt_f...
...
igt@xe_pmu@engine-activity-load
igt@xe_pmu@engine-activity-load
xe-2825-a958e31a81b3267201c85b6f171419586afa792c

Starting subtest: engine-activity-load
Starting dynamic subtest: engine-DRM_XE_ENGINE_CLASS_COPY0
(xe_pmu:4514) CRITICAL: Test assertion failure function get_event_config, file...
(xe_pmu:4514) CRITICAL: Failed assertion: ret >= 0
(xe_pmu:4514) CRITICAL: Last errno: 2, No such file or directory
Dynamic subtest engine-DRM_XE_ENGINE_CLASS_COPY0 failed.
**** DEBUG ****
(xe_pmu:4514) CRITICAL: Test assertion failure function get_event_config, file...
(xe_pmu:4514) CRITICAL: Failed assertion: ret >= 0
(xe_pmu:4514) CRITICAL: Last errno: 2, No such file or directory
(xe_pmu:4514) igt_core-INFO: Stack trace:
(xe_pmu:4514) igt_core-INFO:   #0 ../lib/igt_core.c:2055 __igt_fail_assert()
(xe_pmu:4514) igt_core-INFO:   #1 ../tests/intel/xe_pmu.c:126 get_event_config()
(xe_pmu:4514) igt_core-INFO:   #2 ../tests/intel/xe_pmu.c:148 engine_activity()
(xe_pmu:4514) igt_core-INFO:   #3 ../tests/intel/xe_pmu.c:254 __igt_unique____...
(xe_pmu:4514) igt_core-INFO:   #4 ../tests/intel/xe_pmu.c:229 main()
(xe_pmu:4514) igt_core-INFO:   #5 [__libc_init_first+0x8a]
...
igt@xe_pmu@engine-activity-load@engine-drm_xe_engine_class_copy0
igt@xe_pmu@engine-activity-load@engine-drm_xe_engine_class_copy0
xe-2825-a958e31a81b3267201c85b6f171419586afa792c

Starting subtest: engine-activity-load
Starting dynamic subtest: engine-DRM_XE_ENGINE_CLASS_COPY0
(xe_pmu:4514) CRITICAL: Test assertion failure function get_event_config, file...
(xe_pmu:4514) CRITICAL: Failed assertion: ret >= 0
(xe_pmu:4514) CRITICAL: Last errno: 2, No such file or directory
Dynamic subtest engine-DRM_XE_ENGINE_CLASS_COPY0 failed.
**** DEBUG ****
(xe_pmu:4514) CRITICAL: Test assertion failure function get_event_config, file...
(xe_pmu:4514) CRITICAL: Failed assertion: ret >= 0
(xe_pmu:4514) CRITICAL: Last errno: 2, No such file or directory
(xe_pmu:4514) igt_core-INFO: Stack trace:
(xe_pmu:4514) igt_core-INFO:   #0 ../lib/igt_core.c:2055 __igt_fail_assert()
(xe_pmu:4514) igt_core-INFO:   #1 ../tests/intel/xe_pmu.c:126 get_event_config()
(xe_pmu:4514) igt_core-INFO:   #2 ../tests/intel/xe_pmu.c:148 engine_activity()
(xe_pmu:4514) igt_core-INFO:   #3 ../tests/intel/xe_pmu.c:254 __igt_unique____...
(xe_pmu:4514) igt_core-INFO:   #4 ../tests/intel/xe_pmu.c:229 main()
(xe_pmu:4514) igt_core-INFO:   #5 [__libc_init_first+0x8a]
...
igt@xe_pmu@engine-activity-load@engine-drm_xe_engine_class_compute0
igt@xe_pmu@engine-activity-load@engine-drm_xe_engine_class_compute0
xe-2825-a958e31a81b3267201c85b6f171419586afa792c

Starting dynamic subtest: engine-DRM_XE_ENGINE_CLASS_COMPUTE0
(xe_pmu:4514) CRITICAL: Test assertion failure function get_event_config, file...
(xe_pmu:4514) CRITICAL: Failed assertion: ret >= 0
(xe_pmu:4514) CRITICAL: Last errno: 2, No such file or directory
Dynamic subtest engine-DRM_XE_ENGINE_CLASS_COMPUTE0 failed.
**** DEBUG ****
(xe_pmu:4514) CRITICAL: Test assertion failure function get_event_config, file...
(xe_pmu:4514) CRITICAL: Failed assertion: ret >= 0
(xe_pmu:4514) CRITICAL: Last errno: 2, No such file or directory
(xe_pmu:4514) igt_core-INFO: Stack trace:
(xe_pmu:4514) igt_core-INFO:   #0 ../lib/igt_core.c:2055 __igt_fail_assert()
(xe_pmu:4514) igt_core-INFO:   #1 ../tests/intel/xe_pmu.c:126 get_event_config()
(xe_pmu:4514) igt_core-INFO:   #2 ../tests/intel/xe_pmu.c:148 engine_activity()
(xe_pmu:4514) igt_core-INFO:   #3 ../tests/intel/xe_pmu.c:254 __igt_unique____...
(xe_pmu:4514) igt_core-INFO:   #4 ../tests/intel/xe_pmu.c:229 main()
(xe_pmu:4514) igt_core-INFO:   #5 [__libc_init_first+0x8a]
(xe_pmu:4514) igt_core-INFO:   #6 [__libc_start_main+0x8b]
...
igt@xe_pm@s2idle-basic-exec
igt@xe_pm@s2idle-basic-exec
xe-2825-a958e31a81b3267201c85b6f171419586afa792c

<6> [121.337148] [IGT] xe_pm: executing
<7> [121.406632] xe 0000:aa:00.0: [drm:xe_gt_resume [xe]] GT0: resuming
<7> [121.407674] xe 0000:aa:00.0: [drm:xe_reg_sr_apply_mmio [xe]] GT0: Applyin...
<7> [121.408238] xe 0000:aa:00.0: [drm:xe_reg_sr_apply_mmio [xe]] GT0: REG[0x9...
<7> [121.408831] xe 0000:aa:00.0: [drm:xe_reg_sr_apply_mmio [xe]] GT0: REG[0xb...
<7> [121.409421] xe 0000:aa:00.0: [drm:xe_reg_sr_apply_mmio [xe]] GT0: REG[0xc...
<7> [121.409651] xe 0000:aa:00.0: [drm:xe_reg_sr_apply_mmio [xe]] GT0: REG[0xc...
<7> [121.409866] xe 0000:aa:00.0: [drm:xe_reg_sr_apply_mmio [xe]] GT0: REG[0xc...
<7> [121.410034] xe 0000:aa:00.0: [drm:xe_reg_sr_apply_mmio [xe]] GT0: REG[0xc...
<7> [121.410212] xe 0000:aa:00.0: [drm:xe_wopcm_init [xe]] WOPCM: 4096K
<7> [121.410378] xe 0000:aa:00.0: [drm:xe_wopcm_init [xe]] GuC WOPCM is alread...
<7> [121.412187] xe 0000:aa:00.0: [drm:xe_guc_ads_populate [xe]] GT0: ADS capt...
<7> [121.413422] xe 0000:aa:00.0: [drm:__xe_guc_upload [xe]] GT0: load still i...
<7> [121.413604] xe 0000:aa:00.0: [drm:__xe_guc_upload [xe]] GT0: load still i...
<7> [121.423097] xe 0000:aa:00.0: [drm:__xe_guc_upload [xe]] GT0: init took 9m...
<7> [121.423810] xe 0000:aa:00.0: [drm:xe_guc_ct_enable [xe]] GT0: GuC CT comm...
<7> [121.428368] xe 0000:aa:00.0: [drm:xe_mocs_init [xe]] GT0: flag:0x2
...
igt@xe_pm@s4-multiple-execs
igt@xe_pm@s4-multiple-execs
xe-2825-a958e31a81b3267201c85b6f171419586afa792c

<6> [120.433422] [IGT] xe_pm: executing
<7> [120.480843] xe 0000:aa:00.0: [drm:xe_gt_resume [xe]] GT0: resuming
<7> [120.481308] xe 0000:aa:00.0: [drm:xe_reg_sr_apply_mmio [xe]] GT0: Applyin...
<7> [120.481602] xe 0000:aa:00.0: [drm:xe_reg_sr_apply_mmio [xe]] GT0: REG[0x9...
<7> [120.481918] xe 0000:aa:00.0: [drm:xe_reg_sr_apply_mmio [xe]] GT0: REG[0xb...
<7> [120.482156] xe 0000:aa:00.0: [drm:xe_reg_sr_apply_mmio [xe]] GT0: REG[0xc...
<7> [120.482374] xe 0000:aa:00.0: [drm:xe_reg_sr_apply_mmio [xe]] GT0: REG[0xc...
<7> [120.482580] xe 0000:aa:00.0: [drm:xe_reg_sr_apply_mmio [xe]] GT0: REG[0xc...
<7> [120.482749] xe 0000:aa:00.0: [drm:xe_reg_sr_apply_mmio [xe]] GT0: REG[0xc...
<7> [120.482917] xe 0000:aa:00.0: [drm:xe_wopcm_init [xe]] WOPCM: 4096K
<7> [120.483137] xe 0000:aa:00.0: [drm:xe_wopcm_init [xe]] GuC WOPCM is alread...
<7> [120.484556] xe 0000:aa:00.0: [drm:xe_guc_ads_populate [xe]] GT0: ADS capt...
<7> [120.485742] xe 0000:aa:00.0: [drm:__xe_guc_upload [xe]] GT0: load still i...
<7> [120.485878] xe 0000:aa:00.0: [drm:__xe_guc_upload [xe]] GT0: load still i...
<7> [120.496260] xe 0000:aa:00.0: [drm:__xe_guc_upload [xe]] GT0: init took 10...
<7> [120.497296] xe 0000:aa:00.0: [drm:xe_guc_ct_enable [xe]] GT0: GuC CT comm...
<7> [120.499016] xe 0000:aa:00.0: [drm:xe_mocs_init [xe]] GT0: flag:0x2
...
igt@xe_pm@s2idle-vm-bind-unbind-all
igt@xe_pm@s2idle-vm-bind-unbind-all
xe-2825-a958e31a81b3267201c85b6f171419586afa792c

<6> [120.515627] [IGT] xe_pm: executing
<7> [120.563993] xe 0000:aa:00.0: [drm:xe_gt_resume [xe]] GT0: resuming
<7> [120.564449] xe 0000:aa:00.0: [drm:xe_reg_sr_apply_mmio [xe]] GT0: Applyin...
<7> [120.564684] xe 0000:aa:00.0: [drm:xe_reg_sr_apply_mmio [xe]] GT0: REG[0x9...
<7> [120.564936] xe 0000:aa:00.0: [drm:xe_reg_sr_apply_mmio [xe]] GT0: REG[0xb...
<7> [120.565138] xe 0000:aa:00.0: [drm:xe_reg_sr_apply_mmio [xe]] GT0: REG[0xc...
<7> [120.565317] xe 0000:aa:00.0: [drm:xe_reg_sr_apply_mmio [xe]] GT0: REG[0xc...
<7> [120.565492] xe 0000:aa:00.0: [drm:xe_reg_sr_apply_mmio [xe]] GT0: REG[0xc...
<7> [120.565662] xe 0000:aa:00.0: [drm:xe_reg_sr_apply_mmio [xe]] GT0: REG[0xc...
<7> [120.565884] xe 0000:aa:00.0: [drm:xe_wopcm_init [xe]] WOPCM: 4096K
<7> [120.566113] xe 0000:aa:00.0: [drm:xe_wopcm_init [xe]] GuC WOPCM is alread...
<7> [120.567480] xe 0000:aa:00.0: [drm:xe_guc_ads_populate [xe]] GT0: ADS capt...
<7> [120.568593] xe 0000:aa:00.0: [drm:__xe_guc_upload [xe]] GT0: load still i...
<7> [120.568740] xe 0000:aa:00.0: [drm:__xe_guc_upload [xe]] GT0: load still i...
<7> [120.578899] xe 0000:aa:00.0: [drm:__xe_guc_upload [xe]] GT0: init took 10...
<7> [120.579520] xe 0000:aa:00.0: [drm:xe_guc_ct_enable [xe]] GT0: GuC CT comm...
<7> [120.580961] xe 0000:aa:00.0: [drm:xe_mocs_init [xe]] GT0: flag:0x2
...
igt@kms_cursor_edge_walk@128x128-left-edge
igt@kms_cursor_edge_walk@128x128-left-edge
xe-2825-a958e31a81b3267201c85b6f171419586afa792c

(kms_cursor_edge_walk:5509) CRITICAL: Test assertion failure function __igt_un...
(kms_cursor_edge_walk:5509) CRITICAL: Failed assertion: ret == 0 || errno == E...
(kms_cursor_edge_walk:5509) CRITICAL: Last errno: 95, Operation not supported
Test kms_cursor_edge_walk failed.
**** DEBUG ****
(kms_cursor_edge_walk:5509) igt_core-DEBUG: Notice: using IGT_DEVICE env:
(kms_cursor_edge_walk:5509) igt_core-DEBUG: [pci:vendor=intel,device=discrete,...
(kms_cursor_edge_walk:5509) igt_core-INFO: Using IGT_SRANDOM=1742091164 for ra...
(kms_cursor_edge_walk:5509) drmtest-DEBUG: Looking for devices to open using f...
(kms_cursor_edge_walk:5509) drmtest-DEBUG: Filter matched /dev/dri/card0 | /de...
(kms_cursor_edge_walk:5509) drmtest-INFO: Opened device: /dev/dri/card0
(kms_cursor_edge_walk:5509) drmtest-DEBUG: Test requirement passed: !(fd<0)
(kms_cursor_edge_walk:5509) CRITICAL: Test assertion failure function __igt_un...
(kms_cursor_edge_walk:5509) CRITICAL: Failed assertion: ret == 0 || errno == E...
(kms_cursor_edge_walk:5509) CRITICAL: Last errno: 95, Operation not supported
(kms_cursor_edge_walk:5509) igt_core-INFO: Stack trace:
(kms_cursor_edge_walk:5509) igt_core-INFO:   #0 ../lib/igt_core.c:2055 __igt_f...
...
igt@kms_cursor_edge_walk@256x256-top-edge
igt@kms_cursor_edge_walk@256x256-top-edge
xe-2825-a958e31a81b3267201c85b6f171419586afa792c

(kms_cursor_edge_walk:5517) CRITICAL: Test assertion failure function __igt_un...
(kms_cursor_edge_walk:5517) CRITICAL: Failed assertion: ret == 0 || errno == E...
(kms_cursor_edge_walk:5517) CRITICAL: Last errno: 95, Operation not supported
Test kms_cursor_edge_walk failed.
**** DEBUG ****
(kms_cursor_edge_walk:5517) igt_core-DEBUG: Notice: using IGT_DEVICE env:
(kms_cursor_edge_walk:5517) igt_core-DEBUG: [pci:vendor=intel,device=discrete,...
(kms_cursor_edge_walk:5517) igt_core-INFO: Using IGT_SRANDOM=1742091166 for ra...
(kms_cursor_edge_walk:5517) drmtest-DEBUG: Looking for devices to open using f...
(kms_cursor_edge_walk:5517) drmtest-DEBUG: Filter matched /dev/dri/card0 | /de...
(kms_cursor_edge_walk:5517) drmtest-INFO: Opened device: /dev/dri/card0
(kms_cursor_edge_walk:5517) drmtest-DEBUG: Test requirement passed: !(fd<0)
(kms_cursor_edge_walk:5517) CRITICAL: Test assertion failure function __igt_un...
(kms_cursor_edge_walk:5517) CRITICAL: Failed assertion: ret == 0 || errno == E...
(kms_cursor_edge_walk:5517) CRITICAL: Last errno: 95, Operation not supported
(kms_cursor_edge_walk:5517) igt_core-INFO: Stack trace:
(kms_cursor_edge_walk:5517) igt_core-INFO:   #0 ../lib/igt_core.c:2055 __igt_f...
...
igt@kms_cursor_edge_walk@64x64-top-bottom
igt@kms_cursor_edge_walk@64x64-top-bottom
xe-2825-a958e31a81b3267201c85b6f171419586afa792c

(kms_cursor_edge_walk:5522) CRITICAL: Test assertion failure function __igt_un...
(kms_cursor_edge_walk:5522) CRITICAL: Failed assertion: ret == 0 || errno == E...
(kms_cursor_edge_walk:5522) CRITICAL: Last errno: 95, Operation not supported
Test kms_cursor_edge_walk failed.
**** DEBUG ****
(kms_cursor_edge_walk:5522) igt_core-DEBUG: Notice: using IGT_DEVICE env:
(kms_cursor_edge_walk:5522) igt_core-DEBUG: [pci:vendor=intel,device=discrete,...
(kms_cursor_edge_walk:5522) igt_core-INFO: Using IGT_SRANDOM=1742091168 for ra...
(kms_cursor_edge_walk:5522) drmtest-DEBUG: Looking for devices to open using f...
(kms_cursor_edge_walk:5522) drmtest-DEBUG: Filter matched /dev/dri/card0 | /de...
(kms_cursor_edge_walk:5522) drmtest-INFO: Opened device: /dev/dri/card0
(kms_cursor_edge_walk:5522) drmtest-DEBUG: Test requirement passed: !(fd<0)
(kms_cursor_edge_walk:5522) CRITICAL: Test assertion failure function __igt_un...
(kms_cursor_edge_walk:5522) CRITICAL: Failed assertion: ret == 0 || errno == E...
(kms_cursor_edge_walk:5522) CRITICAL: Last errno: 95, Operation not supported
(kms_cursor_edge_walk:5522) igt_core-INFO: Stack trace:
(kms_cursor_edge_walk:5522) igt_core-INFO:   #0 ../lib/igt_core.c:2055 __igt_f...
...
igt@kms_cursor_edge_walk@64x64-top-edge
igt@kms_cursor_edge_walk@64x64-top-edge
xe-2825-a958e31a81b3267201c85b6f171419586afa792c

(kms_cursor_edge_walk:5523) CRITICAL: Test assertion failure function __igt_un...
(kms_cursor_edge_walk:5523) CRITICAL: Failed assertion: ret == 0 || errno == E...
(kms_cursor_edge_walk:5523) CRITICAL: Last errno: 95, Operation not supported
Test kms_cursor_edge_walk failed.
**** DEBUG ****
(kms_cursor_edge_walk:5523) igt_core-DEBUG: Notice: using IGT_DEVICE env:
(kms_cursor_edge_walk:5523) igt_core-DEBUG: [pci:vendor=intel,device=discrete,...
(kms_cursor_edge_walk:5523) igt_core-INFO: Using IGT_SRANDOM=1742091168 for ra...
(kms_cursor_edge_walk:5523) drmtest-DEBUG: Looking for devices to open using f...
(kms_cursor_edge_walk:5523) drmtest-DEBUG: Filter matched /dev/dri/card0 | /de...
(kms_cursor_edge_walk:5523) drmtest-INFO: Opened device: /dev/dri/card0
(kms_cursor_edge_walk:5523) drmtest-DEBUG: Test requirement passed: !(fd<0)
(kms_cursor_edge_walk:5523) CRITICAL: Test assertion failure function __igt_un...
(kms_cursor_edge_walk:5523) CRITICAL: Failed assertion: ret == 0 || errno == E...
(kms_cursor_edge_walk:5523) CRITICAL: Last errno: 95, Operation not supported
(kms_cursor_edge_walk:5523) igt_core-INFO: Stack trace:
(kms_cursor_edge_walk:5523) igt_core-INFO:   #0 ../lib/igt_core.c:2055 __igt_f...
...
igt@kms_plane_cursor@viewport
igt@kms_plane_cursor@viewport
xe-2825-a958e31a81b3267201c85b6f171419586afa792c

(kms_plane_cursor:6675) CRITICAL: Test assertion failure function __igt_unique...
(kms_plane_cursor:6675) CRITICAL: Failed assertion: ret == 0 || errno == EINVAL
(kms_plane_cursor:6675) CRITICAL: Last errno: 95, Operation not supported
Test kms_plane_cursor failed.
**** DEBUG ****
(kms_plane_cursor:6675) igt_core-DEBUG: Notice: using IGT_DEVICE env:
(kms_plane_cursor:6675) igt_core-DEBUG: [pci:vendor=intel,device=discrete,card...
(kms_plane_cursor:6675) igt_core-INFO: Using IGT_SRANDOM=1742091376 for random...
(kms_plane_cursor:6675) drmtest-DEBUG: Looking for devices to open using filte...
(kms_plane_cursor:6675) drmtest-DEBUG: Filter matched /dev/dri/card0 | /dev/dr...
(kms_plane_cursor:6675) drmtest-INFO: Opened device: /dev/dri/card0
(kms_plane_cursor:6675) drmtest-DEBUG: Test requirement passed: !(fd<0)
(kms_plane_cursor:6675) CRITICAL: Test assertion failure function __igt_unique...
(kms_plane_cursor:6675) CRITICAL: Failed assertion: ret == 0 || errno == EINVAL
(kms_plane_cursor:6675) CRITICAL: Last errno: 95, Operation not supported
(kms_plane_cursor:6675) igt_core-INFO: Stack trace:
(kms_plane_cursor:6675) igt_core-INFO:   #0 ../lib/igt_core.c:2055 __igt_fail_...
...
igt@xe_pm@s2idle-vm-bind-prefetch
igt@xe_pm@s2idle-vm-bind-prefetch
xe-2825-a958e31a81b3267201c85b6f171419586afa792c

<6> [122.051206] [IGT] xe_pm: executing
<7> [122.102354] xe 0000:aa:00.0: [drm:xe_gt_resume [xe]] GT0: resuming
<7> [122.102930] xe 0000:aa:00.0: [drm:xe_reg_sr_apply_mmio [xe]] GT0: Applyin...
<7> [122.103259] xe 0000:aa:00.0: [drm:xe_reg_sr_apply_mmio [xe]] GT0: REG[0x9...
<7> [122.103497] xe 0000:aa:00.0: [drm:xe_reg_sr_apply_mmio [xe]] GT0: REG[0xb...
<7> [122.103732] xe 0000:aa:00.0: [drm:xe_reg_sr_apply_mmio [xe]] GT0: REG[0xc...
<7> [122.103943] xe 0000:aa:00.0: [drm:xe_reg_sr_apply_mmio [xe]] GT0: REG[0xc...
<7> [122.104193] xe 0000:aa:00.0: [drm:xe_reg_sr_apply_mmio [xe]] GT0: REG[0xc...
<7> [122.104401] xe 0000:aa:00.0: [drm:xe_reg_sr_apply_mmio [xe]] GT0: REG[0xc...
<7> [122.104612] xe 0000:aa:00.0: [drm:xe_wopcm_init [xe]] WOPCM: 4096K
<7> [122.104873] xe 0000:aa:00.0: [drm:xe_wopcm_init [xe]] GuC WOPCM is alread...
<7> [122.106638] xe 0000:aa:00.0: [drm:xe_guc_ads_populate [xe]] GT0: ADS capt...
<7> [122.107834] xe 0000:aa:00.0: [drm:__xe_guc_upload [xe]] GT0: load still i...
<7> [122.107995] xe 0000:aa:00.0: [drm:__xe_guc_upload [xe]] GT0: load still i...
<7> [122.118181] xe 0000:aa:00.0: [drm:__xe_guc_upload [xe]] GT0: init took 10...
<7> [122.119233] xe 0000:aa:00.0: [drm:xe_guc_ct_enable [xe]] GT0: GuC CT comm...
<7> [122.120870] xe 0000:aa:00.0: [drm:xe_mocs_init [xe]] GT0: flag:0x2
...
igt@xe_pm@s4-exec-after
igt@xe_pm@s4-exec-after
xe-2825-a958e31a81b3267201c85b6f171419586afa792c

<6> [121.604380] [IGT] xe_pm: executing
<7> [121.651955] xe 0000:aa:00.0: [drm:xe_gt_resume [xe]] GT0: resuming
<7> [121.652645] xe 0000:aa:00.0: [drm:xe_reg_sr_apply_mmio [xe]] GT0: Applyin...
<7> [121.652927] xe 0000:aa:00.0: [drm:xe_reg_sr_apply_mmio [xe]] GT0: REG[0x9...
<7> [121.653134] xe 0000:aa:00.0: [drm:xe_reg_sr_apply_mmio [xe]] GT0: REG[0xb...
<7> [121.653333] xe 0000:aa:00.0: [drm:xe_reg_sr_apply_mmio [xe]] GT0: REG[0xc...
<7> [121.653516] xe 0000:aa:00.0: [drm:xe_reg_sr_apply_mmio [xe]] GT0: REG[0xc...
<7> [121.653731] xe 0000:aa:00.0: [drm:xe_reg_sr_apply_mmio [xe]] GT0: REG[0xc...
<7> [121.653912] xe 0000:aa:00.0: [drm:xe_reg_sr_apply_mmio [xe]] GT0: REG[0xc...
<7> [121.654096] xe 0000:aa:00.0: [drm:xe_wopcm_init [xe]] WOPCM: 4096K
<7> [121.654325] xe 0000:aa:00.0: [drm:xe_wopcm_init [xe]] GuC WOPCM is alread...
<7> [121.658266] xe 0000:aa:00.0: [drm:xe_guc_ads_populate [xe]] GT0: ADS capt...
<7> [121.659760] xe 0000:aa:00.0: [drm:__xe_guc_upload [xe]] GT0: load still i...
<7> [121.659966] xe 0000:aa:00.0: [drm:__xe_guc_upload [xe]] GT0: load still i...
<7> [121.669873] xe 0000:aa:00.0: [drm:__xe_guc_upload [xe]] GT0: init took 10...
<7> [121.670810] xe 0000:aa:00.0: [drm:xe_guc_ct_enable [xe]] GT0: GuC CT comm...
<7> [121.673991] xe 0000:aa:00.0: [drm:xe_mocs_init [xe]] GT0: flag:0x2
...
igt@xe_pm@s4-mocs
igt@xe_pm@s4-mocs
xe-2825-a958e31a81b3267201c85b6f171419586afa792c

<6> [126.449785] [IGT] xe_pm: executing
<7> [126.495435] xe 0000:aa:00.0: [drm:xe_gt_resume [xe]] GT0: resuming
<7> [126.495980] xe 0000:aa:00.0: [drm:xe_reg_sr_apply_mmio [xe]] GT0: Applyin...
<7> [126.496194] xe 0000:aa:00.0: [drm:xe_reg_sr_apply_mmio [xe]] GT0: REG[0x9...
<7> [126.496356] xe 0000:aa:00.0: [drm:xe_reg_sr_apply_mmio [xe]] GT0: REG[0xb...
<7> [126.496513] xe 0000:aa:00.0: [drm:xe_reg_sr_apply_mmio [xe]] GT0: REG[0xc...
<7> [126.496650] xe 0000:aa:00.0: [drm:xe_reg_sr_apply_mmio [xe]] GT0: REG[0xc...
<7> [126.496786] xe 0000:aa:00.0: [drm:xe_reg_sr_apply_mmio [xe]] GT0: REG[0xc...
<7> [126.496923] xe 0000:aa:00.0: [drm:xe_reg_sr_apply_mmio [xe]] GT0: REG[0xc...
<7> [126.497062] xe 0000:aa:00.0: [drm:xe_wopcm_init [xe]] WOPCM: 4096K
<7> [126.497258] xe 0000:aa:00.0: [drm:xe_wopcm_init [xe]] GuC WOPCM is alread...
<7> [126.498777] xe 0000:aa:00.0: [drm:xe_guc_ads_populate [xe]] GT0: ADS capt...
<7> [126.499933] xe 0000:aa:00.0: [drm:__xe_guc_upload [xe]] GT0: load still i...
<7> [126.500079] xe 0000:aa:00.0: [drm:__xe_guc_upload [xe]] GT0: load still i...
<7> [126.511174] xe 0000:aa:00.0: [drm:__xe_guc_upload [xe]] GT0: init took 11...
<7> [126.512003] xe 0000:aa:00.0: [drm:xe_guc_ct_enable [xe]] GT0: GuC CT comm...
<7> [126.515942] xe 0000:aa:00.0: [drm:xe_mocs_init [xe]] GT0: flag:0x2
...
igt@xe_pm@s4-vm-bind-prefetch
igt@xe_pm@s4-vm-bind-prefetch
xe-2825-a958e31a81b3267201c85b6f171419586afa792c

<6> [126.774218] [IGT] xe_pm: executing
<7> [126.822605] xe 0000:aa:00.0: [drm:xe_gt_resume [xe]] GT0: resuming
<7> [126.823311] xe 0000:aa:00.0: [drm:xe_reg_sr_apply_mmio [xe]] GT0: Applyin...
<7> [126.823540] xe 0000:aa:00.0: [drm:xe_reg_sr_apply_mmio [xe]] GT0: REG[0x9...
<7> [126.823693] xe 0000:aa:00.0: [drm:xe_reg_sr_apply_mmio [xe]] GT0: REG[0xb...
<7> [126.823845] xe 0000:aa:00.0: [drm:xe_reg_sr_apply_mmio [xe]] GT0: REG[0xc...
<7> [126.824022] xe 0000:aa:00.0: [drm:xe_reg_sr_apply_mmio [xe]] GT0: REG[0xc...
<7> [126.824158] xe 0000:aa:00.0: [drm:xe_reg_sr_apply_mmio [xe]] GT0: REG[0xc...
<7> [126.824293] xe 0000:aa:00.0: [drm:xe_reg_sr_apply_mmio [xe]] GT0: REG[0xc...
<7> [126.824430] xe 0000:aa:00.0: [drm:xe_wopcm_init [xe]] WOPCM: 4096K
<7> [126.824605] xe 0000:aa:00.0: [drm:xe_wopcm_init [xe]] GuC WOPCM is alread...
<7> [126.826527] xe 0000:aa:00.0: [drm:xe_guc_ads_populate [xe]] GT0: ADS capt...
<7> [126.827791] xe 0000:aa:00.0: [drm:__xe_guc_upload [xe]] GT0: load still i...
<7> [126.837045] xe 0000:aa:00.0: [drm:__xe_guc_upload [xe]] GT0: init took 9m...
<7> [126.838499] xe 0000:aa:00.0: [drm:xe_guc_ct_enable [xe]] GT0: GuC CT comm...
<7> [126.841075] xe 0000:aa:00.0: [drm:xe_mocs_init [xe]] GT0: flag:0x2
<7> [126.841465] xe 0000:aa:00.0: [drm:xe_mocs_init [xe]] GT0: l3cc entries: 3
...
igt@xe_pmu@engine-activity-idle@engine-drm_xe_engine_class_copy1
igt@xe_pmu@engine-activity-idle@engine-drm_xe_engine_class_copy1
xe-2825-a958e31a81b3267201c85b6f171419586afa792c

Starting dynamic subtest: engine-DRM_XE_ENGINE_CLASS_COPY1
(xe_pmu:4513) CRITICAL: Test assertion failure function get_event_config, file...
(xe_pmu:4513) CRITICAL: Failed assertion: ret >= 0
(xe_pmu:4513) CRITICAL: Last errno: 2, No such file or directory
Dynamic subtest engine-DRM_XE_ENGINE_CLASS_COPY1 failed.
**** DEBUG ****
(xe_pmu:4513) CRITICAL: Test assertion failure function get_event_config, file...
(xe_pmu:4513) CRITICAL: Failed assertion: ret >= 0
(xe_pmu:4513) CRITICAL: Last errno: 2, No such file or directory
(xe_pmu:4513) igt_core-INFO: Stack trace:
(xe_pmu:4513) igt_core-INFO:   #0 ../lib/igt_core.c:2055 __igt_fail_assert()
(xe_pmu:4513) igt_core-INFO:   #1 ../tests/intel/xe_pmu.c:126 get_event_config()
(xe_pmu:4513) igt_core-INFO:   #2 ../tests/intel/xe_pmu.c:148 engine_activity()
(xe_pmu:4513) igt_core-INFO:   #3 ../tests/intel/xe_pmu.c:246 __igt_unique____...
(xe_pmu:4513) igt_core-INFO:   #4 ../tests/intel/xe_pmu.c:229 main()
(xe_pmu:4513) igt_core-INFO:   #5 [__libc_init_first+0x8a]
(xe_pmu:4513) igt_core-INFO:   #6 [__libc_start_main+0x8b]
...
igt@xe_pmu@engine-activity-idle@engine-drm_xe_engine_class_copy2
igt@xe_pmu@engine-activity-idle@engine-drm_xe_engine_class_copy2
xe-2825-a958e31a81b3267201c85b6f171419586afa792c

Starting dynamic subtest: engine-DRM_XE_ENGINE_CLASS_COPY2
(xe_pmu:4513) CRITICAL: Test assertion failure function get_event_config, file...
(xe_pmu:4513) CRITICAL: Failed assertion: ret >= 0
(xe_pmu:4513) CRITICAL: Last errno: 2, No such file or directory
Dynamic subtest engine-DRM_XE_ENGINE_CLASS_COPY2 failed.
**** DEBUG ****
(xe_pmu:4513) CRITICAL: Test assertion failure function get_event_config, file...
(xe_pmu:4513) CRITICAL: Failed assertion: ret >= 0
(xe_pmu:4513) CRITICAL: Last errno: 2, No such file or directory
(xe_pmu:4513) igt_core-INFO: Stack trace:
(xe_pmu:4513) igt_core-INFO:   #0 ../lib/igt_core.c:2055 __igt_fail_assert()
(xe_pmu:4513) igt_core-INFO:   #1 ../tests/intel/xe_pmu.c:126 get_event_config()
(xe_pmu:4513) igt_core-INFO:   #2 ../tests/intel/xe_pmu.c:148 engine_activity()
(xe_pmu:4513) igt_core-INFO:   #3 ../tests/intel/xe_pmu.c:246 __igt_unique____...
(xe_pmu:4513) igt_core-INFO:   #4 ../tests/intel/xe_pmu.c:229 main()
(xe_pmu:4513) igt_core-INFO:   #5 [__libc_init_first+0x8a]
(xe_pmu:4513) igt_core-INFO:   #6 [__libc_start_main+0x8b]
...
igt@xe_pmu@engine-activity-idle@engine-drm_xe_engine_class_copy3
igt@xe_pmu@engine-activity-idle@engine-drm_xe_engine_class_copy3
xe-2825-a958e31a81b3267201c85b6f171419586afa792c

Starting dynamic subtest: engine-DRM_XE_ENGINE_CLASS_COPY3
(xe_pmu:4513) CRITICAL: Test assertion failure function get_event_config, file...
(xe_pmu:4513) CRITICAL: Failed assertion: ret >= 0
(xe_pmu:4513) CRITICAL: Last errno: 2, No such file or directory
Dynamic subtest engine-DRM_XE_ENGINE_CLASS_COPY3 failed.
**** DEBUG ****
(xe_pmu:4513) CRITICAL: Test assertion failure function get_event_config, file...
(xe_pmu:4513) CRITICAL: Failed assertion: ret >= 0
(xe_pmu:4513) CRITICAL: Last errno: 2, No such file or directory
(xe_pmu:4513) igt_core-INFO: Stack trace:
(xe_pmu:4513) igt_core-INFO:   #0 ../lib/igt_core.c:2055 __igt_fail_assert()
(xe_pmu:4513) igt_core-INFO:   #1 ../tests/intel/xe_pmu.c:126 get_event_config()
(xe_pmu:4513) igt_core-INFO:   #2 ../tests/intel/xe_pmu.c:148 engine_activity()
(xe_pmu:4513) igt_core-INFO:   #3 ../tests/intel/xe_pmu.c:246 __igt_unique____...
(xe_pmu:4513) igt_core-INFO:   #4 ../tests/intel/xe_pmu.c:229 main()
(xe_pmu:4513) igt_core-INFO:   #5 [__libc_init_first+0x8a]
(xe_pmu:4513) igt_core-INFO:   #6 [__libc_start_main+0x8b]
...
igt@xe_pmu@engine-activity-idle@engine-drm_xe_engine_class_copy4
igt@xe_pmu@engine-activity-idle@engine-drm_xe_engine_class_copy4
xe-2825-a958e31a81b3267201c85b6f171419586afa792c

Starting dynamic subtest: engine-DRM_XE_ENGINE_CLASS_COPY4
(xe_pmu:4513) CRITICAL: Test assertion failure function get_event_config, file...
(xe_pmu:4513) CRITICAL: Failed assertion: ret >= 0
(xe_pmu:4513) CRITICAL: Last errno: 2, No such file or directory
Dynamic subtest engine-DRM_XE_ENGINE_CLASS_COPY4 failed.
**** DEBUG ****
(xe_pmu:4513) CRITICAL: Test assertion failure function get_event_config, file...
(xe_pmu:4513) CRITICAL: Failed assertion: ret >= 0
(xe_pmu:4513) CRITICAL: Last errno: 2, No such file or directory
(xe_pmu:4513) igt_core-INFO: Stack trace:
(xe_pmu:4513) igt_core-INFO:   #0 ../lib/igt_core.c:2055 __igt_fail_assert()
(xe_pmu:4513) igt_core-INFO:   #1 ../tests/intel/xe_pmu.c:126 get_event_config()
(xe_pmu:4513) igt_core-INFO:   #2 ../tests/intel/xe_pmu.c:148 engine_activity()
(xe_pmu:4513) igt_core-INFO:   #3 ../tests/intel/xe_pmu.c:246 __igt_unique____...
(xe_pmu:4513) igt_core-INFO:   #4 ../tests/intel/xe_pmu.c:229 main()
(xe_pmu:4513) igt_core-INFO:   #5 [__libc_init_first+0x8a]
(xe_pmu:4513) igt_core-INFO:   #6 [__libc_start_main+0x8b]
...
igt@xe_pmu@engine-activity-idle@engine-drm_xe_engine_class_copy5
igt@xe_pmu@engine-activity-idle@engine-drm_xe_engine_class_copy5
xe-2825-a958e31a81b3267201c85b6f171419586afa792c

Starting dynamic subtest: engine-DRM_XE_ENGINE_CLASS_COPY5
(xe_pmu:4513) CRITICAL: Test assertion failure function get_event_config, file...
(xe_pmu:4513) CRITICAL: Failed assertion: ret >= 0
(xe_pmu:4513) CRITICAL: Last errno: 2, No such file or directory
Dynamic subtest engine-DRM_XE_ENGINE_CLASS_COPY5 failed.
**** DEBUG ****
(xe_pmu:4513) CRITICAL: Test assertion failure function get_event_config, file...
(xe_pmu:4513) CRITICAL: Failed assertion: ret >= 0
(xe_pmu:4513) CRITICAL: Last errno: 2, No such file or directory
(xe_pmu:4513) igt_core-INFO: Stack trace:
(xe_pmu:4513) igt_core-INFO:   #0 ../lib/igt_core.c:2055 __igt_fail_assert()
(xe_pmu:4513) igt_core-INFO:   #1 ../tests/intel/xe_pmu.c:126 get_event_config()
(xe_pmu:4513) igt_core-INFO:   #2 ../tests/intel/xe_pmu.c:148 engine_activity()
(xe_pmu:4513) igt_core-INFO:   #3 ../tests/intel/xe_pmu.c:246 __igt_unique____...
(xe_pmu:4513) igt_core-INFO:   #4 ../tests/intel/xe_pmu.c:229 main()
(xe_pmu:4513) igt_core-INFO:   #5 [__libc_init_first+0x8a]
(xe_pmu:4513) igt_core-INFO:   #6 [__libc_start_main+0x8b]
...
igt@xe_pmu@engine-activity-load@engine-drm_xe_engine_class_copy1
igt@xe_pmu@engine-activity-load@engine-drm_xe_engine_class_copy1
xe-2825-a958e31a81b3267201c85b6f171419586afa792c

Starting dynamic subtest: engine-DRM_XE_ENGINE_CLASS_COPY1
(xe_pmu:4514) CRITICAL: Test assertion failure function get_event_config, file...
(xe_pmu:4514) CRITICAL: Failed assertion: ret >= 0
(xe_pmu:4514) CRITICAL: Last errno: 2, No such file or directory
Dynamic subtest engine-DRM_XE_ENGINE_CLASS_COPY1 failed.
**** DEBUG ****
(xe_pmu:4514) CRITICAL: Test assertion failure function get_event_config, file...
(xe_pmu:4514) CRITICAL: Failed assertion: ret >= 0
(xe_pmu:4514) CRITICAL: Last errno: 2, No such file or directory
(xe_pmu:4514) igt_core-INFO: Stack trace:
(xe_pmu:4514) igt_core-INFO:   #0 ../lib/igt_core.c:2055 __igt_fail_assert()
(xe_pmu:4514) igt_core-INFO:   #1 ../tests/intel/xe_pmu.c:126 get_event_config()
(xe_pmu:4514) igt_core-INFO:   #2 ../tests/intel/xe_pmu.c:148 engine_activity()
(xe_pmu:4514) igt_core-INFO:   #3 ../tests/intel/xe_pmu.c:254 __igt_unique____...
(xe_pmu:4514) igt_core-INFO:   #4 ../tests/intel/xe_pmu.c:229 main()
(xe_pmu:4514) igt_core-INFO:   #5 [__libc_init_first+0x8a]
(xe_pmu:4514) igt_core-INFO:   #6 [__libc_start_main+0x8b]
...
igt@xe_pmu@engine-activity-load@engine-drm_xe_engine_class_copy2
igt@xe_pmu@engine-activity-load@engine-drm_xe_engine_class_copy2
xe-2825-a958e31a81b3267201c85b6f171419586afa792c

Starting dynamic subtest: engine-DRM_XE_ENGINE_CLASS_COPY2
(xe_pmu:4514) CRITICAL: Test assertion failure function get_event_config, file...
(xe_pmu:4514) CRITICAL: Failed assertion: ret >= 0
(xe_pmu:4514) CRITICAL: Last errno: 2, No such file or directory
Dynamic subtest engine-DRM_XE_ENGINE_CLASS_COPY2 failed.
**** DEBUG ****
(xe_pmu:4514) CRITICAL: Test assertion failure function get_event_config, file...
(xe_pmu:4514) CRITICAL: Failed assertion: ret >= 0
(xe_pmu:4514) CRITICAL: Last errno: 2, No such file or directory
(xe_pmu:4514) igt_core-INFO: Stack trace:
(xe_pmu:4514) igt_core-INFO:   #0 ../lib/igt_core.c:2055 __igt_fail_assert()
(xe_pmu:4514) igt_core-INFO:   #1 ../tests/intel/xe_pmu.c:126 get_event_config()
(xe_pmu:4514) igt_core-INFO:   #2 ../tests/intel/xe_pmu.c:148 engine_activity()
(xe_pmu:4514) igt_core-INFO:   #3 ../tests/intel/xe_pmu.c:254 __igt_unique____...
(xe_pmu:4514) igt_core-INFO:   #4 ../tests/intel/xe_pmu.c:229 main()
(xe_pmu:4514) igt_core-INFO:   #5 [__libc_init_first+0x8a]
(xe_pmu:4514) igt_core-INFO:   #6 [__libc_start_main+0x8b]
...
igt@xe_pmu@engine-activity-load@engine-drm_xe_engine_class_copy3
igt@xe_pmu@engine-activity-load@engine-drm_xe_engine_class_copy3
xe-2825-a958e31a81b3267201c85b6f171419586afa792c

Starting dynamic subtest: engine-DRM_XE_ENGINE_CLASS_COPY3
(xe_pmu:4514) CRITICAL: Test assertion failure function get_event_config, file...
(xe_pmu:4514) CRITICAL: Failed assertion: ret >= 0
(xe_pmu:4514) CRITICAL: Last errno: 2, No such file or directory
Dynamic subtest engine-DRM_XE_ENGINE_CLASS_COPY3 failed.
**** DEBUG ****
(xe_pmu:4514) CRITICAL: Test assertion failure function get_event_config, file...
(xe_pmu:4514) CRITICAL: Failed assertion: ret >= 0
(xe_pmu:4514) CRITICAL: Last errno: 2, No such file or directory
(xe_pmu:4514) igt_core-INFO: Stack trace:
(xe_pmu:4514) igt_core-INFO:   #0 ../lib/igt_core.c:2055 __igt_fail_assert()
(xe_pmu:4514) igt_core-INFO:   #1 ../tests/intel/xe_pmu.c:126 get_event_config()
(xe_pmu:4514) igt_core-INFO:   #2 ../tests/intel/xe_pmu.c:148 engine_activity()
(xe_pmu:4514) igt_core-INFO:   #3 ../tests/intel/xe_pmu.c:254 __igt_unique____...
(xe_pmu:4514) igt_core-INFO:   #4 ../tests/intel/xe_pmu.c:229 main()
(xe_pmu:4514) igt_core-INFO:   #5 [__libc_init_first+0x8a]
(xe_pmu:4514) igt_core-INFO:   #6 [__libc_start_main+0x8b]
...
igt@xe_pmu@engine-activity-load@engine-drm_xe_engine_class_copy4
igt@xe_pmu@engine-activity-load@engine-drm_xe_engine_class_copy4
xe-2825-a958e31a81b3267201c85b6f171419586afa792c

Starting dynamic subtest: engine-DRM_XE_ENGINE_CLASS_COPY4
(xe_pmu:4514) CRITICAL: Test assertion failure function get_event_config, file...
(xe_pmu:4514) CRITICAL: Failed assertion: ret >= 0
(xe_pmu:4514) CRITICAL: Last errno: 2, No such file or directory
Dynamic subtest engine-DRM_XE_ENGINE_CLASS_COPY4 failed.
**** DEBUG ****
(xe_pmu:4514) CRITICAL: Test assertion failure function get_event_config, file...
(xe_pmu:4514) CRITICAL: Failed assertion: ret >= 0
(xe_pmu:4514) CRITICAL: Last errno: 2, No such file or directory
(xe_pmu:4514) igt_core-INFO: Stack trace:
(xe_pmu:4514) igt_core-INFO:   #0 ../lib/igt_core.c:2055 __igt_fail_assert()
(xe_pmu:4514) igt_core-INFO:   #1 ../tests/intel/xe_pmu.c:126 get_event_config()
(xe_pmu:4514) igt_core-INFO:   #2 ../tests/intel/xe_pmu.c:148 engine_activity()
(xe_pmu:4514) igt_core-INFO:   #3 ../tests/intel/xe_pmu.c:254 __igt_unique____...
(xe_pmu:4514) igt_core-INFO:   #4 ../tests/intel/xe_pmu.c:229 main()
(xe_pmu:4514) igt_core-INFO:   #5 [__libc_init_first+0x8a]
(xe_pmu:4514) igt_core-INFO:   #6 [__libc_start_main+0x8b]
...
igt@xe_pmu@engine-activity-load@engine-drm_xe_engine_class_copy5
igt@xe_pmu@engine-activity-load@engine-drm_xe_engine_class_copy5
xe-2825-a958e31a81b3267201c85b6f171419586afa792c

Starting dynamic subtest: engine-DRM_XE_ENGINE_CLASS_COPY5
(xe_pmu:4514) CRITICAL: Test assertion failure function get_event_config, file...
(xe_pmu:4514) CRITICAL: Failed assertion: ret >= 0
(xe_pmu:4514) CRITICAL: Last errno: 2, No such file or directory
Dynamic subtest engine-DRM_XE_ENGINE_CLASS_COPY5 failed.
**** DEBUG ****
(xe_pmu:4514) CRITICAL: Test assertion failure function get_event_config, file...
(xe_pmu:4514) CRITICAL: Failed assertion: ret >= 0
(xe_pmu:4514) CRITICAL: Last errno: 2, No such file or directory
(xe_pmu:4514) igt_core-INFO: Stack trace:
(xe_pmu:4514) igt_core-INFO:   #0 ../lib/igt_core.c:2055 __igt_fail_assert()
(xe_pmu:4514) igt_core-INFO:   #1 ../tests/intel/xe_pmu.c:126 get_event_config()
(xe_pmu:4514) igt_core-INFO:   #2 ../tests/intel/xe_pmu.c:148 engine_activity()
(xe_pmu:4514) igt_core-INFO:   #3 ../tests/intel/xe_pmu.c:254 __igt_unique____...
(xe_pmu:4514) igt_core-INFO:   #4 ../tests/intel/xe_pmu.c:229 main()
(xe_pmu:4514) igt_core-INFO:   #5 [__libc_init_first+0x8a]
(xe_pmu:4514) igt_core-INFO:   #6 [__libc_start_main+0x8b]
...
igt@xe_pmu@engine-activity-load-idle@engine-drm_xe_engine_class_copy1
igt@xe_pmu@engine-activity-load-idle@engine-drm_xe_engine_class_copy1
xe-2825-a958e31a81b3267201c85b6f171419586afa792c

Starting dynamic subtest: engine-DRM_XE_ENGINE_CLASS_COPY1
(xe_pmu:4516) CRITICAL: Test assertion failure function get_event_config, file...
(xe_pmu:4516) CRITICAL: Failed assertion: ret >= 0
(xe_pmu:4516) CRITICAL: Last errno: 2, No such file or directory
Dynamic subtest engine-DRM_XE_ENGINE_CLASS_COPY1 failed.
**** DEBUG ****
(xe_pmu:4516) CRITICAL: Test assertion failure function get_event_config, file...
(xe_pmu:4516) CRITICAL: Failed assertion: ret >= 0
(xe_pmu:4516) CRITICAL: Last errno: 2, No such file or directory
(xe_pmu:4516) igt_core-INFO: Stack trace:
(xe_pmu:4516) igt_core-INFO:   #0 ../lib/igt_core.c:2055 __igt_fail_assert()
(xe_pmu:4516) igt_core-INFO:   #1 ../tests/intel/xe_pmu.c:126 get_event_config()
(xe_pmu:4516) igt_core-INFO:   #2 ../tests/intel/xe_pmu.c:148 engine_activity()
(xe_pmu:4516) igt_core-INFO:   #3 ../tests/intel/xe_pmu.c:250 __igt_unique____...
(xe_pmu:4516) igt_core-INFO:   #4 ../tests/intel/xe_pmu.c:229 main()
(xe_pmu:4516) igt_core-INFO:   #5 [__libc_init_first+0x8a]
(xe_pmu:4516) igt_core-INFO:   #6 [__libc_start_main+0x8b]
...
igt@xe_pmu@engine-activity-load-idle@engine-drm_xe_engine_class_copy2
igt@xe_pmu@engine-activity-load-idle@engine-drm_xe_engine_class_copy2
xe-2825-a958e31a81b3267201c85b6f171419586afa792c

Starting dynamic subtest: engine-DRM_XE_ENGINE_CLASS_COPY2
(xe_pmu:4516) CRITICAL: Test assertion failure function get_event_config, file...
(xe_pmu:4516) CRITICAL: Failed assertion: ret >= 0
(xe_pmu:4516) CRITICAL: Last errno: 2, No such file or directory
Dynamic subtest engine-DRM_XE_ENGINE_CLASS_COPY2 failed.
**** DEBUG ****
(xe_pmu:4516) CRITICAL: Test assertion failure function get_event_config, file...
(xe_pmu:4516) CRITICAL: Failed assertion: ret >= 0
(xe_pmu:4516) CRITICAL: Last errno: 2, No such file or directory
(xe_pmu:4516) igt_core-INFO: Stack trace:
(xe_pmu:4516) igt_core-INFO:   #0 ../lib/igt_core.c:2055 __igt_fail_assert()
(xe_pmu:4516) igt_core-INFO:   #1 ../tests/intel/xe_pmu.c:126 get_event_config()
(xe_pmu:4516) igt_core-INFO:   #2 ../tests/intel/xe_pmu.c:148 engine_activity()
(xe_pmu:4516) igt_core-INFO:   #3 ../tests/intel/xe_pmu.c:250 __igt_unique____...
(xe_pmu:4516) igt_core-INFO:   #4 ../tests/intel/xe_pmu.c:229 main()
(xe_pmu:4516) igt_core-INFO:   #5 [__libc_init_first+0x8a]
(xe_pmu:4516) igt_core-INFO:   #6 [__libc_start_main+0x8b]
...
igt@xe_pmu@engine-activity-load-idle@engine-drm_xe_engine_class_copy3
igt@xe_pmu@engine-activity-load-idle@engine-drm_xe_engine_class_copy3
xe-2825-a958e31a81b3267201c85b6f171419586afa792c

Starting dynamic subtest: engine-DRM_XE_ENGINE_CLASS_COPY3
(xe_pmu:4516) CRITICAL: Test assertion failure function get_event_config, file...
(xe_pmu:4516) CRITICAL: Failed assertion: ret >= 0
(xe_pmu:4516) CRITICAL: Last errno: 2, No such file or directory
Dynamic subtest engine-DRM_XE_ENGINE_CLASS_COPY3 failed.
**** DEBUG ****
(xe_pmu:4516) CRITICAL: Test assertion failure function get_event_config, file...
(xe_pmu:4516) CRITICAL: Failed assertion: ret >= 0
(xe_pmu:4516) CRITICAL: Last errno: 2, No such file or directory
(xe_pmu:4516) igt_core-INFO: Stack trace:
(xe_pmu:4516) igt_core-INFO:   #0 ../lib/igt_core.c:2055 __igt_fail_assert()
(xe_pmu:4516) igt_core-INFO:   #1 ../tests/intel/xe_pmu.c:126 get_event_config()
(xe_pmu:4516) igt_core-INFO:   #2 ../tests/intel/xe_pmu.c:148 engine_activity()
(xe_pmu:4516) igt_core-INFO:   #3 ../tests/intel/xe_pmu.c:250 __igt_unique____...
(xe_pmu:4516) igt_core-INFO:   #4 ../tests/intel/xe_pmu.c:229 main()
(xe_pmu:4516) igt_core-INFO:   #5 [__libc_init_first+0x8a]
(xe_pmu:4516) igt_core-INFO:   #6 [__libc_start_main+0x8b]
...
igt@xe_pmu@engine-activity-load-idle@engine-drm_xe_engine_class_copy4
igt@xe_pmu@engine-activity-load-idle@engine-drm_xe_engine_class_copy4
xe-2825-a958e31a81b3267201c85b6f171419586afa792c

Starting dynamic subtest: engine-DRM_XE_ENGINE_CLASS_COPY4
(xe_pmu:4516) CRITICAL: Test assertion failure function get_event_config, file...
(xe_pmu:4516) CRITICAL: Failed assertion: ret >= 0
(xe_pmu:4516) CRITICAL: Last errno: 2, No such file or directory
Dynamic subtest engine-DRM_XE_ENGINE_CLASS_COPY4 failed.
**** DEBUG ****
(xe_pmu:4516) CRITICAL: Test assertion failure function get_event_config, file...
(xe_pmu:4516) CRITICAL: Failed assertion: ret >= 0
(xe_pmu:4516) CRITICAL: Last errno: 2, No such file or directory
(xe_pmu:4516) igt_core-INFO: Stack trace:
(xe_pmu:4516) igt_core-INFO:   #0 ../lib/igt_core.c:2055 __igt_fail_assert()
(xe_pmu:4516) igt_core-INFO:   #1 ../tests/intel/xe_pmu.c:126 get_event_config()
(xe_pmu:4516) igt_core-INFO:   #2 ../tests/intel/xe_pmu.c:148 engine_activity()
(xe_pmu:4516) igt_core-INFO:   #3 ../tests/intel/xe_pmu.c:250 __igt_unique____...
(xe_pmu:4516) igt_core-INFO:   #4 ../tests/intel/xe_pmu.c:229 main()
(xe_pmu:4516) igt_core-INFO:   #5 [__libc_init_first+0x8a]
(xe_pmu:4516) igt_core-INFO:   #6 [__libc_start_main+0x8b]
...
igt@xe_pmu@engine-activity-load-idle@engine-drm_xe_engine_class_copy5
igt@xe_pmu@engine-activity-load-idle@engine-drm_xe_engine_class_copy5
xe-2825-a958e31a81b3267201c85b6f171419586afa792c

Starting dynamic subtest: engine-DRM_XE_ENGINE_CLASS_COPY5
(xe_pmu:4516) CRITICAL: Test assertion failure function get_event_config, file...
(xe_pmu:4516) CRITICAL: Failed assertion: ret >= 0
(xe_pmu:4516) CRITICAL: Last errno: 2, No such file or directory
Dynamic subtest engine-DRM_XE_ENGINE_CLASS_COPY5 failed.
**** DEBUG ****
(xe_pmu:4516) CRITICAL: Test assertion failure function get_event_config, file...
(xe_pmu:4516) CRITICAL: Failed assertion: ret >= 0
(xe_pmu:4516) CRITICAL: Last errno: 2, No such file or directory
(xe_pmu:4516) igt_core-INFO: Stack trace:
(xe_pmu:4516) igt_core-INFO:   #0 ../lib/igt_core.c:2055 __igt_fail_assert()
(xe_pmu:4516) igt_core-INFO:   #1 ../tests/intel/xe_pmu.c:126 get_event_config()
(xe_pmu:4516) igt_core-INFO:   #2 ../tests/intel/xe_pmu.c:148 engine_activity()
(xe_pmu:4516) igt_core-INFO:   #3 ../tests/intel/xe_pmu.c:250 __igt_unique____...
(xe_pmu:4516) igt_core-INFO:   #4 ../tests/intel/xe_pmu.c:229 main()
(xe_pmu:4516) igt_core-INFO:   #5 [__libc_init_first+0x8a]
(xe_pmu:4516) igt_core-INFO:   #6 [__libc_start_main+0x8b]
...
Created at 2025-03-24 10:25:09