FAIL WARN PASS SKIP TIMEOUT NOT RUN INCOMPLETE ABORT CRASH
 
xe-1951-7a8eccb85643c21e82007be3ae31bbca47611079
igt@kms_ccs@crc-primary-basic-4-tiled-dg2-rc-ccs-cc
igt@kms_ccs@crc-primary-basic-4-tiled-dg2-rc-ccs-cc
xe-1951-7a8eccb85643c21e82007be3ae31bbca47611079

Starting subtest: crc-primary-basic-4-tiled-dg2-rc-ccs-cc
Starting dynamic subtest: pipe-A-DP-2
(kms_ccs:4838) igt_pipe_crc-CRITICAL: Test assertion failure function igt_asse...
(kms_ccs:4838) igt_pipe_crc-CRITICAL: Failed assertion: !mismatch || igt_skip_...
Dynamic subtest pipe-A-DP-2 failed.
**** DEBUG ****
(kms_ccs:4838) igt_kms-DEBUG: plane D.0: Setting property "rotation" to 0x1/1
(kms_ccs:4838) igt_kms-DEBUG: plane D.0: Setting property "COLOR_ENCODING" to ...
(kms_ccs:4838) igt_kms-DEBUG: plane D.0: Setting property "COLOR_RANGE" to 0x0/0
(kms_ccs:4838) igt_kms-DEBUG: plane D.0: Setting property "pixel blend mode" t...
(kms_ccs:4838) igt_kms-DEBUG: plane D.0: Setting property "alpha" to 0xffff/65...
(kms_ccs:4838) igt_kms-DEBUG: plane D.0: Setting property "FB_DAMAGE_CLIPS" to...
(kms_ccs:4838) igt_kms-DEBUG: plane D.0: Setting property "SCALING_FILTER" to ...
(kms_ccs:4838) igt_kms-DEBUG: display:     populating plane data: D.1, fb 0
(kms_ccs:4838) igt_kms-DEBUG: plane D.1: Setting property "SRC_X" to 0x0/0
(kms_ccs:4838) igt_kms-DEBUG: plane D.1: Setting property "SRC_Y" to 0x0/0
(kms_ccs:4838) igt_kms-DEBUG: plane D.1: Setting property "SRC_W" to 0x0/0
...
igt@kms_ccs@crc-primary-basic-4-tiled-dg2-rc-ccs-cc@pipe-a-dp-2
igt@kms_ccs@crc-primary-basic-4-tiled-dg2-rc-ccs-cc@pipe-a-dp-2
xe-1951-7a8eccb85643c21e82007be3ae31bbca47611079

Starting subtest: crc-primary-basic-4-tiled-dg2-rc-ccs-cc
Starting dynamic subtest: pipe-A-DP-2
(kms_ccs:4838) igt_pipe_crc-CRITICAL: Test assertion failure function igt_asse...
(kms_ccs:4838) igt_pipe_crc-CRITICAL: Failed assertion: !mismatch || igt_skip_...
Dynamic subtest pipe-A-DP-2 failed.
**** DEBUG ****
(kms_ccs:4838) igt_kms-DEBUG: plane D.0: Setting property "rotation" to 0x1/1
(kms_ccs:4838) igt_kms-DEBUG: plane D.0: Setting property "COLOR_ENCODING" to ...
(kms_ccs:4838) igt_kms-DEBUG: plane D.0: Setting property "COLOR_RANGE" to 0x0/0
(kms_ccs:4838) igt_kms-DEBUG: plane D.0: Setting property "pixel blend mode" t...
(kms_ccs:4838) igt_kms-DEBUG: plane D.0: Setting property "alpha" to 0xffff/65...
(kms_ccs:4838) igt_kms-DEBUG: plane D.0: Setting property "FB_DAMAGE_CLIPS" to...
(kms_ccs:4838) igt_kms-DEBUG: plane D.0: Setting property "SCALING_FILTER" to ...
(kms_ccs:4838) igt_kms-DEBUG: display:     populating plane data: D.1, fb 0
(kms_ccs:4838) igt_kms-DEBUG: plane D.1: Setting property "SRC_X" to 0x0/0
(kms_ccs:4838) igt_kms-DEBUG: plane D.1: Setting property "SRC_Y" to 0x0/0
(kms_ccs:4838) igt_kms-DEBUG: plane D.1: Setting property "SRC_W" to 0x0/0
...
igt@kms_ccs@crc-primary-basic-4-tiled-dg2-rc-ccs-cc@pipe-b-dp-2
igt@kms_ccs@crc-primary-basic-4-tiled-dg2-rc-ccs-cc@pipe-b-dp-2
xe-1951-7a8eccb85643c21e82007be3ae31bbca47611079

Starting dynamic subtest: pipe-B-DP-2
(kms_ccs:4838) igt_pipe_crc-CRITICAL: Test assertion failure function igt_asse...
(kms_ccs:4838) igt_pipe_crc-CRITICAL: Failed assertion: !mismatch || igt_skip_...
Dynamic subtest pipe-B-DP-2 failed.
**** DEBUG ****
(kms_ccs:4838) igt_kms-DEBUG: plane D.0: Setting property "rotation" to 0x1/1
(kms_ccs:4838) igt_kms-DEBUG: plane D.0: Setting property "COLOR_ENCODING" to ...
(kms_ccs:4838) igt_kms-DEBUG: plane D.0: Setting property "COLOR_RANGE" to 0x0/0
(kms_ccs:4838) igt_kms-DEBUG: plane D.0: Setting property "pixel blend mode" t...
(kms_ccs:4838) igt_kms-DEBUG: plane D.0: Setting property "alpha" to 0xffff/65...
(kms_ccs:4838) igt_kms-DEBUG: plane D.0: Setting property "FB_DAMAGE_CLIPS" to...
(kms_ccs:4838) igt_kms-DEBUG: plane D.0: Setting property "SCALING_FILTER" to ...
(kms_ccs:4838) igt_kms-DEBUG: display:     populating plane data: D.1, fb 0
(kms_ccs:4838) igt_kms-DEBUG: plane D.1: Setting property "SRC_X" to 0x0/0
(kms_ccs:4838) igt_kms-DEBUG: plane D.1: Setting property "SRC_Y" to 0x0/0
(kms_ccs:4838) igt_kms-DEBUG: plane D.1: Setting property "SRC_W" to 0x0/0
(kms_ccs:4838) igt_kms-DEBUG: plane D.1: Setting property "SRC_H" to 0x0/0
...
igt@kms_ccs@crc-primary-basic-4-tiled-dg2-rc-ccs-cc@pipe-c-dp-2
igt@kms_ccs@crc-primary-basic-4-tiled-dg2-rc-ccs-cc@pipe-c-dp-2
xe-1951-7a8eccb85643c21e82007be3ae31bbca47611079

Starting dynamic subtest: pipe-C-DP-2
(kms_ccs:4838) igt_pipe_crc-CRITICAL: Test assertion failure function igt_asse...
(kms_ccs:4838) igt_pipe_crc-CRITICAL: Failed assertion: !mismatch || igt_skip_...
Dynamic subtest pipe-C-DP-2 failed.
**** DEBUG ****
(kms_ccs:4838) igt_kms-DEBUG: plane D.0: Setting property "rotation" to 0x1/1
(kms_ccs:4838) igt_kms-DEBUG: plane D.0: Setting property "COLOR_ENCODING" to ...
(kms_ccs:4838) igt_kms-DEBUG: plane D.0: Setting property "COLOR_RANGE" to 0x0/0
(kms_ccs:4838) igt_kms-DEBUG: plane D.0: Setting property "pixel blend mode" t...
(kms_ccs:4838) igt_kms-DEBUG: plane D.0: Setting property "alpha" to 0xffff/65...
(kms_ccs:4838) igt_kms-DEBUG: plane D.0: Setting property "FB_DAMAGE_CLIPS" to...
(kms_ccs:4838) igt_kms-DEBUG: plane D.0: Setting property "SCALING_FILTER" to ...
(kms_ccs:4838) igt_kms-DEBUG: display:     populating plane data: D.1, fb 0
(kms_ccs:4838) igt_kms-DEBUG: plane D.1: Setting property "SRC_X" to 0x0/0
(kms_ccs:4838) igt_kms-DEBUG: plane D.1: Setting property "SRC_Y" to 0x0/0
(kms_ccs:4838) igt_kms-DEBUG: plane D.1: Setting property "SRC_W" to 0x0/0
(kms_ccs:4838) igt_kms-DEBUG: plane D.1: Setting property "SRC_H" to 0x0/0
...
igt@kms_ccs@crc-primary-basic-4-tiled-dg2-rc-ccs-cc@pipe-d-dp-2
igt@kms_ccs@crc-primary-basic-4-tiled-dg2-rc-ccs-cc@pipe-d-dp-2
xe-1951-7a8eccb85643c21e82007be3ae31bbca47611079

Starting dynamic subtest: pipe-D-DP-2
(kms_ccs:4838) igt_pipe_crc-CRITICAL: Test assertion failure function igt_asse...
(kms_ccs:4838) igt_pipe_crc-CRITICAL: Failed assertion: !mismatch || igt_skip_...
Dynamic subtest pipe-D-DP-2 failed.
**** DEBUG ****
(kms_ccs:4838) igt_kms-DEBUG: plane D.0: Setting property "rotation" to 0x1/1
(kms_ccs:4838) igt_kms-DEBUG: plane D.0: Setting property "COLOR_ENCODING" to ...
(kms_ccs:4838) igt_kms-DEBUG: plane D.0: Setting property "COLOR_RANGE" to 0x0/0
(kms_ccs:4838) igt_kms-DEBUG: plane D.0: Setting property "pixel blend mode" t...
(kms_ccs:4838) igt_kms-DEBUG: plane D.0: Setting property "alpha" to 0xffff/65...
(kms_ccs:4838) igt_kms-DEBUG: plane D.0: Setting property "FB_DAMAGE_CLIPS" to...
(kms_ccs:4838) igt_kms-DEBUG: plane D.0: Setting property "SCALING_FILTER" to ...
(kms_ccs:4838) igt_kms-DEBUG: display:     populating plane data: D.1, fb 0
(kms_ccs:4838) igt_kms-DEBUG: plane D.1: Setting property "SRC_X" to 0x0/0
(kms_ccs:4838) igt_kms-DEBUG: plane D.1: Setting property "SRC_Y" to 0x0/0
(kms_ccs:4838) igt_kms-DEBUG: plane D.1: Setting property "SRC_W" to 0x0/0
(kms_ccs:4838) igt_kms-DEBUG: plane D.1: Setting property "SRC_H" to 0x0/0
...
igt@kms_ccs@crc-primary-rotation-180-4-tiled-dg2-rc-ccs-cc
igt@kms_ccs@crc-primary-rotation-180-4-tiled-dg2-rc-ccs-cc
xe-1951-7a8eccb85643c21e82007be3ae31bbca47611079

Starting subtest: crc-primary-rotation-180-4-tiled-dg2-rc-ccs-cc
Starting dynamic subtest: pipe-A-DP-2
(kms_ccs:4924) igt_pipe_crc-CRITICAL: Test assertion failure function igt_asse...
(kms_ccs:4924) igt_pipe_crc-CRITICAL: Failed assertion: !mismatch || igt_skip_...
Dynamic subtest pipe-A-DP-2 failed.
**** DEBUG ****
(kms_ccs:4924) igt_kms-DEBUG: plane D.0: Setting property "pixel blend mode" t...
(kms_ccs:4924) igt_kms-DEBUG: plane D.0: Setting property "alpha" to 0xffff/65...
(kms_ccs:4924) igt_kms-DEBUG: plane D.0: Setting property "FB_DAMAGE_CLIPS" to...
(kms_ccs:4924) igt_kms-DEBUG: plane D.0: Setting property "SCALING_FILTER" to ...
(kms_ccs:4924) igt_kms-DEBUG: display:     populating plane data: D.1, fb 0
(kms_ccs:4924) igt_kms-DEBUG: plane D.1: Setting property "SRC_X" to 0x0/0
(kms_ccs:4924) igt_kms-DEBUG: plane D.1: Setting property "SRC_Y" to 0x0/0
(kms_ccs:4924) igt_kms-DEBUG: plane D.1: Setting property "SRC_W" to 0x0/0
(kms_ccs:4924) igt_kms-DEBUG: plane D.1: Setting property "SRC_H" to 0x0/0
(kms_ccs:4924) igt_kms-DEBUG: plane D.1: Setting property "CRTC_X" to 0x0/0
(kms_ccs:4924) igt_kms-DEBUG: plane D.1: Setting property "CRTC_Y" to 0x0/0
...
igt@kms_ccs@crc-primary-rotation-180-4-tiled-dg2-rc-ccs-cc@pipe-a-dp-2
igt@kms_ccs@crc-primary-rotation-180-4-tiled-dg2-rc-ccs-cc@pipe-a-dp-2
xe-1951-7a8eccb85643c21e82007be3ae31bbca47611079

Starting subtest: crc-primary-rotation-180-4-tiled-dg2-rc-ccs-cc
Starting dynamic subtest: pipe-A-DP-2
(kms_ccs:4924) igt_pipe_crc-CRITICAL: Test assertion failure function igt_asse...
(kms_ccs:4924) igt_pipe_crc-CRITICAL: Failed assertion: !mismatch || igt_skip_...
Dynamic subtest pipe-A-DP-2 failed.
**** DEBUG ****
(kms_ccs:4924) igt_kms-DEBUG: plane D.0: Setting property "pixel blend mode" t...
(kms_ccs:4924) igt_kms-DEBUG: plane D.0: Setting property "alpha" to 0xffff/65...
(kms_ccs:4924) igt_kms-DEBUG: plane D.0: Setting property "FB_DAMAGE_CLIPS" to...
(kms_ccs:4924) igt_kms-DEBUG: plane D.0: Setting property "SCALING_FILTER" to ...
(kms_ccs:4924) igt_kms-DEBUG: display:     populating plane data: D.1, fb 0
(kms_ccs:4924) igt_kms-DEBUG: plane D.1: Setting property "SRC_X" to 0x0/0
(kms_ccs:4924) igt_kms-DEBUG: plane D.1: Setting property "SRC_Y" to 0x0/0
(kms_ccs:4924) igt_kms-DEBUG: plane D.1: Setting property "SRC_W" to 0x0/0
(kms_ccs:4924) igt_kms-DEBUG: plane D.1: Setting property "SRC_H" to 0x0/0
(kms_ccs:4924) igt_kms-DEBUG: plane D.1: Setting property "CRTC_X" to 0x0/0
(kms_ccs:4924) igt_kms-DEBUG: plane D.1: Setting property "CRTC_Y" to 0x0/0
...
igt@kms_ccs@crc-primary-rotation-180-4-tiled-dg2-rc-ccs-cc@pipe-b-dp-2
igt@kms_ccs@crc-primary-rotation-180-4-tiled-dg2-rc-ccs-cc@pipe-b-dp-2
xe-1951-7a8eccb85643c21e82007be3ae31bbca47611079

Starting dynamic subtest: pipe-B-DP-2
(kms_ccs:4924) igt_pipe_crc-CRITICAL: Test assertion failure function igt_asse...
(kms_ccs:4924) igt_pipe_crc-CRITICAL: Failed assertion: !mismatch || igt_skip_...
Dynamic subtest pipe-B-DP-2 failed.
**** DEBUG ****
(kms_ccs:4924) igt_kms-DEBUG: plane D.0: Setting property "pixel blend mode" t...
(kms_ccs:4924) igt_kms-DEBUG: plane D.0: Setting property "alpha" to 0xffff/65...
(kms_ccs:4924) igt_kms-DEBUG: plane D.0: Setting property "FB_DAMAGE_CLIPS" to...
(kms_ccs:4924) igt_kms-DEBUG: plane D.0: Setting property "SCALING_FILTER" to ...
(kms_ccs:4924) igt_kms-DEBUG: display:     populating plane data: D.1, fb 0
(kms_ccs:4924) igt_kms-DEBUG: plane D.1: Setting property "SRC_X" to 0x0/0
(kms_ccs:4924) igt_kms-DEBUG: plane D.1: Setting property "SRC_Y" to 0x0/0
(kms_ccs:4924) igt_kms-DEBUG: plane D.1: Setting property "SRC_W" to 0x0/0
(kms_ccs:4924) igt_kms-DEBUG: plane D.1: Setting property "SRC_H" to 0x0/0
(kms_ccs:4924) igt_kms-DEBUG: plane D.1: Setting property "CRTC_X" to 0x0/0
(kms_ccs:4924) igt_kms-DEBUG: plane D.1: Setting property "CRTC_Y" to 0x0/0
(kms_ccs:4924) igt_kms-DEBUG: plane D.1: Setting property "CRTC_W" to 0x0/0
...
igt@kms_ccs@crc-primary-rotation-180-4-tiled-dg2-rc-ccs-cc@pipe-c-dp-2
igt@kms_ccs@crc-primary-rotation-180-4-tiled-dg2-rc-ccs-cc@pipe-c-dp-2
xe-1951-7a8eccb85643c21e82007be3ae31bbca47611079

Starting dynamic subtest: pipe-C-DP-2
(kms_ccs:4924) igt_pipe_crc-CRITICAL: Test assertion failure function igt_asse...
(kms_ccs:4924) igt_pipe_crc-CRITICAL: Failed assertion: !mismatch || igt_skip_...
Dynamic subtest pipe-C-DP-2 failed.
**** DEBUG ****
(kms_ccs:4924) igt_kms-DEBUG: plane D.0: Setting property "pixel blend mode" t...
(kms_ccs:4924) igt_kms-DEBUG: plane D.0: Setting property "alpha" to 0xffff/65...
(kms_ccs:4924) igt_kms-DEBUG: plane D.0: Setting property "FB_DAMAGE_CLIPS" to...
(kms_ccs:4924) igt_kms-DEBUG: plane D.0: Setting property "SCALING_FILTER" to ...
(kms_ccs:4924) igt_kms-DEBUG: display:     populating plane data: D.1, fb 0
(kms_ccs:4924) igt_kms-DEBUG: plane D.1: Setting property "SRC_X" to 0x0/0
(kms_ccs:4924) igt_kms-DEBUG: plane D.1: Setting property "SRC_Y" to 0x0/0
(kms_ccs:4924) igt_kms-DEBUG: plane D.1: Setting property "SRC_W" to 0x0/0
(kms_ccs:4924) igt_kms-DEBUG: plane D.1: Setting property "SRC_H" to 0x0/0
(kms_ccs:4924) igt_kms-DEBUG: plane D.1: Setting property "CRTC_X" to 0x0/0
(kms_ccs:4924) igt_kms-DEBUG: plane D.1: Setting property "CRTC_Y" to 0x0/0
(kms_ccs:4924) igt_kms-DEBUG: plane D.1: Setting property "CRTC_W" to 0x0/0
...
igt@kms_ccs@crc-primary-rotation-180-4-tiled-dg2-rc-ccs-cc@pipe-d-dp-2
igt@kms_ccs@crc-primary-rotation-180-4-tiled-dg2-rc-ccs-cc@pipe-d-dp-2
xe-1951-7a8eccb85643c21e82007be3ae31bbca47611079

Starting dynamic subtest: pipe-D-DP-2
(kms_ccs:4924) igt_pipe_crc-CRITICAL: Test assertion failure function igt_asse...
(kms_ccs:4924) igt_pipe_crc-CRITICAL: Failed assertion: !mismatch || igt_skip_...
Dynamic subtest pipe-D-DP-2 failed.
**** DEBUG ****
(kms_ccs:4924) igt_kms-DEBUG: plane D.0: Setting property "pixel blend mode" t...
(kms_ccs:4924) igt_kms-DEBUG: plane D.0: Setting property "alpha" to 0xffff/65...
(kms_ccs:4924) igt_kms-DEBUG: plane D.0: Setting property "FB_DAMAGE_CLIPS" to...
(kms_ccs:4924) igt_kms-DEBUG: plane D.0: Setting property "SCALING_FILTER" to ...
(kms_ccs:4924) igt_kms-DEBUG: display:     populating plane data: D.1, fb 0
(kms_ccs:4924) igt_kms-DEBUG: plane D.1: Setting property "SRC_X" to 0x0/0
(kms_ccs:4924) igt_kms-DEBUG: plane D.1: Setting property "SRC_Y" to 0x0/0
(kms_ccs:4924) igt_kms-DEBUG: plane D.1: Setting property "SRC_W" to 0x0/0
(kms_ccs:4924) igt_kms-DEBUG: plane D.1: Setting property "SRC_H" to 0x0/0
(kms_ccs:4924) igt_kms-DEBUG: plane D.1: Setting property "CRTC_X" to 0x0/0
(kms_ccs:4924) igt_kms-DEBUG: plane D.1: Setting property "CRTC_Y" to 0x0/0
(kms_ccs:4924) igt_kms-DEBUG: plane D.1: Setting property "CRTC_W" to 0x0/0
...
igt@kms_ccs@crc-sprite-planes-basic-4-tiled-dg2-rc-ccs-cc
igt@kms_ccs@crc-sprite-planes-basic-4-tiled-dg2-rc-ccs-cc
xe-1951-7a8eccb85643c21e82007be3ae31bbca47611079

Starting subtest: crc-sprite-planes-basic-4-tiled-dg2-rc-ccs-cc
Starting dynamic subtest: pipe-A-DP-2
(kms_ccs:4955) igt_pipe_crc-CRITICAL: Test assertion failure function igt_asse...
(kms_ccs:4955) igt_pipe_crc-CRITICAL: Failed assertion: !mismatch || igt_skip_...
Dynamic subtest pipe-A-DP-2 failed.
**** DEBUG ****
(kms_ccs:4955) igt_kms-DEBUG: plane D.1: Setting property "FB_DAMAGE_CLIPS" to...
(kms_ccs:4955) igt_kms-DEBUG: plane D.1: Setting property "SCALING_FILTER" to ...
(kms_ccs:4955) igt_kms-DEBUG: display:     populating plane data: D.2, fb 0
(kms_ccs:4955) igt_kms-DEBUG: plane D.2: Setting property "SRC_X" to 0x0/0
(kms_ccs:4955) igt_kms-DEBUG: plane D.2: Setting property "SRC_Y" to 0x0/0
(kms_ccs:4955) igt_kms-DEBUG: plane D.2: Setting property "SRC_W" to 0x0/0
(kms_ccs:4955) igt_kms-DEBUG: plane D.2: Setting property "SRC_H" to 0x0/0
(kms_ccs:4955) igt_kms-DEBUG: plane D.2: Setting property "CRTC_X" to 0x0/0
(kms_ccs:4955) igt_kms-DEBUG: plane D.2: Setting property "CRTC_Y" to 0x0/0
(kms_ccs:4955) igt_kms-DEBUG: plane D.2: Setting property "CRTC_W" to 0x0/0
(kms_ccs:4955) igt_kms-DEBUG: plane D.2: Setting property "CRTC_H" to 0x0/0
...
igt@kms_ccs@crc-sprite-planes-basic-4-tiled-dg2-rc-ccs-cc@pipe-a-dp-2
igt@kms_ccs@crc-sprite-planes-basic-4-tiled-dg2-rc-ccs-cc@pipe-a-dp-2
xe-1951-7a8eccb85643c21e82007be3ae31bbca47611079

Starting subtest: crc-sprite-planes-basic-4-tiled-dg2-rc-ccs-cc
Starting dynamic subtest: pipe-A-DP-2
(kms_ccs:4955) igt_pipe_crc-CRITICAL: Test assertion failure function igt_asse...
(kms_ccs:4955) igt_pipe_crc-CRITICAL: Failed assertion: !mismatch || igt_skip_...
Dynamic subtest pipe-A-DP-2 failed.
**** DEBUG ****
(kms_ccs:4955) igt_kms-DEBUG: plane D.1: Setting property "FB_DAMAGE_CLIPS" to...
(kms_ccs:4955) igt_kms-DEBUG: plane D.1: Setting property "SCALING_FILTER" to ...
(kms_ccs:4955) igt_kms-DEBUG: display:     populating plane data: D.2, fb 0
(kms_ccs:4955) igt_kms-DEBUG: plane D.2: Setting property "SRC_X" to 0x0/0
(kms_ccs:4955) igt_kms-DEBUG: plane D.2: Setting property "SRC_Y" to 0x0/0
(kms_ccs:4955) igt_kms-DEBUG: plane D.2: Setting property "SRC_W" to 0x0/0
(kms_ccs:4955) igt_kms-DEBUG: plane D.2: Setting property "SRC_H" to 0x0/0
(kms_ccs:4955) igt_kms-DEBUG: plane D.2: Setting property "CRTC_X" to 0x0/0
(kms_ccs:4955) igt_kms-DEBUG: plane D.2: Setting property "CRTC_Y" to 0x0/0
(kms_ccs:4955) igt_kms-DEBUG: plane D.2: Setting property "CRTC_W" to 0x0/0
(kms_ccs:4955) igt_kms-DEBUG: plane D.2: Setting property "CRTC_H" to 0x0/0
...
igt@kms_ccs@crc-sprite-planes-basic-4-tiled-dg2-rc-ccs-cc@pipe-b-dp-2
igt@kms_ccs@crc-sprite-planes-basic-4-tiled-dg2-rc-ccs-cc@pipe-b-dp-2
xe-1951-7a8eccb85643c21e82007be3ae31bbca47611079

Starting dynamic subtest: pipe-B-DP-2
(kms_ccs:4955) igt_pipe_crc-CRITICAL: Test assertion failure function igt_asse...
(kms_ccs:4955) igt_pipe_crc-CRITICAL: Failed assertion: !mismatch || igt_skip_...
Dynamic subtest pipe-B-DP-2 failed.
**** DEBUG ****
(kms_ccs:4955) igt_kms-DEBUG: plane D.1: Setting property "FB_DAMAGE_CLIPS" to...
(kms_ccs:4955) igt_kms-DEBUG: plane D.1: Setting property "SCALING_FILTER" to ...
(kms_ccs:4955) igt_kms-DEBUG: display:     populating plane data: D.2, fb 0
(kms_ccs:4955) igt_kms-DEBUG: plane D.2: Setting property "SRC_X" to 0x0/0
(kms_ccs:4955) igt_kms-DEBUG: plane D.2: Setting property "SRC_Y" to 0x0/0
(kms_ccs:4955) igt_kms-DEBUG: plane D.2: Setting property "SRC_W" to 0x0/0
(kms_ccs:4955) igt_kms-DEBUG: plane D.2: Setting property "SRC_H" to 0x0/0
(kms_ccs:4955) igt_kms-DEBUG: plane D.2: Setting property "CRTC_X" to 0x0/0
(kms_ccs:4955) igt_kms-DEBUG: plane D.2: Setting property "CRTC_Y" to 0x0/0
(kms_ccs:4955) igt_kms-DEBUG: plane D.2: Setting property "CRTC_W" to 0x0/0
(kms_ccs:4955) igt_kms-DEBUG: plane D.2: Setting property "CRTC_H" to 0x0/0
(kms_ccs:4955) igt_kms-DEBUG: plane D.2: Setting property "FB_ID" to 0x0/0
...
igt@kms_ccs@crc-sprite-planes-basic-4-tiled-dg2-rc-ccs-cc@pipe-c-dp-2
igt@kms_ccs@crc-sprite-planes-basic-4-tiled-dg2-rc-ccs-cc@pipe-c-dp-2
xe-1951-7a8eccb85643c21e82007be3ae31bbca47611079

Starting dynamic subtest: pipe-C-DP-2
(kms_ccs:4955) igt_pipe_crc-CRITICAL: Test assertion failure function igt_asse...
(kms_ccs:4955) igt_pipe_crc-CRITICAL: Failed assertion: !mismatch || igt_skip_...
Dynamic subtest pipe-C-DP-2 failed.
**** DEBUG ****
(kms_ccs:4955) igt_kms-DEBUG: plane D.1: Setting property "FB_DAMAGE_CLIPS" to...
(kms_ccs:4955) igt_kms-DEBUG: plane D.1: Setting property "SCALING_FILTER" to ...
(kms_ccs:4955) igt_kms-DEBUG: display:     populating plane data: D.2, fb 0
(kms_ccs:4955) igt_kms-DEBUG: plane D.2: Setting property "SRC_X" to 0x0/0
(kms_ccs:4955) igt_kms-DEBUG: plane D.2: Setting property "SRC_Y" to 0x0/0
(kms_ccs:4955) igt_kms-DEBUG: plane D.2: Setting property "SRC_W" to 0x0/0
(kms_ccs:4955) igt_kms-DEBUG: plane D.2: Setting property "SRC_H" to 0x0/0
(kms_ccs:4955) igt_kms-DEBUG: plane D.2: Setting property "CRTC_X" to 0x0/0
(kms_ccs:4955) igt_kms-DEBUG: plane D.2: Setting property "CRTC_Y" to 0x0/0
(kms_ccs:4955) igt_kms-DEBUG: plane D.2: Setting property "CRTC_W" to 0x0/0
(kms_ccs:4955) igt_kms-DEBUG: plane D.2: Setting property "CRTC_H" to 0x0/0
(kms_ccs:4955) igt_kms-DEBUG: plane D.2: Setting property "FB_ID" to 0x0/0
...
igt@kms_ccs@crc-sprite-planes-basic-4-tiled-dg2-rc-ccs-cc@pipe-d-dp-2
igt@kms_ccs@crc-sprite-planes-basic-4-tiled-dg2-rc-ccs-cc@pipe-d-dp-2
xe-1951-7a8eccb85643c21e82007be3ae31bbca47611079

Starting dynamic subtest: pipe-D-DP-2
(kms_ccs:4955) igt_pipe_crc-CRITICAL: Test assertion failure function igt_asse...
(kms_ccs:4955) igt_pipe_crc-CRITICAL: Failed assertion: !mismatch || igt_skip_...
Dynamic subtest pipe-D-DP-2 failed.
**** DEBUG ****
(kms_ccs:4955) igt_kms-DEBUG: plane D.1: Setting property "FB_DAMAGE_CLIPS" to...
(kms_ccs:4955) igt_kms-DEBUG: plane D.1: Setting property "SCALING_FILTER" to ...
(kms_ccs:4955) igt_kms-DEBUG: display:     populating plane data: D.2, fb 0
(kms_ccs:4955) igt_kms-DEBUG: plane D.2: Setting property "SRC_X" to 0x0/0
(kms_ccs:4955) igt_kms-DEBUG: plane D.2: Setting property "SRC_Y" to 0x0/0
(kms_ccs:4955) igt_kms-DEBUG: plane D.2: Setting property "SRC_W" to 0x0/0
(kms_ccs:4955) igt_kms-DEBUG: plane D.2: Setting property "SRC_H" to 0x0/0
(kms_ccs:4955) igt_kms-DEBUG: plane D.2: Setting property "CRTC_X" to 0x0/0
(kms_ccs:4955) igt_kms-DEBUG: plane D.2: Setting property "CRTC_Y" to 0x0/0
(kms_ccs:4955) igt_kms-DEBUG: plane D.2: Setting property "CRTC_W" to 0x0/0
(kms_ccs:4955) igt_kms-DEBUG: plane D.2: Setting property "CRTC_H" to 0x0/0
(kms_ccs:4955) igt_kms-DEBUG: plane D.2: Setting property "FB_ID" to 0x0/0
...
igt@kms_dirtyfb@fbc-dirtyfb-ioctl
igt@kms_dirtyfb@fbc-dirtyfb-ioctl
xe-1951-7a8eccb85643c21e82007be3ae31bbca47611079

Starting subtest: fbc-dirtyfb-ioctl
Starting dynamic subtest: A-DP-2
(kms_dirtyfb:1650) CRITICAL: Test assertion failure function check_feature, fi...
(kms_dirtyfb:1650) CRITICAL: Failed assertion: intel_fbc_wait_until_enabled(da...
(kms_dirtyfb:1650) CRITICAL: FBC still disabled
Dynamic subtest A-DP-2 failed.
**** DEBUG ****
(kms_dirtyfb:1650) i915/intel_fbc-DEBUG: Test requirement passed: dir >= 0
(kms_dirtyfb:1650) i915/intel_fbc-DEBUG: Test requirement passed: dir >= 0
(kms_dirtyfb:1650) i915/intel_fbc-DEBUG: Test requirement passed: dir >= 0
(kms_dirtyfb:1650) i915/intel_fbc-DEBUG: Test requirement passed: dir >= 0
(kms_dirtyfb:1650) i915/intel_fbc-DEBUG: Test requirement passed: dir >= 0
(kms_dirtyfb:1650) i915/intel_fbc-DEBUG: Test requirement passed: dir >= 0
(kms_dirtyfb:1650) i915/intel_fbc-DEBUG: Test requirement passed: dir >= 0
(kms_dirtyfb:1650) i915/intel_fbc-DEBUG: Test requirement passed: dir >= 0
(kms_dirtyfb:1650) i915/intel_fbc-DEBUG: Test requirement passed: dir >= 0
(kms_dirtyfb:1650) i915/intel_fbc-DEBUG: Test requirement passed: dir >= 0
...
igt@kms_dirtyfb@fbc-dirtyfb-ioctl@a-dp-2
igt@kms_dirtyfb@fbc-dirtyfb-ioctl@a-dp-2
xe-1951-7a8eccb85643c21e82007be3ae31bbca47611079

Starting subtest: fbc-dirtyfb-ioctl
Starting dynamic subtest: A-DP-2
(kms_dirtyfb:1650) CRITICAL: Test assertion failure function check_feature, fi...
(kms_dirtyfb:1650) CRITICAL: Failed assertion: intel_fbc_wait_until_enabled(da...
(kms_dirtyfb:1650) CRITICAL: FBC still disabled
Dynamic subtest A-DP-2 failed.
**** DEBUG ****
(kms_dirtyfb:1650) i915/intel_fbc-DEBUG: Test requirement passed: dir >= 0
(kms_dirtyfb:1650) i915/intel_fbc-DEBUG: Test requirement passed: dir >= 0
(kms_dirtyfb:1650) i915/intel_fbc-DEBUG: Test requirement passed: dir >= 0
(kms_dirtyfb:1650) i915/intel_fbc-DEBUG: Test requirement passed: dir >= 0
(kms_dirtyfb:1650) i915/intel_fbc-DEBUG: Test requirement passed: dir >= 0
(kms_dirtyfb:1650) i915/intel_fbc-DEBUG: Test requirement passed: dir >= 0
(kms_dirtyfb:1650) i915/intel_fbc-DEBUG: Test requirement passed: dir >= 0
(kms_dirtyfb:1650) i915/intel_fbc-DEBUG: Test requirement passed: dir >= 0
(kms_dirtyfb:1650) i915/intel_fbc-DEBUG: Test requirement passed: dir >= 0
(kms_dirtyfb:1650) i915/intel_fbc-DEBUG: Test requirement passed: dir >= 0
...
igt@kms_fbcon_fbt@fbc
igt@kms_fbcon_fbt@fbc
xe-1951-7a8eccb85643c21e82007be3ae31bbca47611079

Starting subtest: fbc
(kms_fbcon_fbt:1695) CRITICAL: Test assertion failure function subtest, file ....
(kms_fbcon_fbt:1695) CRITICAL: Failed assertion: feature->wait_until_enabled(d...
Subtest fbc failed.
**** DEBUG ****
(kms_fbcon_fbt:1695) igt_kms-DEBUG: VT: graphics mode set (mode was 0x0)
(kms_fbcon_fbt:1695) DEBUG: Test requirement passed: feature->supported_on_chi...
(kms_fbcon_fbt:1695) INFO: Modes unset.
(kms_fbcon_fbt:1695) DEBUG: FBC status: FBC disabled: not enough stolen memory
  [PLANE:32:plane 1A]: plane not visible

(kms_fbcon_fbt:1695) DEBUG: Test requirement passed: i < drm->res->count_conne...
(kms_fbcon_fbt:1695) igt_fb-DEBUG: igt_create_fb_with_bo_size(width=3840, heig...
(kms_fbcon_fbt:1695) drmtest-DEBUG: Test requirement passed: is_intel_device(fd)
(kms_fbcon_fbt:1695) drmtest-DEBUG: Test requirement passed: is_intel_device(fd)
(kms_fbcon_fbt:1695) igt_fb-DEBUG: igt_create_fb_with_bo_size(handle=1, pitch=...
(kms_fbcon_fbt:1695) ioctl_wrappers-DEBUG: Test requirement passed: igt_has_fb...
...
igt@kms_fbcon_fbt@fbc-suspend
igt@kms_fbcon_fbt@fbc-suspend
xe-1951-7a8eccb85643c21e82007be3ae31bbca47611079

Starting subtest: fbc-suspend
(kms_fbcon_fbt:1700) CRITICAL: Test assertion failure function subtest, file ....
(kms_fbcon_fbt:1700) CRITICAL: Failed assertion: feature->wait_until_enabled(d...
Subtest fbc-suspend failed.
**** DEBUG ****
(kms_fbcon_fbt:1700) igt_kms-DEBUG: VT: graphics mode set (mode was 0x0)
(kms_fbcon_fbt:1700) DEBUG: Test requirement passed: feature->supported_on_chi...
(kms_fbcon_fbt:1700) INFO: Modes unset.
(kms_fbcon_fbt:1700) DEBUG: FBC status: FBC disabled: not enough stolen memory
  [PLANE:32:plane 1A]: plane not visible

(kms_fbcon_fbt:1700) DEBUG: Test requirement passed: i < drm->res->count_conne...
(kms_fbcon_fbt:1700) igt_fb-DEBUG: igt_create_fb_with_bo_size(width=3840, heig...
(kms_fbcon_fbt:1700) drmtest-DEBUG: Test requirement passed: is_intel_device(fd)
(kms_fbcon_fbt:1700) drmtest-DEBUG: Test requirement passed: is_intel_device(fd)
(kms_fbcon_fbt:1700) igt_fb-DEBUG: igt_create_fb_with_bo_size(handle=1, pitch=...
(kms_fbcon_fbt:1700) ioctl_wrappers-DEBUG: Test requirement passed: igt_has_fb...
...
igt@kms_flip@plain-flip-fb-recreate-interruptible
igt@kms_flip@plain-flip-fb-recreate-interruptible
xe-1951-7a8eccb85643c21e82007be3ae31bbca47611079

Starting subtest: plain-flip-fb-recreate-interruptible
Starting dynamic subtest: A-DP2
Dynamic subtest A-DP2: SUCCESS (8.015s)
Starting dynamic subtest: B-DP2
Dynamic subtest B-DP2: SUCCESS (8.010s)
Starting dynamic subtest: C-DP2
Dynamic subtest C-DP2: SUCCESS (8.014s)
Starting dynamic subtest: D-DP2
(kms_flip:3111) CRITICAL: Test assertion failure function __run_test_on_crtc_s...
(kms_flip:3111) CRITICAL: Failed assertion: !retried && needs_retry_after_link...
(kms_flip:3111) CRITICAL: Last errno: 4, Interrupted system call
Dynamic subtest D-DP2 failed.
**** DEBUG ****
(kms_flip:3111) DEBUG: flip ts/seq: last 1059.294800/9936, current 1059.311401...
(kms_flip:3111) DEBUG: name = flip
last_ts = 1059.311401
last_received_ts = 1059.311035
...
igt@kms_flip@plain-flip-fb-recreate-interruptible@d-dp2
igt@kms_flip@plain-flip-fb-recreate-interruptible@d-dp2
xe-1951-7a8eccb85643c21e82007be3ae31bbca47611079

Starting dynamic subtest: D-DP2
(kms_flip:3111) CRITICAL: Test assertion failure function __run_test_on_crtc_s...
(kms_flip:3111) CRITICAL: Failed assertion: !retried && needs_retry_after_link...
(kms_flip:3111) CRITICAL: Last errno: 4, Interrupted system call
Dynamic subtest D-DP2 failed.
**** DEBUG ****
(kms_flip:3111) DEBUG: flip ts/seq: last 1059.294800/9936, current 1059.311401...
(kms_flip:3111) DEBUG: name = flip
last_ts = 1059.311401
last_received_ts = 1059.311035
last_seq = 9937
current_ts = 1059.328125
current_received_ts = 1059.327881
current_seq = 9938
count = 282
seq_step = 1
(kms_flip:3111) DEBUG: flip ts/seq: last 1059.311401/9937, current 1059.328125...
...
igt@kms_plane_scaling@intel-max-src-size
igt@kms_plane_scaling@intel-max-src-size
xe-1951-7a8eccb85643c21e82007be3ae31bbca47611079

Starting subtest: intel-max-src-size
Starting dynamic subtest: pipe-A-DP-2
(kms_plane_scaling:1319) CRITICAL: Test assertion failure function intel_max_s...
(kms_plane_scaling:1319) CRITICAL: Failed assertion: rval == 0
(kms_plane_scaling:1319) CRITICAL: Last errno: 22, Invalid argument
(kms_plane_scaling:1319) CRITICAL: error: -22 != 0
Dynamic subtest pipe-A-DP-2 failed.
**** DEBUG ****
(kms_plane_scaling:1319) igt_kms-DEBUG: display:     populating plane data: C....
(kms_plane_scaling:1319) igt_kms-DEBUG: plane C.2: Setting property "SRC_X" to...
(kms_plane_scaling:1319) igt_kms-DEBUG: plane C.2: Setting property "SRC_Y" to...
(kms_plane_scaling:1319) igt_kms-DEBUG: plane C.2: Setting property "SRC_W" to...
(kms_plane_scaling:1319) igt_kms-DEBUG: plane C.2: Setting property "SRC_H" to...
(kms_plane_scaling:1319) igt_kms-DEBUG: plane C.2: Setting property "CRTC_X" t...
(kms_plane_scaling:1319) igt_kms-DEBUG: plane C.2: Setting property "CRTC_Y" t...
(kms_plane_scaling:1319) igt_kms-DEBUG: plane C.2: Setting property "CRTC_W" t...
(kms_plane_scaling:1319) igt_kms-DEBUG: plane C.2: Setting property "CRTC_H" t...
...
igt@kms_plane_scaling@intel-max-src-size@pipe-a-dp-2
igt@kms_plane_scaling@intel-max-src-size@pipe-a-dp-2
xe-1951-7a8eccb85643c21e82007be3ae31bbca47611079

Starting subtest: intel-max-src-size
Starting dynamic subtest: pipe-A-DP-2
(kms_plane_scaling:1319) CRITICAL: Test assertion failure function intel_max_s...
(kms_plane_scaling:1319) CRITICAL: Failed assertion: rval == 0
(kms_plane_scaling:1319) CRITICAL: Last errno: 22, Invalid argument
(kms_plane_scaling:1319) CRITICAL: error: -22 != 0
Dynamic subtest pipe-A-DP-2 failed.
**** DEBUG ****
(kms_plane_scaling:1319) igt_kms-DEBUG: display:     populating plane data: C....
(kms_plane_scaling:1319) igt_kms-DEBUG: plane C.2: Setting property "SRC_X" to...
(kms_plane_scaling:1319) igt_kms-DEBUG: plane C.2: Setting property "SRC_Y" to...
(kms_plane_scaling:1319) igt_kms-DEBUG: plane C.2: Setting property "SRC_W" to...
(kms_plane_scaling:1319) igt_kms-DEBUG: plane C.2: Setting property "SRC_H" to...
(kms_plane_scaling:1319) igt_kms-DEBUG: plane C.2: Setting property "CRTC_X" t...
(kms_plane_scaling:1319) igt_kms-DEBUG: plane C.2: Setting property "CRTC_Y" t...
(kms_plane_scaling:1319) igt_kms-DEBUG: plane C.2: Setting property "CRTC_W" t...
(kms_plane_scaling:1319) igt_kms-DEBUG: plane C.2: Setting property "CRTC_H" t...
...
igt@kms_pm_rpm@cursor
igt@kms_pm_rpm@cursor
xe-1951-7a8eccb85643c21e82007be3ae31bbca47611079

Starting subtest: cursor
(kms_pm_rpm:1594) igt_kms-CRITICAL: Test assertion failure function kmstest_du...
(kms_pm_rpm:1594) igt_kms-CRITICAL: Failed assertion: igt_ioctl((fd), ((((2U|1...
(kms_pm_rpm:1594) igt_kms-CRITICAL: Last errno: 22, Invalid argument
(kms_pm_rpm:1594) igt_kms-CRITICAL: error: -1 != 0
Subtest cursor failed.
**** DEBUG ****
(kms_pm_rpm:1594) igt_pm-DEBUG: (status = __igt_get_runtime_pm_status(fd)) == ...
(kms_pm_rpm:1594) DEBUG: Test requirement passed: default_mode_params
(kms_pm_rpm:1594) igt_fb-DEBUG: igt_create_fb_with_bo_size(width=64, height=64...
(kms_pm_rpm:1594) igt_kms-CRITICAL: Test assertion failure function kmstest_du...
(kms_pm_rpm:1594) igt_kms-CRITICAL: Failed assertion: igt_ioctl((fd), ((((2U|1...
(kms_pm_rpm:1594) igt_kms-CRITICAL: Last errno: 22, Invalid argument
(kms_pm_rpm:1594) igt_kms-CRITICAL: error: -1 != 0
(kms_pm_rpm:1594) igt_core-INFO: Stack trace:
(kms_pm_rpm:1594) igt_core-INFO:   #0 ../../../usr/src/igt-gpu-tools/lib/igt_c...
(kms_pm_rpm:1594) igt_core-INFO:   #1 ../../../usr/src/igt-gpu-tools/lib/igt_k...
...
igt@kms_pm_rpm@cursor-dpms
igt@kms_pm_rpm@cursor-dpms
xe-1951-7a8eccb85643c21e82007be3ae31bbca47611079

<4> [437.205123]  intel_power_well_get+0x20/0x30 [xe]
<4> [437.205189]  __intel_display_power_get_domain.part.0+0x59/0x90 [xe]
<4> [437.205262]  intel_display_power_get+0x4c/0x70 [xe]
<4> [437.205335]  i915_audio_component_get_power+0x32/0x130 [xe]
<4> [437.205402]  snd_hdac_display_power+0x87/0x130 [snd_hda_core]
<4> [437.205411]  __azx_runtime_resume+0x22/0x100 [snd_hda_intel]
<4> [437.205415]  azx_runtime_resume+0x49/0x110 [snd_hda_intel]
<4> [437.205418]  pci_pm_runtime_resume+0x75/0xa0
<4> [437.205421]  ? __pfx_pci_pm_runtime_resume+0x10/0x10
<4> [437.205424]  __rpm_callback+0x48/0x120
<4> [437.205428]  ? __pfx_pci_pm_runtime_resume+0x10/0x10
<4> [437.205430]  rpm_callback+0x60/0x70
<4> [437.205433]  ? __pfx_pci_pm_runtime_resume+0x10/0x10
<4> [437.205435]  rpm_resume+0x572/0x790
<4> [437.205440]  pm_runtime_work+0x84/0xd0
<4> [437.205443]  process_scheduled_works+0x39f/0x730
<4> [437.205448]  worker_thread+0x14f/0x2c0
...
igt@kms_pm_rpm@dpms-lpsp
D igt@kms_pm_rpm@dpms-lpsp
xe-1951-7a8eccb85643c21e82007be3ae31bbca47611079

<3> [152.754079] xe 0000:03:00.0: [drm] *ERROR* DC state mismatch (0x8 -> 0x40...
<3> [152.754157] xe 0000:03:00.0: [drm] *ERROR* Writing dc state to 0xbffffff4...
<4> [152.754307] WARNING: CPU: 0 PID: 218 at drivers/gpu/drm/i915/display/inte...
<4> [152.754416] Modules linked in: snd_hda_codec_hdmi snd_hda_intel mei_gsc x...
<4> [152.755202]  intel_cdclk_get_cdclk+0x12/0x20 [xe]
<4> [152.755549]  intel_power_well_enable+0x5c/0x70 [xe]
<4> [152.755660]  intel_power_well_get+0x20/0x30 [xe]
<4> [152.755767]  __intel_display_power_get_domain.part.0+0x59/0x90 [xe]
<4> [152.755874]  intel_display_power_get+0x4c/0x70 [xe]
<4> [152.755982]  i915_audio_component_get_power+0x32/0x130 [xe]
<4> [152.756247] xe 0000:03:00.0: [drm] drm_WARN_ON(intel_cdclk_clock_changed(...
<4> [152.756270] WARNING: CPU: 0 PID: 218 at drivers/gpu/drm/i915/display/inte...
<4> [152.756381] Modules linked in: snd_hda_codec_hdmi snd_hda_intel mei_gsc x...
<4> [152.757148]  intel_power_well_enable+0x5c/0x70 [xe]
<4> [152.757254]  intel_power_well_get+0x20/0x30 [xe]
<4> [152.757359]  __intel_display_power_get_domain.part.0+0x59/0x90 [xe]
<4> [152.757465]  intel_display_power_get+0x4c/0x70 [xe]
...
igt@kms_pm_rpm@legacy-planes
D igt@kms_pm_rpm@legacy-planes
xe-1951-7a8eccb85643c21e82007be3ae31bbca47611079

<4> [158.753612]        intel_display_power_get+0x24/0x70 [xe]
<4> [158.753679]        i915_hpd_poll_init_work+0x175/0x290 [xe]
<4> [158.753757]        i915_hotplug_work_func+0x47/0x3f0 [xe]
<4> [158.753891]        intel_hpd_cancel_work+0x5e/0x90 [xe]
<4> [158.754374]  intel_hpd_cancel_work+0x5e/0x90 [xe]
igt@kms_pm_rpm@legacy-planes@plane-50
D igt@kms_pm_rpm@legacy-planes@plane-50
xe-1951-7a8eccb85643c21e82007be3ae31bbca47611079

<4> [158.753612]        intel_display_power_get+0x24/0x70 [xe]
<4> [158.753679]        i915_hpd_poll_init_work+0x175/0x290 [xe]
<4> [158.753757]        i915_hotplug_work_func+0x47/0x3f0 [xe]
<4> [158.753891]        intel_hpd_cancel_work+0x5e/0x90 [xe]
<4> [158.754374]  intel_hpd_cancel_work+0x5e/0x90 [xe]
igt@kms_pm_rpm@modeset-non-lpsp-stress
D igt@kms_pm_rpm@modeset-non-lpsp-stress
xe-1951-7a8eccb85643c21e82007be3ae31bbca47611079

<3> [342.866270] xe 0000:03:00.0: [drm] *ERROR* DC state mismatch (0x8 -> 0x40...
<3> [342.866323] xe 0000:03:00.0: [drm] *ERROR* Writing dc state to 0xbffffff4...
<4> [342.866437] WARNING: CPU: 1 PID: 1192 at drivers/gpu/drm/i915/display/int...
<4> [342.866522] Modules linked in: snd_hda_codec_hdmi snd_hda_intel mei_gsc x...
<4> [342.866677] Workqueue: events output_poll_execute [drm_kms_helper]
<4> [342.867071]  intel_cdclk_get_cdclk+0x12/0x20 [xe]
<4> [342.867313]  intel_power_well_enable+0x5c/0x70 [xe]
<4> [342.867392]  intel_power_well_get+0x20/0x30 [xe]
<4> [342.867471]  __intel_display_power_get_domain.part.0+0x59/0x90 [xe]
<4> [342.867553]  intel_display_power_get+0x4c/0x70 [xe]
<4> [342.867634]  intel_atomic_commit_tail+0x112/0x1340 [xe]
<4> [342.867733]  intel_atomic_commit+0x37c/0x3c0 [xe]
<4> [342.867962]  ? intel_atomic_commit+0x30f/0x3c0 [xe]
<4> [342.868095]  ? intel_atomic_commit+0x37c/0x3c0 [xe]
<4> [342.868178]  drm_atomic_commit+0xa5/0xe0 [drm]
<4> [342.868199]  ? __pfx___drm_printfn_info+0x10/0x10 [drm]
<4> [342.868228]  drm_client_modeset_commit_atomic+0x25e/0x2b0 [drm]
...
igt@kms_pm_rpm@universal-planes
D igt@kms_pm_rpm@universal-planes
xe-1951-7a8eccb85643c21e82007be3ae31bbca47611079

<3> [334.668050] xe 0000:03:00.0: [drm] *ERROR* DC state mismatch (0x8 -> 0x40...
<3> [334.668132] xe 0000:03:00.0: [drm] *ERROR* Writing dc state to 0xbffffff4...
<4> [334.668269] WARNING: CPU: 5 PID: 1360 at drivers/gpu/drm/i915/display/int...
<4> [334.668382] Modules linked in: snd_hda_codec_hdmi snd_hda_intel mei_gsc x...
<4> [334.669193]  intel_cdclk_get_cdclk+0x12/0x20 [xe]
<4> [334.669526]  intel_power_well_enable+0x5c/0x70 [xe]
<4> [334.669633]  intel_power_well_get+0x20/0x30 [xe]
<4> [334.669740]  __intel_display_power_get_domain.part.0+0x59/0x90 [xe]
<4> [334.669848]  intel_display_power_get+0x4c/0x70 [xe]
<4> [334.669955]  i915_audio_component_get_power+0x32/0x130 [xe]
<4> [334.670223] xe 0000:03:00.0: [drm] drm_WARN_ON(intel_cdclk_clock_changed(...
<4> [334.670242] WARNING: CPU: 5 PID: 1360 at drivers/gpu/drm/i915/display/int...
<4> [334.670348] Modules linked in: snd_hda_codec_hdmi snd_hda_intel mei_gsc x...
<4> [334.671137]  intel_power_well_enable+0x5c/0x70 [xe]
<4> [334.671245]  intel_power_well_get+0x20/0x30 [xe]
<4> [334.671349]  __intel_display_power_get_domain.part.0+0x59/0x90 [xe]
<4> [334.671458]  intel_display_power_get+0x4c/0x70 [xe]
...
igt@kms_pm_rpm@universal-planes-dpms
D igt@kms_pm_rpm@universal-planes-dpms
xe-1951-7a8eccb85643c21e82007be3ae31bbca47611079

<4> [242.056175]        intel_display_power_get+0x24/0x70 [xe]
<4> [242.056244]        i915_hpd_poll_init_work+0x175/0x290 [xe]
<4> [242.056321]        i915_hotplug_work_func+0x47/0x3f0 [xe]
<4> [242.056459]        intel_hpd_cancel_work+0x5e/0x90 [xe]
<4> [242.056949]  intel_hpd_cancel_work+0x5e/0x90 [xe]
igt@kms_pm_rpm@universal-planes-dpms@plane-41
D igt@kms_pm_rpm@universal-planes-dpms@plane-41
xe-1951-7a8eccb85643c21e82007be3ae31bbca47611079

<4> [242.056175]        intel_display_power_get+0x24/0x70 [xe]
<4> [242.056244]        i915_hpd_poll_init_work+0x175/0x290 [xe]
<4> [242.056321]        i915_hotplug_work_func+0x47/0x3f0 [xe]
<4> [242.056459]        intel_hpd_cancel_work+0x5e/0x90 [xe]
<4> [242.056949]  intel_hpd_cancel_work+0x5e/0x90 [xe]
igt@kms_pm_rpm@universal-planes@plane-59
D igt@kms_pm_rpm@universal-planes@plane-59
xe-1951-7a8eccb85643c21e82007be3ae31bbca47611079

<3> [334.668050] xe 0000:03:00.0: [drm] *ERROR* DC state mismatch (0x8 -> 0x40...
<3> [334.668132] xe 0000:03:00.0: [drm] *ERROR* Writing dc state to 0xbffffff4...
<4> [334.668269] WARNING: CPU: 5 PID: 1360 at drivers/gpu/drm/i915/display/int...
<4> [334.668382] Modules linked in: snd_hda_codec_hdmi snd_hda_intel mei_gsc x...
<4> [334.669193]  intel_cdclk_get_cdclk+0x12/0x20 [xe]
<4> [334.669526]  intel_power_well_enable+0x5c/0x70 [xe]
<4> [334.669633]  intel_power_well_get+0x20/0x30 [xe]
<4> [334.669740]  __intel_display_power_get_domain.part.0+0x59/0x90 [xe]
<4> [334.669848]  intel_display_power_get+0x4c/0x70 [xe]
<4> [334.669955]  i915_audio_component_get_power+0x32/0x130 [xe]
<4> [334.670223] xe 0000:03:00.0: [drm] drm_WARN_ON(intel_cdclk_clock_changed(...
<4> [334.670242] WARNING: CPU: 5 PID: 1360 at drivers/gpu/drm/i915/display/int...
<4> [334.670348] Modules linked in: snd_hda_codec_hdmi snd_hda_intel mei_gsc x...
<4> [334.671137]  intel_power_well_enable+0x5c/0x70 [xe]
<4> [334.671245]  intel_power_well_get+0x20/0x30 [xe]
<4> [334.671349]  __intel_display_power_get_domain.part.0+0x59/0x90 [xe]
<4> [334.671458]  intel_display_power_get+0x4c/0x70 [xe]
...
igt@xe_compute@ccs-mode-basic
igt@xe_compute@ccs-mode-basic
xe-1951-7a8eccb85643c21e82007be3ae31bbca47611079

Starting subtest: ccs-mode-basic
(xe_compute:2433) CRITICAL: Test assertion failure function test_ccs_mode, fil...
(xe_compute:2433) CRITICAL: Failed assertion: igt_sysfs_printf(gt_fd, "ccs_mod...
(xe_compute:2433) CRITICAL: Last errno: 16, Device or resource busy
Subtest ccs-mode-basic failed.
**** DEBUG ****
(xe_compute:2433) drmtest-DEBUG: Looking for devices to open using filter 0: p...
(xe_compute:2433) drmtest-DEBUG: Filter matched /dev/dri/card0 | /dev/dri/rend...
(xe_compute:2433) drmtest-DEBUG: Opened previously opened device: /dev/dri/card0
(xe_compute:2433) drmtest-DEBUG: Test requirement passed: !(fd<0)
(xe_compute:2433) drmtest-DEBUG: Looking for devices to open using filter 0: p...
(xe_compute:2433) drmtest-DEBUG: Filter matched /dev/dri/card0 | /dev/dri/rend...
(xe_compute:2433) drmtest-DEBUG: Opened previously opened device: /dev/dri/card0
(xe_compute:2433) drmtest-DEBUG: Test requirement passed: !(fd<0)
(xe_compute:2433) CRITICAL: Test assertion failure function test_ccs_mode, fil...
(xe_compute:2433) CRITICAL: Failed assertion: igt_sysfs_printf(gt_fd, "ccs_mod...
(xe_compute:2433) CRITICAL: Last errno: 16, Device or resource busy
...
igt@xe_compute@ccs-mode-compute-kernel
igt@xe_compute@ccs-mode-compute-kernel
xe-1951-7a8eccb85643c21e82007be3ae31bbca47611079

Starting subtest: ccs-mode-compute-kernel
(xe_compute:2434) CRITICAL: Test assertion failure function test_compute_kerne...
(xe_compute:2434) CRITICAL: Failed assertion: igt_sysfs_printf(gt_fd, "ccs_mod...
(xe_compute:2434) CRITICAL: Last errno: 16, Device or resource busy
Subtest ccs-mode-compute-kernel failed.
**** DEBUG ****
(xe_compute:2434) drmtest-DEBUG: Looking for devices to open using filter 0: p...
(xe_compute:2434) drmtest-DEBUG: Filter matched /dev/dri/card0 | /dev/dri/rend...
(xe_compute:2434) drmtest-DEBUG: Opened previously opened device: /dev/dri/card0
(xe_compute:2434) drmtest-DEBUG: Test requirement passed: !(fd<0)
(xe_compute:2434) drmtest-DEBUG: Looking for devices to open using filter 0: p...
(xe_compute:2434) drmtest-DEBUG: Filter matched /dev/dri/card0 | /dev/dri/rend...
(xe_compute:2434) drmtest-DEBUG: Opened previously opened device: /dev/dri/card0
(xe_compute:2434) drmtest-DEBUG: Test requirement passed: !(fd<0)
(xe_compute:2434) CRITICAL: Test assertion failure function test_compute_kerne...
(xe_compute:2434) CRITICAL: Failed assertion: igt_sysfs_printf(gt_fd, "ccs_mod...
(xe_compute:2434) CRITICAL: Last errno: 16, Device or resource busy
...
igt@xe_evict@evict-beng-large-multi-vm-cm
igt@xe_evict@evict-beng-large-multi-vm-cm
xe-1951-7a8eccb85643c21e82007be3ae31bbca47611079

Starting subtest: evict-beng-large-multi-vm-cm
(xe_evict:4638) xe/xe_ioctl-CRITICAL: Test assertion failure function __xe_vm_...
(xe_evict:4638) xe/xe_ioctl-CRITICAL: Failed assertion: __xe_vm_bind(fd, vm, e...
(xe_evict:4638) xe/xe_ioctl-CRITICAL: Last errno: 12, Cannot allocate memory
(xe_evict:4638) xe/xe_ioctl-CRITICAL: error: -12 != 0
Subtest evict-beng-large-multi-vm-cm failed.
**** DEBUG ****
(xe_evict:4638) DEBUG: num_threads: 1 bo_size : 6442450944 total_size : 5
(xe_evict:4638) DEBUG: Max working set 8 n_execs 8
(xe_evict:4638) DEBUG: Test requirement passed: !(!ws)
(xe_evict:4638) xe/xe_ioctl-CRITICAL: Test assertion failure function __xe_vm_...
(xe_evict:4638) xe/xe_ioctl-CRITICAL: Failed assertion: __xe_vm_bind(fd, vm, e...
(xe_evict:4638) xe/xe_ioctl-CRITICAL: Last errno: 12, Cannot allocate memory
(xe_evict:4638) xe/xe_ioctl-CRITICAL: error: -12 != 0
(xe_evict:4638) igt_core-INFO: Stack trace:
(xe_evict:4638) igt_core-INFO:   #0 ../../../usr/src/igt-gpu-tools/lib/igt_cor...
(xe_evict:4638) igt_core-INFO:   #1 [__xe_vm_bind_assert+0x71]
...
igt@xe_evict@evict-beng-mixed-many-threads-large
T igt@xe_evict@evict-beng-mixed-many-threads-large
xe-1951-7a8eccb85643c21e82007be3ae31bbca47611079

<6> [997.335101] Console: switching to colour dummy device 80x25
<6> [997.335387] [IGT] xe_evict: executing
<6> [997.400568] [IGT] xe_evict: starting subtest evict-beng-mixed-many-thread...
<7> [997.648326] xe 0000:03:00.0: [drm:xe_migrate_copy [xe]] Pass 0, sizes: 83...
<7> [997.648495] xe 0000:03:00.0: [drm:xe_migrate_copy [xe]] Pass 1, sizes: 83...
<7> [997.648668] xe 0000:03:00.0: [drm:xe_migrate_copy [xe]] Pass 2, sizes: 83...
<7> [997.648759] xe 0000:03:00.0: [drm:xe_migrate_copy [xe]] Pass 3, sizes: 83...
<7> [997.648848] xe 0000:03:00.0: [drm:xe_migrate_copy [xe]] Pass 4, sizes: 83...
<7> [997.648965] xe 0000:03:00.0: [drm:xe_migrate_copy [xe]] Pass 5, sizes: 83...
<7> [997.649135] xe 0000:03:00.0: [drm:xe_migrate_copy [xe]] Pass 6, sizes: 83...
<7> [997.649256] xe 0000:03:00.0: [drm:xe_migrate_copy [xe]] Pass 7, sizes: 83...
<7> [997.649352] xe 0000:03:00.0: [drm:xe_migrate_copy [xe]] Pass 8, sizes: 83...
<7> [997.649452] xe 0000:03:00.0: [drm:xe_migrate_copy [xe]] Pass 9, sizes: 83...
<7> [997.649546] xe 0000:03:00.0: [drm:xe_migrate_copy [xe]] Pass 10, sizes: 8...
<7> [997.649637] xe 0000:03:00.0: [drm:xe_migrate_copy [xe]] Pass 11, sizes: 8...
<7> [997.649734] xe 0000:03:00.0: [drm:xe_migrate_copy [xe]] Pass 12, sizes: 8...
<7> [997.649801] xe 0000:03:00.0: [drm:xe_migrate_copy [xe]] Pass 0, sizes: 83...
...
igt@xe_evict@evict-beng-mixed-many-threads-small
T igt@xe_evict@evict-beng-mixed-many-threads-small
xe-1951-7a8eccb85643c21e82007be3ae31bbca47611079

<6> [1091.633106] Console: switching to colour dummy device 80x25
<6> [1091.633347] [IGT] xe_evict: executing
<6> [1091.754538] [IGT] xe_evict: starting subtest evict-beng-mixed-many-threa...
<7> [1091.912582] xe 0000:03:00.0: [drm:xe_migrate_copy [xe]] Pass 0, sizes: 8...
<7> [1091.912740] xe 0000:03:00.0: [drm:xe_migrate_copy [xe]] Pass 1, sizes: 8...
<7> [1091.912915] xe 0000:03:00.0: [drm:xe_migrate_copy [xe]] Pass 2, sizes: 8...
<7> [1091.913013] xe 0000:03:00.0: [drm:xe_migrate_copy [xe]] Pass 3, sizes: 8...
<7> [1091.913108] xe 0000:03:00.0: [drm:xe_migrate_copy [xe]] Pass 4, sizes: 8...
<7> [1091.913202] xe 0000:03:00.0: [drm:xe_migrate_copy [xe]] Pass 5, sizes: 8...
<7> [1091.913295] xe 0000:03:00.0: [drm:xe_migrate_copy [xe]] Pass 6, sizes: 8...
<7> [1091.913388] xe 0000:03:00.0: [drm:xe_migrate_copy [xe]] Pass 7, sizes: 8...
<7> [1091.913479] xe 0000:03:00.0: [drm:xe_migrate_copy [xe]] Pass 8, sizes: 8...
<7> [1091.913570] xe 0000:03:00.0: [drm:xe_migrate_copy [xe]] Pass 9, sizes: 8...
<7> [1091.913660] xe 0000:03:00.0: [drm:xe_migrate_copy [xe]] Pass 10, sizes: ...
<7> [1091.913752] xe 0000:03:00.0: [drm:xe_migrate_copy [xe]] Pass 11, sizes: ...
<7> [1091.913847] xe 0000:03:00.0: [drm:xe_migrate_copy [xe]] Pass 12, sizes: ...
<7> [1091.913938] xe 0000:03:00.0: [drm:xe_migrate_copy [xe]] Pass 13, sizes: ...
...
igt@xe_evict@evict-beng-mixed-threads-large
T igt@xe_evict@evict-beng-mixed-threads-large
xe-1951-7a8eccb85643c21e82007be3ae31bbca47611079

<6> [1185.454024] Console: switching to colour dummy device 80x25
<6> [1185.454263] [IGT] xe_evict: executing
<6> [1185.524385] [IGT] xe_evict: starting subtest evict-beng-mixed-threads-la...
<7> [1185.714191] xe 0000:03:00.0: [drm:xe_migrate_copy [xe]] Pass 0, sizes: 8...
<7> [1185.714346] xe 0000:03:00.0: [drm:xe_migrate_copy [xe]] Pass 1, sizes: 8...
<7> [1185.714517] xe 0000:03:00.0: [drm:xe_migrate_copy [xe]] Pass 2, sizes: 8...
<7> [1185.714613] xe 0000:03:00.0: [drm:xe_migrate_copy [xe]] Pass 3, sizes: 8...
<7> [1185.714706] xe 0000:03:00.0: [drm:xe_migrate_copy [xe]] Pass 4, sizes: 8...
<7> [1185.714797] xe 0000:03:00.0: [drm:xe_migrate_copy [xe]] Pass 5, sizes: 8...
<7> [1185.714884] xe 0000:03:00.0: [drm:xe_migrate_copy [xe]] Pass 6, sizes: 8...
<7> [1185.714974] xe 0000:03:00.0: [drm:xe_migrate_copy [xe]] Pass 7, sizes: 8...
<7> [1185.715061] xe 0000:03:00.0: [drm:xe_migrate_copy [xe]] Pass 8, sizes: 8...
<7> [1185.715149] xe 0000:03:00.0: [drm:xe_migrate_copy [xe]] Pass 9, sizes: 8...
<7> [1185.715230] xe 0000:03:00.0: [drm:xe_migrate_copy [xe]] Pass 10, sizes: ...
<7> [1185.715307] xe 0000:03:00.0: [drm:xe_migrate_copy [xe]] Pass 11, sizes: ...
<7> [1185.715392] xe 0000:03:00.0: [drm:xe_migrate_copy [xe]] Pass 12, sizes: ...
<7> [1185.715476] xe 0000:03:00.0: [drm:xe_migrate_copy [xe]] Pass 13, sizes: ...
...
igt@xe_evict@evict-beng-threads-large
igt@xe_evict@evict-beng-threads-large
xe-1951-7a8eccb85643c21e82007be3ae31bbca47611079

Starting subtest: evict-beng-threads-large
(xe_evict:1266) [thread:1268] CRITICAL: Test assertion failure function test_e...
(xe_evict:1266) [thread:1268] CRITICAL: Failed assertion: igt_ioctl(fd, (((1U)...
(xe_evict:1266) [thread:1268] CRITICAL: Last errno: 12, Cannot allocate memory
(xe_evict:1266) [thread:1268] CRITICAL: error: -1 != 0
(xe_evict:1266) igt_thread-CRITICAL: Failure in a thread!
Subtest evict-beng-threads-large failed.
**** DEBUG ****
(xe_evict:1266) DEBUG: num_threads: 2 bo_size : 1610612736 total_size : 12
(xe_evict:1266) DEBUG: Max working set 20 n_execs 16
(xe_evict:1266) DEBUG: Test requirement passed: !(!ws)
(xe_evict:1266) [thread:1268] CRITICAL: Test assertion failure function test_e...
(xe_evict:1266) [thread:1268] CRITICAL: Failed assertion: igt_ioctl(fd, (((1U)...
(xe_evict:1266) [thread:1268] CRITICAL: Last errno: 12, Cannot allocate memory
(xe_evict:1266) [thread:1268] CRITICAL: error: -1 != 0
(xe_evict:1266) [thread:1268] igt_core-INFO: Stack trace:
(xe_evict:1266) [thread:1268] igt_core-INFO:   #0 ../../../usr/src/igt-gpu-too...
...
igt@xe_evict@evict-large-multi-vm-cm
igt@xe_evict@evict-large-multi-vm-cm
xe-1951-7a8eccb85643c21e82007be3ae31bbca47611079

Starting subtest: evict-large-multi-vm-cm
(xe_evict:1375) xe/xe_ioctl-CRITICAL: Test assertion failure function __xe_vm_...
(xe_evict:1375) xe/xe_ioctl-CRITICAL: Failed assertion: __xe_vm_bind(fd, vm, e...
(xe_evict:1375) xe/xe_ioctl-CRITICAL: Last errno: 12, Cannot allocate memory
(xe_evict:1375) xe/xe_ioctl-CRITICAL: error: -12 != 0
Subtest evict-large-multi-vm-cm failed.
**** DEBUG ****
(xe_evict:1375) DEBUG: num_threads: 1 bo_size : 6442450944 total_size : 5
(xe_evict:1375) DEBUG: Max working set 8 n_execs 8
(xe_evict:1375) DEBUG: Test requirement passed: !(!ws)
(xe_evict:1375) xe/xe_ioctl-CRITICAL: Test assertion failure function __xe_vm_...
(xe_evict:1375) xe/xe_ioctl-CRITICAL: Failed assertion: __xe_vm_bind(fd, vm, e...
(xe_evict:1375) xe/xe_ioctl-CRITICAL: Last errno: 12, Cannot allocate memory
(xe_evict:1375) xe/xe_ioctl-CRITICAL: error: -12 != 0
(xe_evict:1375) igt_core-INFO: Stack trace:
(xe_evict:1375) igt_core-INFO:   #0 ../../../usr/src/igt-gpu-tools/lib/igt_cor...
(xe_evict:1375) igt_core-INFO:   #1 [__xe_vm_bind_assert+0x71]
...
igt@xe_evict@evict-mixed-many-threads-large
T igt@xe_evict@evict-mixed-many-threads-large
xe-1951-7a8eccb85643c21e82007be3ae31bbca47611079

<6> [186.266813] Console: switching to colour dummy device 80x25
<6> [186.267098] [IGT] xe_evict: executing
<6> [186.322845] [IGT] xe_evict: starting subtest evict-mixed-many-threads-large
<7> [186.564189] xe 0000:03:00.0: [drm:xe_migrate_copy [xe]] Pass 0, sizes: 83...
<7> [186.564352] xe 0000:03:00.0: [drm:xe_migrate_copy [xe]] Pass 1, sizes: 83...
<7> [186.564531] xe 0000:03:00.0: [drm:xe_migrate_copy [xe]] Pass 2, sizes: 83...
<7> [186.564620] xe 0000:03:00.0: [drm:xe_migrate_copy [xe]] Pass 3, sizes: 83...
<7> [186.564710] xe 0000:03:00.0: [drm:xe_migrate_copy [xe]] Pass 4, sizes: 83...
<7> [186.564799] xe 0000:03:00.0: [drm:xe_migrate_copy [xe]] Pass 5, sizes: 83...
<7> [186.564889] xe 0000:03:00.0: [drm:xe_migrate_copy [xe]] Pass 6, sizes: 83...
<7> [186.565929] xe 0000:03:00.0: [drm:xe_migrate_copy [xe]] Pass 0, sizes: 83...
<7> [186.567488] xe 0000:03:00.0: [drm:xe_migrate_copy [xe]] Pass 7, sizes: 83...
<7> [186.567490] xe 0000:03:00.0: [drm:xe_migrate_copy [xe]] Pass 1, sizes: 83...
<7> [186.567594] xe 0000:03:00.0: [drm:xe_migrate_copy [xe]] Pass 8, sizes: 83...
<7> [186.567607] xe 0000:03:00.0: [drm:xe_migrate_copy [xe]] Pass 2, sizes: 83...
<7> [186.567689] xe 0000:03:00.0: [drm:xe_migrate_copy [xe]] Pass 9, sizes: 83...
<7> [186.567722] xe 0000:03:00.0: [drm:xe_migrate_copy [xe]] Pass 3, sizes: 83...
...
igt@xe_evict@evict-mixed-threads-large
T igt@xe_evict@evict-mixed-threads-large
xe-1951-7a8eccb85643c21e82007be3ae31bbca47611079

<6> [287.636343] Console: switching to colour dummy device 80x25
<6> [287.636660] [IGT] xe_evict: executing
<6> [287.705524] [IGT] xe_evict: starting subtest evict-mixed-threads-large
<7> [287.900763] xe 0000:03:00.0: [drm:xe_migrate_copy [xe]] Pass 0, sizes: 83...
<7> [287.900920] xe 0000:03:00.0: [drm:xe_migrate_copy [xe]] Pass 1, sizes: 83...
<7> [287.901063] xe 0000:03:00.0: [drm:xe_migrate_copy [xe]] Pass 2, sizes: 83...
<7> [287.901147] xe 0000:03:00.0: [drm:xe_migrate_copy [xe]] Pass 3, sizes: 83...
<7> [287.901228] xe 0000:03:00.0: [drm:xe_migrate_copy [xe]] Pass 4, sizes: 83...
<7> [287.901318] xe 0000:03:00.0: [drm:xe_migrate_copy [xe]] Pass 5, sizes: 83...
<7> [287.901416] xe 0000:03:00.0: [drm:xe_migrate_copy [xe]] Pass 6, sizes: 83...
<7> [287.901503] xe 0000:03:00.0: [drm:xe_migrate_copy [xe]] Pass 7, sizes: 83...
<7> [287.901590] xe 0000:03:00.0: [drm:xe_migrate_copy [xe]] Pass 8, sizes: 83...
<7> [287.901679] xe 0000:03:00.0: [drm:xe_migrate_copy [xe]] Pass 9, sizes: 83...
<7> [287.901766] xe 0000:03:00.0: [drm:xe_migrate_copy [xe]] Pass 10, sizes: 8...
<7> [287.901854] xe 0000:03:00.0: [drm:xe_migrate_copy [xe]] Pass 11, sizes: 8...
<7> [287.901940] xe 0000:03:00.0: [drm:xe_migrate_copy [xe]] Pass 12, sizes: 8...
<7> [287.902079] xe 0000:03:00.0: [drm:xe_migrate_copy [xe]] Pass 13, sizes: 8...
...
igt@xe_evict@evict-threads-large
igt@xe_evict@evict-threads-large
xe-1951-7a8eccb85643c21e82007be3ae31bbca47611079

Starting subtest: evict-threads-large
(xe_evict:1595) [thread:1596] CRITICAL: Test assertion failure function test_e...
(xe_evict:1595) [thread:1596] CRITICAL: Failed assertion: igt_ioctl(fd, (((1U)...
(xe_evict:1595) [thread:1596] CRITICAL: Last errno: 12, Cannot allocate memory
(xe_evict:1595) [thread:1596] CRITICAL: error: -1 != 0
(xe_evict:1595) igt_thread-CRITICAL: Failure in a thread!
Subtest evict-threads-large failed.
**** DEBUG ****
(xe_evict:1595) DEBUG: num_threads: 2 bo_size : 1610612736 total_size : 12
(xe_evict:1595) DEBUG: Max working set 20 n_execs 16
(xe_evict:1595) DEBUG: Test requirement passed: !(!ws)
(xe_evict:1595) [thread:1596] CRITICAL: Test assertion failure function test_e...
(xe_evict:1595) [thread:1596] CRITICAL: Failed assertion: igt_ioctl(fd, (((1U)...
(xe_evict:1595) [thread:1596] CRITICAL: Last errno: 12, Cannot allocate memory
(xe_evict:1595) [thread:1596] CRITICAL: error: -1 != 0
(xe_evict:1595) [thread:1596] igt_core-INFO: Stack trace:
(xe_evict:1595) [thread:1596] igt_core-INFO:   #0 ../../../usr/src/igt-gpu-too...
...
igt@xe_exec_reset@parallel-cat-error
D igt@xe_exec_reset@parallel-cat-error
xe-1951-7a8eccb85643c21e82007be3ae31bbca47611079

<3> [648.052100] xe 0000:03:00.0: [drm] *ERROR* GT0: FAST_REQ H2G fence 0x8443...
igt@xe_pm@s2idle-d3cold-basic-exec
igt@xe_pm@s2idle-d3cold-basic-exec
xe-1951-7a8eccb85643c21e82007be3ae31bbca47611079

<6> [592.172004] Console: switching to colour dummy device 80x25
<6> [592.172403] [IGT] xe_pm: executing
<6> [594.154988] [IGT] xe_pm: starting subtest s2idle-d3cold-basic-exec
<7> [594.155693] xe 0000:03:00.0: [drm:intel_atomic_check [xe]] [CONNECTOR:254...
<7> [594.156031] xe 0000:03:00.0: [drm:intel_dp_compute_config_link_bpp_limits...
<7> [594.156281] xe 0000:03:00.0: [drm:intel_dp_compute_link_config [xe]] DP l...
<7> [594.156527] xe 0000:03:00.0: [drm:intel_psr_compute_config [xe]] PSR disa...
<7> [594.156742] xe 0000:03:00.0: [drm:intel_atomic_check [xe]] [CRTC:82:pipe ...
<7> [594.157035] xe 0000:03:00.0: [drm:intel_ddi_compute_config_late [xe]] [EN...
<7> [594.157372] xe 0000:03:00.0: [drm:intel_pipe_config_compare [xe]] [CRTC:8...
<7> [594.157710] xe 0000:03:00.0: [drm:intel_atomic_check [xe]] [CRTC:82:pipe ...
<7> [594.158380] xe 0000:03:00.0: [drm:intel_atomic_check [xe]] [CONNECTOR:254...
<7> [594.158585] xe 0000:03:00.0: [drm:intel_dp_compute_config_link_bpp_limits...
<7> [594.158701] xe 0000:03:00.0: [drm:intel_dp_compute_link_config [xe]] DP l...
<7> [594.158798] xe 0000:03:00.0: [drm:intel_psr_compute_config [xe]] PSR disa...
<7> [594.158871] xe 0000:03:00.0: [drm:intel_atomic_check [xe]] [CRTC:82:pipe ...
<7> [594.158957] xe 0000:03:00.0: [drm:intel_ddi_compute_config_late [xe]] [EN...
...
igt@xe_pm@s2idle-d3hot-basic-exec
igt@xe_pm@s2idle-d3hot-basic-exec
xe-1951-7a8eccb85643c21e82007be3ae31bbca47611079

<6> [70.508876] Console: switching to colour dummy device 80x25
<6> [70.508942] [IGT] xe_pm: executing
<6> [72.298460] [IGT] xe_pm: starting subtest s2idle-d3hot-basic-exec
<7> [72.299544] xe 0000:03:00.0: [drm:intel_atomic_check [xe]] [CONNECTOR:254:...
<7> [72.299925] xe 0000:03:00.0: [drm:intel_dp_compute_config_link_bpp_limits ...
<7> [72.300222] xe 0000:03:00.0: [drm:intel_dp_compute_link_config [xe]] DP la...
<7> [72.300525] xe 0000:03:00.0: [drm:intel_psr_compute_config [xe]] PSR disab...
<7> [72.300770] xe 0000:03:00.0: [drm:intel_atomic_check [xe]] [CRTC:82:pipe A...
<7> [72.301030] xe 0000:03:00.0: [drm:intel_ddi_compute_config_late [xe]] [ENC...
<7> [72.301291] xe 0000:03:00.0: [drm:intel_pipe_config_compare [xe]] [CRTC:82...
<7> [72.301551] xe 0000:03:00.0: [drm:intel_atomic_check [xe]] [CRTC:82:pipe A...
<7> [72.301857] xe 0000:03:00.0: [drm:skl_compute_wm [xe]] Enabled dbuf slices...
<7> [72.302061] xe 0000:03:00.0: [drm:skl_compute_wm [xe]] [CRTC:82:pipe A] db...
<7> [72.302161] xe 0000:03:00.0: [drm:skl_compute_wm [xe]] [PLANE:32:plane 1A]...
<7> [72.302214] xe 0000:03:00.0: [drm:skl_compute_wm [xe]] [PLANE:77:cursor A]...
<7> [72.302277] xe 0000:03:00.0: [drm:skl_compute_wm [xe]] [PLANE:32:plane 1A]...
<7> [72.302329] xe 0000:03:00.0: [drm:skl_compute_wm [xe]] [PLANE:32:plane 1A]...
...
igt@xe_pm@s3-d3cold-basic-exec
igt@xe_pm@s3-d3cold-basic-exec
xe-1951-7a8eccb85643c21e82007be3ae31bbca47611079

<6> [768.577340] Console: switching to colour dummy device 80x25
<6> [768.577665] [IGT] xe_pm: executing
<7> [769.340309] xe 0000:03:00.0: [drm:i915_hotplug_work_func [xe]] running en...
<7> [769.340438] xe 0000:03:00.0: [drm:i915_hotplug_work_func [xe]] Connector ...
<7> [769.340509] xe 0000:03:00.0: [drm:intel_dp_detect [xe]] [CONNECTOR:254:DP...
<7> [769.341830] xe 0000:03:00.0: [drm:drm_dp_read_dpcd_caps [drm_display_help...
<7> [769.341847] xe 0000:03:00.0: [drm:drm_dp_read_dpcd_caps [drm_display_help...
<7> [769.342377] xe 0000:03:00.0: [drm:intel_dp_init_lttpr_and_dprx_caps [xe]]...
<7> [769.343513] xe 0000:03:00.0: [drm:drm_dp_read_dpcd_caps [drm_display_help...
<7> [769.343523] xe 0000:03:00.0: [drm:drm_dp_read_dpcd_caps [drm_display_help...
<7> [769.344066] xe 0000:03:00.0: [drm:drm_dp_dump_desc.isra.0 [drm_display_he...
<7> [769.344451] xe 0000:03:00.0: [drm:intel_dp_detect [xe]] [ENCODER:253:DDI ...
<7> [769.345840] xe 0000:03:00.0: [drm:intel_dp_read_dsc_dpcd [xe]] DSC DPCD: ...
<7> [769.346308] xe 0000:03:00.0: [drm:intel_dp_get_dsc_sink_cap [xe]] FEC CAP...
<7> [769.346787] xe 0000:03:00.0: [drm:intel_dp_print_rates [xe]] source rates...
<7> [769.346870] xe 0000:03:00.0: [drm:intel_dp_print_rates [xe]] sink rates: ...
<7> [769.346949] xe 0000:03:00.0: [drm:intel_dp_print_rates [xe]] common rates...
...
igt@xe_pm@s4-d3hot-basic-exec
D igt@xe_pm@s4-d3hot-basic-exec
xe-1951-7a8eccb85643c21e82007be3ae31bbca47611079

<3> [630.445894] xe 0000:03:00.0: [drm] *ERROR* DC state mismatch (0x8 -> 0x40...
<3> [630.445969] xe 0000:03:00.0: [drm] *ERROR* Writing dc state to 0xbffffff4...
<4> [630.446071] WARNING: CPU: 1 PID: 1950 at drivers/gpu/drm/i915/display/int...
<4> [630.446148] Modules linked in: snd_hda_codec_hdmi snd_hda_intel mei_gsc x...
<4> [630.446693]  intel_cdclk_get_cdclk+0x12/0x20 [xe]
<4> [630.446929]  intel_power_well_enable+0x5c/0x70 [xe]
<4> [630.447008]  intel_power_well_get+0x20/0x30 [xe]
<4> [630.447086]  __intel_display_power_get_domain.part.0+0x59/0x90 [xe]
<4> [630.447165]  intel_display_power_get+0x4c/0x70 [xe]
<4> [630.447243]  intel_atomic_commit_tail+0x112/0x1340 [xe]
<4> [630.447338]  intel_atomic_commit+0x37c/0x3c0 [xe]
<4> [630.447420]  ? intel_atomic_commit+0x37c/0x3c0 [xe]
<4> [630.447502]  drm_atomic_commit+0xa5/0xe0 [drm]
<4> [630.447524]  ? __pfx___drm_printfn_info+0x10/0x10 [drm]
<4> [630.447552]  drm_client_modeset_commit_atomic+0x25e/0x2b0 [drm]
<4> [630.447583]  drm_client_modeset_commit_locked+0x5c/0x1a0 [drm]
<4> [630.447605]  drm_client_modeset_commit+0x27/0x50 [drm]
...
igt@xe_wedged@basic-wedged
D igt@xe_wedged@basic-wedged
xe-1951-7a8eccb85643c21e82007be3ae31bbca47611079

<4> [587.720869]  ? __pfx___drm_printfn_seq_file+0x10/0x10 [drm]
<4> [587.720895]  ? __pfx___drm_puts_seq_file+0x10/0x10 [drm]
<3> [587.721517] xe 0000:03:00.0: [drm] *ERROR* GT0: reset failed (-ECANCELED)
Created at 2024-09-17 13:44:42