FAIL WARN PASS SKIP TIMEOUT NOT RUN INCOMPLETE ABORT CRASH
 
xe-2900-135e2838ed7d44d880e7e19971b1234e6ae04ded IGT_8302 xe-2899-8f917568adaeea8b649e337e7d0e03bd03332253 xe-2898-6deef7a0418bc26082804287b18c8db1e0810686 IGT_8301 xe-2897-883e4daea46ff15b470f138ee61573513243210d IGT_8300 IGT_8299 IGT_8298 xe-2896-f0fd77956987f035c79d08c812343a27a655a57b xe-2895-0d2ff6d7ad3b6bf64c5c0e9a921fcfa925029526 xe-2894-2dda6162c8d942406173d92a4cd3f23ea8a45696 xe-2893-3e77d2762ada61f9f8fe12faf72acf451d05273b xe-2892-f370ef549b9746079369aad1ee6ff4c4da972f25 xe-2891-075a54ae88695f050fb8baef7e98dee9dfd489df
bat-bmg-1
 
 
 
 
 
 
 
 
 
 
 
 
 
 
 
bat-bmg-2
 
 
 
 
 
 
 
 
 
 
 
 
 
 
 
re-bmg-2
 
 
 
 
 
 
 
 
 
 
 
 
 
 
 
re-bmg-3
 
 
 
 
 
 
 
 
 
 
 
 
 
 
 
re-bmg-4
 
 
 
 
 
 
 
 
 
 
 
 
 
 
 
re-bmg-5
 
 
 
 
 
 
 
 
 
 
 
 
 
 
 
re-bmg-6
 
 
 
 
 
 
 
 
 
 
 
 
 
 
 
shard-bmg-1
 
 
 
 
 
 
 
 
 
 
 
 
 
 
 
shard-bmg-2
 
 
 
 
 
 
 
 
 
 
 
 
 
 
 
shard-bmg-3
 
 
 
 
 
 
 
 
 
 
 
 
 
 
 
shard-bmg-4
 
 
 
 
 
 
 
 
 
 
 
 
 
 
 
shard-bmg-5
 
 
 
 
 
 
 
 
 
 
 
 
 
 
 
shard-bmg-6
 
 
 
 
 
 
 
 
 
 
 
 
 
 
 
shard-bmg-7
 
 
 
 
 
 
 
 
 
 
 
 
 
 
 
shard-bmg-8
 
 
 
 
 
 
 
 
 
 
 
 
 
 
 
bat-lnl-1
 
 
 
 
 
 
 
 
 
 
 
 
 
 
 
bat-lnl-2
 
 
 
 
 
 
 
 
 
 
 
 
 
 
 
re-lnl-1
 
 
igt@kms_async_flips@crc@pipe-a-edp-1
xe-2899-8f917568adaeea8b649e337e7d0e03bd03332253

Starting subtest: crc
Starting dynamic subtest: pipe-A-eDP-1
(kms_async_flips:2685) CRITICAL: Test assertion failure function test_crc, fil...
(kms_async_flips:2685) CRITICAL: Failed assertion: data->frame_count * 2 < dat...
(kms_async_flips:2685) CRITICAL: Last errno: 9, Bad file descriptor
(kms_async_flips:2685) CRITICAL: error: 958 >= 716
Dynamic subtest pipe-A-eDP-1 failed.
**** DEBUG ****
(kms_async_flips:2685) igt_kms-DEBUG: Test requirement passed: dir != -1
(kms_async_flips:2685) igt_kms-DEBUG: Test requirement passed: res > 0
(kms_async_flips:2685) DEBUG: Test requirement passed: !(is_joiner_mode(data->...
(kms_async_flips:2685) igt_fb-DEBUG: igt_create_fb_with_bo_size(width=2560, he...
(kms_async_flips:2685) drmtest-DEBUG: Test requirement passed: is_intel_device...
(kms_async_flips:2685) drmtest-DEBUG: Test requirement passed: is_intel_device...
(kms_async_flips:2685) igt_fb-DEBUG: igt_create_fb_with_bo_size(handle=1, pitc...
(kms_async_flips:2685) ioctl_wrappers-DEBUG: Test requirement passed: igt_has_...
(kms_async_flips:2685) igt_fb-DEBUG: Test requirement passed: cairo_surface_st...
...
 
 
 
 
 
 
 
igt@kms_async_flips@crc@pipe-a-edp-1
xe-2895-0d2ff6d7ad3b6bf64c5c0e9a921fcfa925029526

Starting subtest: crc
Starting dynamic subtest: pipe-A-eDP-1
(kms_async_flips:3150) CRITICAL: Test assertion failure function test_crc, fil...
(kms_async_flips:3150) CRITICAL: Failed assertion: data->frame_count * 2 < dat...
(kms_async_flips:3150) CRITICAL: Last errno: 9, Bad file descriptor
(kms_async_flips:3150) CRITICAL: error: 958 >= 717
Dynamic subtest pipe-A-eDP-1 failed.
**** DEBUG ****
(kms_async_flips:3150) igt_kms-DEBUG: Test requirement passed: dir != -1
(kms_async_flips:3150) igt_kms-DEBUG: Test requirement passed: res > 0
(kms_async_flips:3150) DEBUG: Test requirement passed: !(is_joiner_mode(data->...
(kms_async_flips:3150) igt_fb-DEBUG: igt_create_fb_with_bo_size(width=2560, he...
(kms_async_flips:3150) drmtest-DEBUG: Test requirement passed: is_intel_device...
(kms_async_flips:3150) drmtest-DEBUG: Test requirement passed: is_intel_device...
(kms_async_flips:3150) igt_fb-DEBUG: igt_create_fb_with_bo_size(handle=1, pitc...
(kms_async_flips:3150) ioctl_wrappers-DEBUG: Test requirement passed: igt_has_...
(kms_async_flips:3150) intel_allocator_simple-DEBUG: Using simple allocator
...
 
 
 
 
re-lnl-2
 
 
 
 
 
 
 
 
 
 
 
 
 
 
 
re-lnl-3
 
 
 
 
 
 
 
 
 
 
 
 
 
re-lnl-4
 
 
 
 
 
 
 
 
 
 
 
 
 
re-lnl-5
 
 
 
 
 
 
 
 
 
 
 
 
 
re-lnl-7
 
 
 
 
 
 
 
 
 
 
igt@kms_async_flips@crc@pipe-a-edp-1
xe-2895-0d2ff6d7ad3b6bf64c5c0e9a921fcfa925029526

Starting subtest: crc
Starting dynamic subtest: pipe-A-eDP-1
(kms_async_flips:5478) CRITICAL: Test assertion failure function test_crc, fil...
(kms_async_flips:5478) CRITICAL: Failed assertion: data->frame_count * 2 < dat...
(kms_async_flips:5478) CRITICAL: Last errno: 9, Bad file descriptor
(kms_async_flips:5478) CRITICAL: error: 960 >= 681
Dynamic subtest pipe-A-eDP-1 failed.
**** DEBUG ****
(kms_async_flips:5478) igt_kms-DEBUG: Test requirement passed: dir != -1
(kms_async_flips:5478) igt_kms-DEBUG: Test requirement passed: res > 0
(kms_async_flips:5478) DEBUG: Test requirement passed: !(is_joiner_mode(data->...
(kms_async_flips:5478) igt_fb-DEBUG: igt_create_fb_with_bo_size(width=2560, he...
(kms_async_flips:5478) drmtest-DEBUG: Test requirement passed: is_intel_device...
(kms_async_flips:5478) drmtest-DEBUG: Test requirement passed: is_intel_device...
(kms_async_flips:5478) igt_fb-DEBUG: igt_create_fb_with_bo_size(handle=1, pitc...
(kms_async_flips:5478) ioctl_wrappers-DEBUG: Test requirement passed: igt_has_...
(kms_async_flips:5478) intel_allocator_simple-DEBUG: Using simple allocator
...
 
 
 
 
re-lnl-8
 
 
 
 
 
 
 
 
 
 
 
 
 
shard-lnl-1
 
 
 
 
 
 
 
 
 
 
 
 
 
 
 
shard-lnl-2
 
 
 
 
 
 
 
 
 
 
 
 
 
shard-lnl-3
 
 
 
 
 
 
 
 
 
 
 
 
 
 
shard-lnl-4
 
 
 
 
 
 
 
 
 
 
 
 
 
shard-lnl-5
 
 
 
 
 
 
 
 
 
 
 
 
 
 
 
shard-lnl-6
 
 
 
 
 
 
 
 
 
 
 
 
 
shard-lnl-7
 
 
 
 
 
 
 
 
 
 
 
 
 
 
shard-lnl-8
 
 
 
 
 
 
 
 
 
 
 
bat-atsm-2
 
 
 
 
 
 
 
 
 
 
 
 
 
 
 
bat-dg2-oem2
 
 
 
 
 
 
 
 
 
 
 
 
 
 
 
shard-dg2-432
 
 
 
 
 
 
 
 
 
 
 
 
 
 
 
shard-dg2-433
 
 
 
 
 
 
 
 
 
 
 
 
 
 
 
shard-dg2-435
 
 
 
 
 
 
 
 
 
 
 
 
 
 
 
shard-dg2-463
 
 
 
 
 
 
 
 
 
 
 
 
 
 
 
shard-dg2-464
 
 
 
 
 
 
 
 
 
 
 
 
 
 
 
shard-dg2-466
 
 
 
 
 
 
 
 
 
 
 
 
 
 
 
bat-adlp-7
 
 
 
 
 
 
 
 
 
 
 
 
 
 
 
bat-adlp-vf
 
 
 
 
 
 
 
 
 
 
 
 
 
 
 
bat-adlp-vm
 
 
 
 
 
 
 
 
 
 
 
 
 
 
 
shard-adlp-1
 
 
 
 
 
 
 
 
 
 
 
 
 
 
 
shard-adlp-2
 
 
 
 
 
 
 
 
 
 
 
 
 
 
 
shard-adlp-4
 
 
 
 
 
 
 
 
 
 
 
 
 
 
 
shard-adlp-6
 
 
 
 
 
 
 
 
 
 
 
 
 
 
 
shard-adlp-8
 
 
 
 
 
 
 
 
 
 
 
 
 
 
 
shard-adlp-9
 
 
 
 
 
 
 
 
 
 
 
 
 
 
 
Created at 2025-04-03 08:42:42