FAIL WARN PASS SKIP TIMEOUT NOT RUN INCOMPLETE ABORT CRASH
 
CI_DRM_16373 IGT_8309 IGT_8308 CI_DRM_16372 CI_DRM_16371 IGT_8307 IGT_8306 IGT_8305 CI_DRM_16370 CI_DRM_16369 CI_DRM_16368 IGT_8304 IGT_8303 CI_DRM_16367 IGT_8302 CI_DRM_16365 IGT_8301 CI_DRM_16364 CI_DRM_16363 IGT_8300 IGT_8299 IGT_8298 CI_DRM_16362 CI_DRM_16361 CI_DRM_16360 CI_DRM_16359 CI_DRM_16358 CI_DRM_16357 CI_DRM_16355 IGT_8297 IGT_8296 IGT_8295 IGT_8294 CI_DRM_16353 CI_DRM_16352 CI_DRM_16351 CI_DRM_16350 CI_DRM_16349 CI_DRM_16347
shard-mtlp
 
 
shard-dg2
 
igt@perf@non-zero-reason@0-rcs0
IGT_8309

Starting subtest: non-zero-reason
Starting dynamic subtest: 0-rcs0
(perf:2042) CRITICAL: Test assertion failure function gen8_sanity_check_test_o...
(perf:2042) CRITICAL: Failed assertion: b == clock_delta
(perf:2042) CRITICAL: error: -1391199 != 26630
Dynamic subtest 0-rcs0 failed.
**** DEBUG ****
(perf:2042) DEBUG: freq = 1993
(perf:2042) DEBUG: clock delta = 26580
(perf:2042) DEBUG: A40_4: delta = 0
(perf:2042) DEBUG: A40_5: delta = 0
(perf:2042) DEBUG: A40_6: delta = 30
(perf:2042) DEBUG: A40_7: delta = 0
(perf:2042) DEBUG: A40_8: delta = 0
(perf:2042) DEBUG: A40_9: delta = 0
(perf:2042) DEBUG: A40_10: delta = 0
(perf:2042) DEBUG: A40_11: delta = 0
...
igt@perf@non-zero-reason@0-rcs0
IGT_8308

Starting subtest: non-zero-reason
Starting dynamic subtest: 0-rcs0
(perf:2353) CRITICAL: Test assertion failure function gen8_sanity_check_test_o...
(perf:2353) CRITICAL: Failed assertion: b == clock_delta
(perf:2353) CRITICAL: error: -585983 != 9317
Dynamic subtest 0-rcs0 failed.
**** DEBUG ****
(perf:2353) DEBUG: freq = 699
(perf:2353) DEBUG: clock delta = 9329
(perf:2353) DEBUG: A40_4: delta = 0
(perf:2353) DEBUG: A40_5: delta = 0
(perf:2353) DEBUG: A40_6: delta = 22
(perf:2353) DEBUG: A40_7: delta = 0
(perf:2353) DEBUG: A40_8: delta = 0
(perf:2353) DEBUG: A40_9: delta = 0
(perf:2353) DEBUG: A40_10: delta = 0
(perf:2353) DEBUG: A40_11: delta = 0
...
igt@perf@non-zero-reason@0-rcs0
CI_DRM_16372

Starting subtest: non-zero-reason
Starting dynamic subtest: 0-rcs0
(perf:2002) CRITICAL: Test assertion failure function gen8_sanity_check_test_o...
(perf:2002) CRITICAL: Failed assertion: b == clock_delta
(perf:2002) CRITICAL: error: -418315 != 7995
Dynamic subtest 0-rcs0 failed.
**** DEBUG ****
(perf:2002) DEBUG: freq = 598
(perf:2002) DEBUG: clock delta = 7980
(perf:2002) DEBUG: A40_4: delta = 0
(perf:2002) DEBUG: A40_5: delta = 0
(perf:2002) DEBUG: A40_6: delta = 92
(perf:2002) DEBUG: A40_7: delta = 0
(perf:2002) DEBUG: A40_8: delta = 0
(perf:2002) DEBUG: A40_9: delta = 0
(perf:2002) DEBUG: A40_10: delta = 0
(perf:2002) DEBUG: A40_11: delta = 0
...
igt@perf@non-zero-reason@0-rcs0
CI_DRM_16371

Starting subtest: non-zero-reason
Starting dynamic subtest: 0-rcs0
(perf:1997) CRITICAL: Test assertion failure function test_non_zero_reason, fi...
(perf:1997) CRITICAL: Failed assertion: reason != 0
(perf:1997) CRITICAL: error: 0 == 0
Dynamic subtest 0-rcs0 failed.
**** DEBUG ****
(perf:1997) DEBUG: A40_15: delta = 0
(perf:1997) DEBUG: A40_16: delta = 0
(perf:1997) DEBUG: A40_17: delta = 0
(perf:1997) DEBUG: A40_18: delta = 0
(perf:1997) DEBUG: A40_19: delta = 0
(perf:1997) DEBUG: A40_20: delta = 0
(perf:1997) DEBUG: A40_21: delta = 0
(perf:1997) DEBUG: A40_22: delta = 0
(perf:1997) DEBUG: A40_23: delta = 0
(perf:1997) DEBUG: A0: delta = 7988
...
igt@perf@non-zero-reason@0-rcs0
IGT_8307

Starting subtest: non-zero-reason
Starting dynamic subtest: 0-rcs0
(perf:2009) CRITICAL: Test assertion failure function test_non_zero_reason, fi...
(perf:2009) CRITICAL: Failed assertion: reason != 0
(perf:2009) CRITICAL: error: 0 == 0
Dynamic subtest 0-rcs0 failed.
**** DEBUG ****
(perf:2009) DEBUG: A40_15: delta = 0
(perf:2009) DEBUG: A40_16: delta = 0
(perf:2009) DEBUG: A40_17: delta = 0
(perf:2009) DEBUG: A40_18: delta = 0
(perf:2009) DEBUG: A40_19: delta = 0
(perf:2009) DEBUG: A40_20: delta = 0
(perf:2009) DEBUG: A40_21: delta = 0
(perf:2009) DEBUG: A40_22: delta = 0
(perf:2009) DEBUG: A40_23: delta = 0
(perf:2009) DEBUG: A0: delta = 7979
...
igt@perf@non-zero-reason@0-rcs0
IGT_8306

Starting subtest: non-zero-reason
Starting dynamic subtest: 0-rcs0
(perf:2058) CRITICAL: Test assertion failure function gen8_sanity_check_test_o...
(perf:2058) CRITICAL: Failed assertion: b == clock_delta
(perf:2058) CRITICAL: error: -852242 != 10650
Dynamic subtest 0-rcs0 failed.
**** DEBUG ****
(perf:2058) DEBUG: freq = 799
(perf:2058) DEBUG: clock delta = 10662
(perf:2058) DEBUG: A40_4: delta = 0
(perf:2058) DEBUG: A40_5: delta = 0
(perf:2058) DEBUG: A40_6: delta = 29
(perf:2058) DEBUG: A40_7: delta = 0
(perf:2058) DEBUG: A40_8: delta = 0
(perf:2058) DEBUG: A40_9: delta = 0
(perf:2058) DEBUG: A40_10: delta = 0
(perf:2058) DEBUG: A40_11: delta = 0
...
igt@perf@non-zero-reason@0-rcs0
IGT_8305

Starting subtest: non-zero-reason
Starting dynamic subtest: 0-rcs0
(perf:2187) CRITICAL: Test assertion failure function test_non_zero_reason, fi...
(perf:2187) CRITICAL: Failed assertion: reason != 0
(perf:2187) CRITICAL: error: 0 == 0
Dynamic subtest 0-rcs0 failed.
**** DEBUG ****
(perf:2187) DEBUG: A40_15: delta = 0
(perf:2187) DEBUG: A40_16: delta = 0
(perf:2187) DEBUG: A40_17: delta = 0
(perf:2187) DEBUG: A40_18: delta = 0
(perf:2187) DEBUG: A40_19: delta = 0
(perf:2187) DEBUG: A40_20: delta = 0
(perf:2187) DEBUG: A40_21: delta = 0
(perf:2187) DEBUG: A40_22: delta = 0
(perf:2187) DEBUG: A40_23: delta = 0
(perf:2187) DEBUG: A0: delta = 7990
...
igt@perf@non-zero-reason@0-rcs0
CI_DRM_16370

Starting subtest: non-zero-reason
Starting dynamic subtest: 0-rcs0
(perf:2355) CRITICAL: Test assertion failure function gen8_sanity_check_test_o...
(perf:2355) CRITICAL: Failed assertion: b == clock_delta
(perf:2355) CRITICAL: error: -1262263 != 9310
Dynamic subtest 0-rcs0 failed.
**** DEBUG ****
(perf:2355) DEBUG: freq = 697
(perf:2355) DEBUG: clock delta = 9305
(perf:2355) DEBUG: A40_4: delta = 0
(perf:2355) DEBUG: A40_5: delta = 0
(perf:2355) DEBUG: A40_6: delta = 38
(perf:2355) DEBUG: A40_7: delta = 0
(perf:2355) DEBUG: A40_8: delta = 0
(perf:2355) DEBUG: A40_9: delta = 0
(perf:2355) DEBUG: A40_10: delta = 0
(perf:2355) DEBUG: A40_11: delta = 0
...
igt@perf@non-zero-reason@0-rcs0
CI_DRM_16369

Starting subtest: non-zero-reason
Starting dynamic subtest: 0-rcs0
(perf:2333) CRITICAL: Test assertion failure function test_non_zero_reason, fi...
(perf:2333) CRITICAL: Failed assertion: reason != 0
(perf:2333) CRITICAL: error: 0 == 0
Dynamic subtest 0-rcs0 failed.
**** DEBUG ****
(perf:2333) DEBUG: A40_15: delta = 0
(perf:2333) DEBUG: A40_16: delta = 0
(perf:2333) DEBUG: A40_17: delta = 0
(perf:2333) DEBUG: A40_18: delta = 0
(perf:2333) DEBUG: A40_19: delta = 0
(perf:2333) DEBUG: A40_20: delta = 0
(perf:2333) DEBUG: A40_21: delta = 0
(perf:2333) DEBUG: A40_22: delta = 0
(perf:2333) DEBUG: A40_23: delta = 0
(perf:2333) DEBUG: A0: delta = 9302
...
igt@perf@non-zero-reason@0-rcs0
CI_DRM_16368

Starting subtest: non-zero-reason
Starting dynamic subtest: 0-rcs0
(perf:2348) CRITICAL: Test assertion failure function test_non_zero_reason, fi...
(perf:2348) CRITICAL: Failed assertion: reason != 0
(perf:2348) CRITICAL: error: 0 == 0
Dynamic subtest 0-rcs0 failed.
**** DEBUG ****
(perf:2348) DEBUG: A40_15: delta = 0
(perf:2348) DEBUG: A40_16: delta = 0
(perf:2348) DEBUG: A40_17: delta = 0
(perf:2348) DEBUG: A40_18: delta = 0
(perf:2348) DEBUG: A40_19: delta = 0
(perf:2348) DEBUG: A40_20: delta = 0
(perf:2348) DEBUG: A40_21: delta = 0
(perf:2348) DEBUG: A40_22: delta = 0
(perf:2348) DEBUG: A40_23: delta = 0
(perf:2348) DEBUG: A0: delta = 9307
...
igt@perf@non-zero-reason@0-rcs0
IGT_8304

Starting subtest: non-zero-reason
Starting dynamic subtest: 0-rcs0
(perf:2366) CRITICAL: Test assertion failure function gen8_sanity_check_test_o...
(perf:2366) CRITICAL: Failed assertion: b == clock_delta
(perf:2366) CRITICAL: error: -796462 != 9317
Dynamic subtest 0-rcs0 failed.
**** DEBUG ****
(perf:2366) DEBUG: freq = 697
(perf:2366) DEBUG: clock delta = 9301
(perf:2366) DEBUG: A40_4: delta = 0
(perf:2366) DEBUG: A40_5: delta = 0
(perf:2366) DEBUG: A40_6: delta = 94
(perf:2366) DEBUG: A40_7: delta = 0
(perf:2366) DEBUG: A40_8: delta = 0
(perf:2366) DEBUG: A40_9: delta = 0
(perf:2366) DEBUG: A40_10: delta = 0
(perf:2366) DEBUG: A40_11: delta = 0
...
igt@perf@non-zero-reason@0-rcs0
IGT_8303

Starting subtest: non-zero-reason
Starting dynamic subtest: 0-rcs0
(perf:2546) CRITICAL: Test assertion failure function test_non_zero_reason, fi...
(perf:2546) CRITICAL: Failed assertion: reason != 0
(perf:2546) CRITICAL: error: 0 == 0
Dynamic subtest 0-rcs0 failed.
**** DEBUG ****
(perf:2546) DEBUG: A40_15: delta = 0
(perf:2546) DEBUG: A40_16: delta = 0
(perf:2546) DEBUG: A40_17: delta = 0
(perf:2546) DEBUG: A40_18: delta = 0
(perf:2546) DEBUG: A40_19: delta = 0
(perf:2546) DEBUG: A40_20: delta = 0
(perf:2546) DEBUG: A40_21: delta = 0
(perf:2546) DEBUG: A40_22: delta = 0
(perf:2546) DEBUG: A40_23: delta = 0
(perf:2546) DEBUG: A0: delta = 9326
...
igt@perf@non-zero-reason@0-rcs0
CI_DRM_16367

Starting subtest: non-zero-reason
Starting dynamic subtest: 0-rcs0
(perf:2186) CRITICAL: Test assertion failure function test_non_zero_reason, fi...
(perf:2186) CRITICAL: Failed assertion: reason != 0
(perf:2186) CRITICAL: error: 0 == 0
Dynamic subtest 0-rcs0 failed.
**** DEBUG ****
(perf:2186) DEBUG: A40_15: delta = 0
(perf:2186) DEBUG: A40_16: delta = 0
(perf:2186) DEBUG: A40_17: delta = 0
(perf:2186) DEBUG: A40_18: delta = 0
(perf:2186) DEBUG: A40_19: delta = 0
(perf:2186) DEBUG: A40_20: delta = 0
(perf:2186) DEBUG: A40_21: delta = 0
(perf:2186) DEBUG: A40_22: delta = 0
(perf:2186) DEBUG: A40_23: delta = 0
(perf:2186) DEBUG: A0: delta = 18620
...
igt@perf@non-zero-reason@0-rcs0
IGT_8302

Starting subtest: non-zero-reason
Starting dynamic subtest: 0-rcs0
(perf:2203) CRITICAL: Test assertion failure function test_non_zero_reason, fi...
(perf:2203) CRITICAL: Failed assertion: reason != 0
(perf:2203) CRITICAL: error: 0 == 0
Dynamic subtest 0-rcs0 failed.
**** DEBUG ****
(perf:2203) DEBUG: A40_15: delta = 0
(perf:2203) DEBUG: A40_16: delta = 0
(perf:2203) DEBUG: A40_17: delta = 0
(perf:2203) DEBUG: A40_18: delta = 0
(perf:2203) DEBUG: A40_19: delta = 0
(perf:2203) DEBUG: A40_20: delta = 0
(perf:2203) DEBUG: A40_21: delta = 0
(perf:2203) DEBUG: A40_22: delta = 0
(perf:2203) DEBUG: A40_23: delta = 0
(perf:2203) DEBUG: A0: delta = 21280
...
igt@perf@non-zero-reason@0-rcs0
CI_DRM_16365

Starting subtest: non-zero-reason
Starting dynamic subtest: 0-rcs0
(perf:2559) CRITICAL: Test assertion failure function test_non_zero_reason, fi...
(perf:2559) CRITICAL: Failed assertion: reason != 0
(perf:2559) CRITICAL: error: 0 == 0
Dynamic subtest 0-rcs0 failed.
**** DEBUG ****
(perf:2559) DEBUG: A40_15: delta = 0
(perf:2559) DEBUG: A40_16: delta = 0
(perf:2559) DEBUG: A40_17: delta = 0
(perf:2559) DEBUG: A40_18: delta = 0
(perf:2559) DEBUG: A40_19: delta = 0
(perf:2559) DEBUG: A40_20: delta = 0
(perf:2559) DEBUG: A40_21: delta = 0
(perf:2559) DEBUG: A40_22: delta = 0
(perf:2559) DEBUG: A40_23: delta = 0
(perf:2559) DEBUG: A0: delta = 9299
...
igt@perf@non-zero-reason@0-rcs0
IGT_8301

Starting subtest: non-zero-reason
Starting dynamic subtest: 0-rcs0
(perf:2611) CRITICAL: Test assertion failure function gen8_sanity_check_test_o...
(perf:2611) CRITICAL: Failed assertion: b == clock_delta
(perf:2611) CRITICAL: error: -569576 != 9314
Dynamic subtest 0-rcs0 failed.
**** DEBUG ****
(perf:2611) DEBUG: freq = 699
(perf:2611) DEBUG: clock delta = 9331
(perf:2611) DEBUG: A40_4: delta = 0
(perf:2611) DEBUG: A40_5: delta = 0
(perf:2611) DEBUG: A40_6: delta = 104
(perf:2611) DEBUG: A40_7: delta = 0
(perf:2611) DEBUG: A40_8: delta = 0
(perf:2611) DEBUG: A40_9: delta = 0
(perf:2611) DEBUG: A40_10: delta = 0
(perf:2611) DEBUG: A40_11: delta = 0
...
igt@perf@non-zero-reason@0-rcs0
CI_DRM_16364

Starting subtest: non-zero-reason
Starting dynamic subtest: 0-rcs0
(perf:2112) CRITICAL: Test assertion failure function test_non_zero_reason, fi...
(perf:2112) CRITICAL: Failed assertion: reason != 0
(perf:2112) CRITICAL: error: 0 == 0
Dynamic subtest 0-rcs0 failed.
**** DEBUG ****
(perf:2112) DEBUG: A40_15: delta = 0
(perf:2112) DEBUG: A40_16: delta = 0
(perf:2112) DEBUG: A40_17: delta = 0
(perf:2112) DEBUG: A40_18: delta = 0
(perf:2112) DEBUG: A40_19: delta = 0
(perf:2112) DEBUG: A40_20: delta = 0
(perf:2112) DEBUG: A40_21: delta = 0
(perf:2112) DEBUG: A40_22: delta = 0
(perf:2112) DEBUG: A40_23: delta = 0
(perf:2112) DEBUG: A0: delta = 10648
...
igt@perf@non-zero-reason@0-rcs0
CI_DRM_16363

Starting subtest: non-zero-reason
Starting dynamic subtest: 0-rcs0
(perf:2117) CRITICAL: Test assertion failure function test_non_zero_reason, fi...
(perf:2117) CRITICAL: Failed assertion: reason != 0
(perf:2117) CRITICAL: error: 0 == 0
Dynamic subtest 0-rcs0 failed.
**** DEBUG ****
(perf:2117) DEBUG: A40_15: delta = 0
(perf:2117) DEBUG: A40_16: delta = 0
(perf:2117) DEBUG: A40_17: delta = 0
(perf:2117) DEBUG: A40_18: delta = 0
(perf:2117) DEBUG: A40_19: delta = 0
(perf:2117) DEBUG: A40_20: delta = 0
(perf:2117) DEBUG: A40_21: delta = 0
(perf:2117) DEBUG: A40_22: delta = 0
(perf:2117) DEBUG: A40_23: delta = 0
(perf:2117) DEBUG: A0: delta = 9301
...
igt@perf@non-zero-reason@0-rcs0
IGT_8300

Starting subtest: non-zero-reason
Starting dynamic subtest: 0-rcs0
(perf:2121) CRITICAL: Test assertion failure function test_non_zero_reason, fi...
(perf:2121) CRITICAL: Failed assertion: reason != 0
(perf:2121) CRITICAL: error: 0 == 0
Dynamic subtest 0-rcs0 failed.
**** DEBUG ****
(perf:2121) DEBUG: A40_15: delta = 0
(perf:2121) DEBUG: A40_16: delta = 0
(perf:2121) DEBUG: A40_17: delta = 0
(perf:2121) DEBUG: A40_18: delta = 0
(perf:2121) DEBUG: A40_19: delta = 0
(perf:2121) DEBUG: A40_20: delta = 0
(perf:2121) DEBUG: A40_21: delta = 0
(perf:2121) DEBUG: A40_22: delta = 0
(perf:2121) DEBUG: A40_23: delta = 0
(perf:2121) DEBUG: A0: delta = 9322
...
igt@perf@non-zero-reason@0-rcs0
IGT_8299

Starting subtest: non-zero-reason
Starting dynamic subtest: 0-rcs0
(perf:9704) CRITICAL: Test assertion failure function gen8_sanity_check_test_o...
(perf:9704) CRITICAL: Failed assertion: b == clock_delta
(perf:9704) CRITICAL: error: -999106 != 15990
Dynamic subtest 0-rcs0 failed.
**** DEBUG ****
(perf:9704) DEBUG: freq = 1198
(perf:9704) DEBUG: clock delta = 15975
(perf:9704) DEBUG: A40_4: delta = 0
(perf:9704) DEBUG: A40_5: delta = 0
(perf:9704) DEBUG: A40_6: delta = 25
(perf:9704) DEBUG: A40_7: delta = 0
(perf:9704) DEBUG: A40_8: delta = 0
(perf:9704) DEBUG: A40_9: delta = 0
(perf:9704) DEBUG: A40_10: delta = 0
(perf:9704) DEBUG: A40_11: delta = 0
...
igt@perf@non-zero-reason@0-rcs0
IGT_8298

Starting subtest: non-zero-reason
Starting dynamic subtest: 0-rcs0
(perf:2241) CRITICAL: Test assertion failure function test_non_zero_reason, fi...
(perf:2241) CRITICAL: Failed assertion: reason != 0
(perf:2241) CRITICAL: error: 0 == 0
Dynamic subtest 0-rcs0 failed.
**** DEBUG ****
(perf:2241) DEBUG: A40_15: delta = 0
(perf:2241) DEBUG: A40_16: delta = 0
(perf:2241) DEBUG: A40_17: delta = 0
(perf:2241) DEBUG: A40_18: delta = 0
(perf:2241) DEBUG: A40_19: delta = 0
(perf:2241) DEBUG: A40_20: delta = 0
(perf:2241) DEBUG: A40_21: delta = 0
(perf:2241) DEBUG: A40_22: delta = 0
(perf:2241) DEBUG: A40_23: delta = 0
(perf:2241) DEBUG: A0: delta = 11983
...
igt@perf@non-zero-reason@0-rcs0
CI_DRM_16362

Starting subtest: non-zero-reason
Starting dynamic subtest: 0-rcs0
(perf:2753) CRITICAL: Test assertion failure function gen8_sanity_check_test_o...
(perf:2753) CRITICAL: Failed assertion: b == clock_delta
(perf:2753) CRITICAL: error: -418253 != 9307
Dynamic subtest 0-rcs0 failed.
**** DEBUG ****
(perf:2753) DEBUG: freq = 697
(perf:2753) DEBUG: clock delta = 9306
(perf:2753) DEBUG: A40_4: delta = 0
(perf:2753) DEBUG: A40_5: delta = 0
(perf:2753) DEBUG: A40_6: delta = 47
(perf:2753) DEBUG: A40_7: delta = 0
(perf:2753) DEBUG: A40_8: delta = 0
(perf:2753) DEBUG: A40_9: delta = 0
(perf:2753) DEBUG: A40_10: delta = 0
(perf:2753) DEBUG: A40_11: delta = 0
...
igt@perf@non-zero-reason@0-rcs0
CI_DRM_16361

Starting subtest: non-zero-reason
Starting dynamic subtest: 0-rcs0
(perf:2743) CRITICAL: Test assertion failure function test_non_zero_reason, fi...
(perf:2743) CRITICAL: Failed assertion: reason != 0
(perf:2743) CRITICAL: error: 0 == 0
Dynamic subtest 0-rcs0 failed.
**** DEBUG ****
(perf:2743) DEBUG: A40_15: delta = 0
(perf:2743) DEBUG: A40_16: delta = 0
(perf:2743) DEBUG: A40_17: delta = 0
(perf:2743) DEBUG: A40_18: delta = 0
(perf:2743) DEBUG: A40_19: delta = 0
(perf:2743) DEBUG: A40_20: delta = 0
(perf:2743) DEBUG: A40_21: delta = 0
(perf:2743) DEBUG: A40_22: delta = 0
(perf:2743) DEBUG: A40_23: delta = 0
(perf:2743) DEBUG: A0: delta = 7974
...
igt@perf@non-zero-reason@0-rcs0
CI_DRM_16360

Starting subtest: non-zero-reason
Starting dynamic subtest: 0-rcs0
(perf:2756) CRITICAL: Test assertion failure function gen8_sanity_check_test_o...
(perf:2756) CRITICAL: Failed assertion: b == clock_delta
(perf:2756) CRITICAL: error: -505280 != 9299
Dynamic subtest 0-rcs0 failed.
**** DEBUG ****
(perf:2756) DEBUG: freq = 698
(perf:2756) DEBUG: clock delta = 9317
(perf:2756) DEBUG: A40_4: delta = 0
(perf:2756) DEBUG: A40_5: delta = 0
(perf:2756) DEBUG: A40_6: delta = 20
(perf:2756) DEBUG: A40_7: delta = 0
(perf:2756) DEBUG: A40_8: delta = 0
(perf:2756) DEBUG: A40_9: delta = 0
(perf:2756) DEBUG: A40_10: delta = 0
(perf:2756) DEBUG: A40_11: delta = 0
...
igt@perf@non-zero-reason@0-rcs0
CI_DRM_16359

Starting subtest: non-zero-reason
Starting dynamic subtest: 0-rcs0
(perf:2734) CRITICAL: Test assertion failure function test_non_zero_reason, fi...
(perf:2734) CRITICAL: Failed assertion: reason != 0
(perf:2734) CRITICAL: error: 0 == 0
Dynamic subtest 0-rcs0 failed.
**** DEBUG ****
(perf:2734) DEBUG: A40_15: delta = 0
(perf:2734) DEBUG: A40_16: delta = 0
(perf:2734) DEBUG: A40_17: delta = 0
(perf:2734) DEBUG: A40_18: delta = 0
(perf:2734) DEBUG: A40_19: delta = 0
(perf:2734) DEBUG: A40_20: delta = 0
(perf:2734) DEBUG: A40_21: delta = 0
(perf:2734) DEBUG: A40_22: delta = 0
(perf:2734) DEBUG: A40_23: delta = 0
(perf:2734) DEBUG: A0: delta = 13297
...
igt@perf@non-zero-reason@0-rcs0
CI_DRM_16358

Starting subtest: non-zero-reason
Starting dynamic subtest: 0-rcs0
(perf:2751) CRITICAL: Test assertion failure function gen8_sanity_check_test_o...
(perf:2751) CRITICAL: Failed assertion: b == clock_delta
(perf:2751) CRITICAL: error: -717919 != 9329
Dynamic subtest 0-rcs0 failed.
**** DEBUG ****
(perf:2751) DEBUG: freq = 698
(perf:2751) DEBUG: clock delta = 9317
(perf:2751) DEBUG: A40_4: delta = 0
(perf:2751) DEBUG: A40_5: delta = 0
(perf:2751) DEBUG: A40_6: delta = 76
(perf:2751) DEBUG: A40_7: delta = 0
(perf:2751) DEBUG: A40_8: delta = 0
(perf:2751) DEBUG: A40_9: delta = 0
(perf:2751) DEBUG: A40_10: delta = 0
(perf:2751) DEBUG: A40_11: delta = 0
...
igt@perf@non-zero-reason@0-rcs0
CI_DRM_16357

Starting subtest: non-zero-reason
Starting dynamic subtest: 0-rcs0
(perf:2742) CRITICAL: Test assertion failure function gen8_sanity_check_test_o...
(perf:2742) CRITICAL: Failed assertion: b == clock_delta
(perf:2742) CRITICAL: error: -673687 != 9309
Dynamic subtest 0-rcs0 failed.
**** DEBUG ****
(perf:2742) DEBUG: freq = 699
(perf:2742) DEBUG: clock delta = 9327
(perf:2742) DEBUG: A40_4: delta = 0
(perf:2742) DEBUG: A40_5: delta = 0
(perf:2742) DEBUG: A40_6: delta = 34
(perf:2742) DEBUG: A40_7: delta = 0
(perf:2742) DEBUG: A40_8: delta = 0
(perf:2742) DEBUG: A40_9: delta = 0
(perf:2742) DEBUG: A40_10: delta = 0
(perf:2742) DEBUG: A40_11: delta = 0
...
igt@perf@non-zero-reason@0-rcs0
CI_DRM_16355

Starting subtest: non-zero-reason
Starting dynamic subtest: 0-rcs0
(perf:2755) CRITICAL: Test assertion failure function gen8_sanity_check_test_o...
(perf:2755) CRITICAL: Failed assertion: b == clock_delta
(perf:2755) CRITICAL: error: -707208 != 9309
Dynamic subtest 0-rcs0 failed.
**** DEBUG ****
(perf:2755) DEBUG: freq = 697
(perf:2755) DEBUG: clock delta = 9304
(perf:2755) DEBUG: A40_4: delta = 0
(perf:2755) DEBUG: A40_5: delta = 0
(perf:2755) DEBUG: A40_6: delta = 51
(perf:2755) DEBUG: A40_7: delta = 0
(perf:2755) DEBUG: A40_8: delta = 0
(perf:2755) DEBUG: A40_9: delta = 0
(perf:2755) DEBUG: A40_10: delta = 0
(perf:2755) DEBUG: A40_11: delta = 0
...
igt@perf@non-zero-reason@0-rcs0
IGT_8297

Starting subtest: non-zero-reason
Starting dynamic subtest: 0-rcs0
(perf:2754) CRITICAL: Test assertion failure function gen8_sanity_check_test_o...
(perf:2754) CRITICAL: Failed assertion: b == clock_delta
(perf:2754) CRITICAL: error: -579513 != 9329
Dynamic subtest 0-rcs0 failed.
**** DEBUG ****
(perf:2754) DEBUG: freq = 698
(perf:2754) DEBUG: clock delta = 9317
(perf:2754) DEBUG: A40_4: delta = 0
(perf:2754) DEBUG: A40_5: delta = 0
(perf:2754) DEBUG: A40_6: delta = 4
(perf:2754) DEBUG: A40_7: delta = 0
(perf:2754) DEBUG: A40_8: delta = 0
(perf:2754) DEBUG: A40_9: delta = 0
(perf:2754) DEBUG: A40_10: delta = 0
(perf:2754) DEBUG: A40_11: delta = 0
...
igt@perf@non-zero-reason@0-rcs0
IGT_8296

Starting subtest: non-zero-reason
Starting dynamic subtest: 0-rcs0
(perf:2347) CRITICAL: Test assertion failure function test_non_zero_reason, fi...
(perf:2347) CRITICAL: Failed assertion: reason != 0
(perf:2347) CRITICAL: error: 0 == 0
Dynamic subtest 0-rcs0 failed.
**** DEBUG ****
(perf:2347) DEBUG: A40_15: delta = 0
(perf:2347) DEBUG: A40_16: delta = 0
(perf:2347) DEBUG: A40_17: delta = 0
(perf:2347) DEBUG: A40_18: delta = 0
(perf:2347) DEBUG: A40_19: delta = 0
(perf:2347) DEBUG: A40_20: delta = 0
(perf:2347) DEBUG: A40_21: delta = 0
(perf:2347) DEBUG: A40_22: delta = 0
(perf:2347) DEBUG: A40_23: delta = 0
(perf:2347) DEBUG: A0: delta = 15987
...
igt@perf@non-zero-reason@0-rcs0
IGT_8295

Starting subtest: non-zero-reason
Starting dynamic subtest: 0-rcs0
(perf:2060) CRITICAL: Test assertion failure function gen8_sanity_check_test_o...
(perf:2060) CRITICAL: Failed assertion: b == clock_delta
(perf:2060) CRITICAL: error: -907826 != 14638
Dynamic subtest 0-rcs0 failed.
**** DEBUG ****
(perf:2060) DEBUG: freq = 1099
(perf:2060) DEBUG: clock delta = 14660
(perf:2060) DEBUG: A40_4: delta = 0
(perf:2060) DEBUG: A40_5: delta = 0
(perf:2060) DEBUG: A40_6: delta = 20
(perf:2060) DEBUG: A40_7: delta = 0
(perf:2060) DEBUG: A40_8: delta = 0
(perf:2060) DEBUG: A40_9: delta = 0
(perf:2060) DEBUG: A40_10: delta = 0
(perf:2060) DEBUG: A40_11: delta = 0
...
igt@perf@non-zero-reason@0-rcs0
IGT_8294

Starting subtest: non-zero-reason
Starting dynamic subtest: 0-rcs0
(perf:2068) CRITICAL: Test assertion failure function test_non_zero_reason, fi...
(perf:2068) CRITICAL: Failed assertion: reason != 0
(perf:2068) CRITICAL: error: 0 == 0
Dynamic subtest 0-rcs0 failed.
**** DEBUG ****
(perf:2068) DEBUG: A40_15: delta = 0
(perf:2068) DEBUG: A40_16: delta = 0
(perf:2068) DEBUG: A40_17: delta = 0
(perf:2068) DEBUG: A40_18: delta = 0
(perf:2068) DEBUG: A40_19: delta = 0
(perf:2068) DEBUG: A40_20: delta = 0
(perf:2068) DEBUG: A40_21: delta = 0
(perf:2068) DEBUG: A40_22: delta = 0
(perf:2068) DEBUG: A40_23: delta = 0
(perf:2068) DEBUG: A0: delta = 22627
...
igt@perf@non-zero-reason@0-rcs0
CI_DRM_16353

Starting subtest: non-zero-reason
Starting dynamic subtest: 0-rcs0
(perf:2019) CRITICAL: Test assertion failure function gen8_sanity_check_test_o...
(perf:2019) CRITICAL: Failed assertion: b == clock_delta
(perf:2019) CRITICAL: error: -409825 != 7998
Dynamic subtest 0-rcs0 failed.
**** DEBUG ****
(perf:2019) DEBUG: freq = 598
(perf:2019) DEBUG: clock delta = 7984
(perf:2019) DEBUG: A40_4: delta = 0
(perf:2019) DEBUG: A40_5: delta = 0
(perf:2019) DEBUG: A40_6: delta = 31
(perf:2019) DEBUG: A40_7: delta = 0
(perf:2019) DEBUG: A40_8: delta = 0
(perf:2019) DEBUG: A40_9: delta = 0
(perf:2019) DEBUG: A40_10: delta = 0
(perf:2019) DEBUG: A40_11: delta = 0
...
igt@perf@non-zero-reason@0-rcs0
CI_DRM_16352

Starting subtest: non-zero-reason
Starting dynamic subtest: 0-rcs0
(perf:2010) CRITICAL: Test assertion failure function test_non_zero_reason, fi...
(perf:2010) CRITICAL: Failed assertion: reason != 0
(perf:2010) CRITICAL: error: 0 == 0
Dynamic subtest 0-rcs0 failed.
**** DEBUG ****
(perf:2010) DEBUG: A40_15: delta = 0
(perf:2010) DEBUG: A40_16: delta = 0
(perf:2010) DEBUG: A40_17: delta = 0
(perf:2010) DEBUG: A40_18: delta = 0
(perf:2010) DEBUG: A40_19: delta = 0
(perf:2010) DEBUG: A40_20: delta = 0
(perf:2010) DEBUG: A40_21: delta = 0
(perf:2010) DEBUG: A40_22: delta = 0
(perf:2010) DEBUG: A40_23: delta = 0
(perf:2010) DEBUG: A0: delta = 9317
...
igt@perf@non-zero-reason@0-rcs0
CI_DRM_16351

Starting subtest: non-zero-reason
Starting dynamic subtest: 0-rcs0
(perf:2021) CRITICAL: Test assertion failure function gen8_sanity_check_test_o...
(perf:2021) CRITICAL: Failed assertion: b == clock_delta
(perf:2021) CRITICAL: error: -428962 != 7996
Dynamic subtest 0-rcs0 failed.
**** DEBUG ****
(perf:2021) DEBUG: freq = 599
(perf:2021) DEBUG: clock delta = 7987
(perf:2021) DEBUG: A40_4: delta = 0
(perf:2021) DEBUG: A40_5: delta = 0
(perf:2021) DEBUG: A40_6: delta = 61
(perf:2021) DEBUG: A40_7: delta = 0
(perf:2021) DEBUG: A40_8: delta = 0
(perf:2021) DEBUG: A40_9: delta = 0
(perf:2021) DEBUG: A40_10: delta = 0
(perf:2021) DEBUG: A40_11: delta = 0
...
igt@perf@non-zero-reason@0-rcs0
CI_DRM_16350

Starting subtest: non-zero-reason
Starting dynamic subtest: 0-rcs0
(perf:2021) CRITICAL: Test assertion failure function gen8_sanity_check_test_o...
(perf:2021) CRITICAL: Failed assertion: b == clock_delta
(perf:2021) CRITICAL: error: -578587 != 9319
Dynamic subtest 0-rcs0 failed.
**** DEBUG ****
(perf:2021) DEBUG: freq = 697
(perf:2021) DEBUG: clock delta = 9299
(perf:2021) DEBUG: A40_4: delta = 0
(perf:2021) DEBUG: A40_5: delta = 0
(perf:2021) DEBUG: A40_6: delta = 20
(perf:2021) DEBUG: A40_7: delta = 0
(perf:2021) DEBUG: A40_8: delta = 0
(perf:2021) DEBUG: A40_9: delta = 0
(perf:2021) DEBUG: A40_10: delta = 0
(perf:2021) DEBUG: A40_11: delta = 0
...
igt@perf@non-zero-reason@0-rcs0
CI_DRM_16349

Starting subtest: non-zero-reason
Starting dynamic subtest: 0-rcs0
(perf:2013) CRITICAL: Test assertion failure function test_non_zero_reason, fi...
(perf:2013) CRITICAL: Failed assertion: reason != 0
(perf:2013) CRITICAL: error: 0 == 0
Dynamic subtest 0-rcs0 failed.
**** DEBUG ****
(perf:2013) DEBUG: A40_15: delta = 0
(perf:2013) DEBUG: A40_16: delta = 0
(perf:2013) DEBUG: A40_17: delta = 0
(perf:2013) DEBUG: A40_18: delta = 0
(perf:2013) DEBUG: A40_19: delta = 0
(perf:2013) DEBUG: A40_20: delta = 0
(perf:2013) DEBUG: A40_21: delta = 0
(perf:2013) DEBUG: A40_22: delta = 0
(perf:2013) DEBUG: A40_23: delta = 0
(perf:2013) DEBUG: A0: delta = 9324
...
igt@perf@non-zero-reason@0-rcs0
CI_DRM_16347

Starting subtest: non-zero-reason
Starting dynamic subtest: 0-rcs0
(perf:2007) CRITICAL: Test assertion failure function test_non_zero_reason, fi...
(perf:2007) CRITICAL: Failed assertion: reason != 0
(perf:2007) CRITICAL: error: 0 == 0
Dynamic subtest 0-rcs0 failed.
**** DEBUG ****
(perf:2007) DEBUG: A40_15: delta = 0
(perf:2007) DEBUG: A40_16: delta = 0
(perf:2007) DEBUG: A40_17: delta = 0
(perf:2007) DEBUG: A40_18: delta = 0
(perf:2007) DEBUG: A40_19: delta = 0
(perf:2007) DEBUG: A40_20: delta = 0
(perf:2007) DEBUG: A40_21: delta = 0
(perf:2007) DEBUG: A40_22: delta = 0
(perf:2007) DEBUG: A40_23: delta = 0
(perf:2007) DEBUG: A0: delta = 9307
...
shard-rkl
 
 
 
 
 
 
 
 
 
 
 
 
shard-dg1
 
shard-tglu
 
 
shard-glk
 
 
 
 
 
 
 
 
 
 
 
 
 
 
Created at 2025-04-04 22:44:43