FAILED DMESG-FAIL DMESG-WARN WARN PASS SKIP TIMEOUT NOT RUN INCOMPLETE CRASH Hardware
fi-icl-u fi-icl-u2 fi-cnl-u fi-whl-u fi-cfl-8109u fi-cfl-8700k fi-cfl-guc fi-cfl-s3 fi-glk-dsi fi-glk-j4005 fi-kbl-7500u fi-kbl-7560u fi-kbl-7567u fi-kbl-8809g fi-kbl-guc fi-kbl-r fi-kbl-soraka fi-kbl-x1275 fi-apl-guc fi-bxt-dsi fi-bxt-j4205 fi-skl-6260u fi-skl-6600u fi-skl-6700hq fi-skl-6700k2 fi-skl-6770hq fi-skl-guc fi-skl-gvtdvm fi-skl-iommu fi-bsw-cyan fi-bsw-kefka fi-bsw-n3050 fi-bdw-5557u fi-bdw-gvtdvm fi-hsw-4200u fi-hsw-4770 fi-hsw-4770r fi-hsw-peppy fi-byt-clapper fi-byt-j1900 fi-byt-n2820 fi-byt-squawks fi-ivb-3520m fi-snb-2600 fi-ilk-650 fi-ilk-m540 fi-ctg-p8600 fi-elk-e7500 fi-bwr-2160 fi-pnv-d510 fi-blb-e6850 fi-gdg-551
IGT_4688 IGT_4687 IGT_4686 IGT_4685 IGT_4684 IGT_4688 IGT_4687 IGT_4686 IGT_4685 IGT_4684 IGT_4688 IGT_4687 IGT_4686 IGT_4685 IGT_4684 IGT_4688 IGT_4687 IGT_4686 IGT_4685 IGT_4684 IGT_4688 IGT_4687 IGT_4686 IGT_4685 IGT_4684 IGT_4688 IGT_4687 IGT_4686 IGT_4685 IGT_4684 IGT_4688 IGT_4687 IGT_4686 IGT_4685 IGT_4684 IGT_4688 IGT_4687 IGT_4686 IGT_4685 IGT_4684 IGT_4688 IGT_4687 IGT_4686 IGT_4685 IGT_4684 IGT_4688 IGT_4687 IGT_4686 IGT_4685 IGT_4684 IGT_4688 IGT_4687 IGT_4686 IGT_4685 IGT_4684 IGT_4688 IGT_4687 IGT_4686 IGT_4685 IGT_4684 IGT_4688 IGT_4687 IGT_4686 IGT_4685 IGT_4684 IGT_4688 IGT_4687 IGT_4686 IGT_4685 IGT_4684 IGT_4688 IGT_4687 IGT_4686 IGT_4685 IGT_4684 IGT_4688 IGT_4687 IGT_4686 IGT_4685 IGT_4684 IGT_4688 IGT_4687 IGT_4686 IGT_4685 IGT_4684 IGT_4688 IGT_4687 IGT_4686 IGT_4685 IGT_4684 IGT_4688 IGT_4687 IGT_4686 IGT_4685 IGT_4684 IGT_4688 IGT_4687 IGT_4686 IGT_4685 IGT_4684 IGT_4688 IGT_4687 IGT_4686 IGT_4685 IGT_4684 IGT_4688 IGT_4687 IGT_4686 IGT_4685 IGT_4684 IGT_4688 IGT_4687 IGT_4686 IGT_4685 IGT_4684 IGT_4688 IGT_4687 IGT_4686 IGT_4685 IGT_4684 IGT_4688 IGT_4687 IGT_4686 IGT_4685 IGT_4684 IGT_4688 IGT_4687 IGT_4686 IGT_4685 IGT_4684 IGT_4688 IGT_4687 IGT_4686 IGT_4685 IGT_4684 IGT_4688 IGT_4687 IGT_4686 IGT_4685 IGT_4684 IGT_4688 IGT_4687 IGT_4686 IGT_4685 IGT_4684 IGT_4688 IGT_4687 IGT_4686 IGT_4685 IGT_4684 IGT_4688 IGT_4687 IGT_4686 IGT_4685 IGT_4684 IGT_4688 IGT_4687 IGT_4686 IGT_4685 IGT_4684 IGT_4688 IGT_4687 IGT_4686 IGT_4685 IGT_4684 IGT_4688 IGT_4687 IGT_4686 IGT_4685 IGT_4684 IGT_4688 IGT_4687 IGT_4686 IGT_4685 IGT_4684 IGT_4688 IGT_4687 IGT_4686 IGT_4685 IGT_4684 IGT_4688 IGT_4687 IGT_4686 IGT_4685 IGT_4684 IGT_4688 IGT_4687 IGT_4686 IGT_4685 IGT_4684 IGT_4688 IGT_4687 IGT_4686 IGT_4685 IGT_4684 IGT_4688 IGT_4687 IGT_4686 IGT_4685 IGT_4684 IGT_4688 IGT_4687 IGT_4686 IGT_4685 IGT_4684 IGT_4688 IGT_4687 IGT_4686 IGT_4685 IGT_4684 IGT_4688 IGT_4687 IGT_4686 IGT_4685 IGT_4684 IGT_4688 IGT_4687 IGT_4686 IGT_4685 IGT_4684 IGT_4688 IGT_4687 IGT_4686 IGT_4685 IGT_4684 IGT_4688 IGT_4687 IGT_4686 IGT_4685 IGT_4684 IGT_4688 IGT_4687 IGT_4686 IGT_4685 IGT_4684 IGT_4688 IGT_4687 IGT_4686 IGT_4685 IGT_4684 IGT_4688 IGT_4687 IGT_4686 IGT_4685 IGT_4684 IGT_4688 IGT_4687 IGT_4686 IGT_4685 IGT_4684 IGT_4688 IGT_4687 IGT_4686 IGT_4685 IGT_4684 IGT_4688 IGT_4687 IGT_4686 IGT_4685 IGT_4684
igt@gem_exec_suspend@basic-s3
 
 
 
 
 
 
 
 
 
 
 
 
 
 
 
 
 
 
 
 
 
 
 
 
 
 
 
 
 
 
 
 
 
 
 
 
 
 
 
 
 
 
 
 
 
 
 
 
 
 
 
 
 
 
 
 
 
 
 
 
 
 
 
 
 
 
 
 
 
 
 
 
 
 
 
 
 
 
 
 
 IGT_4688 / fi-kbl-soraka
igt@gem_exec_suspend@basic-s3
<6> [215.721248] Console: switching to colour dummy device 80x25
<6> [215.721626] [IGT] gem_exec_suspend: executing
<5> [215.788512] Setting dangerous option reset - tainting kernel
<6> [215.813988] [IGT] gem_exec_suspend: starting subtest basic-S3
<7> [215.819297] [drm:intel_power_well_enable [i915]] enabling DC off
<7> [215.819863] [drm:gen9_set_dc_state [i915]] Setting DC state from 02 to 00
<7> [216.748744] [drm:intel_power_well_disable [i915]] disabling DC off
<7> [216.748966] [drm:gen9_dc_off_power_well_disable [i915]] Enabling DC6
<7> [216.750263] [drm:gen9_set_dc_state [i915]] Setting DC state from 00 to 02
<7> [216.762756] [drm:intel_power_well_enable [i915]] enabling DC off
<7> [216.763490] [drm:gen9_set_dc_state [i915]] Setting DC state from 02 to 00
<7> [217.668929] [drm:intel_power_well_disable [i915]] disabling DC off
<7> [217.669223] [drm:gen9_dc_off_power_well_disable [i915]] Enabling DC6
<7> [217.669385] [drm:gen9_set_dc_state [i915]] Setting DC state from 00 to 02
<7> [217.681969] [drm:intel_power_well_enable [i915]] enabling DC off
<7> [217.682580] [drm:gen9_set_dc_state [i915]] Setting DC state from 02 to 00
<7> [218.567227] [drm:intel_power_well_disable [i915]] disabling DC off
...
 IGT_4687 / fi-kbl-soraka
igt@gem_exec_suspend@basic-s3
<6> [224.556263] Console: switching to colour dummy device 80x25
<6> [224.556638] [IGT] gem_exec_suspend: executing
<5> [224.617008] Setting dangerous option reset - tainting kernel
<6> [224.642774] [IGT] gem_exec_suspend: starting subtest basic-S3
<7> [224.649084] [drm:intel_power_well_enable [i915]] enabling DC off
<7> [224.649802] [drm:gen9_set_dc_state [i915]] Setting DC state from 02 to 00
<7> [225.545167] [drm:intel_power_well_disable [i915]] disabling DC off
<7> [225.546282] [drm:gen9_dc_off_power_well_disable [i915]] Enabling DC6
<7> [225.546672] [drm:gen9_set_dc_state [i915]] Setting DC state from 00 to 02
<7> [225.558023] [drm:intel_power_well_enable [i915]] enabling DC off
<7> [225.558777] [drm:gen9_set_dc_state [i915]] Setting DC state from 02 to 00
<7> [226.511711] [drm:intel_power_well_disable [i915]] disabling DC off
<7> [226.511914] [drm:gen9_dc_off_power_well_disable [i915]] Enabling DC6
<7> [226.512099] [drm:gen9_set_dc_state [i915]] Setting DC state from 00 to 02
<7> [226.532406] [drm:intel_power_well_enable [i915]] enabling DC off
<7> [226.533081] [drm:gen9_set_dc_state [i915]] Setting DC state from 02 to 00
<7> [227.566385] [drm:intel_power_well_disable [i915]] disabling DC off
...
 IGT_4686 / fi-kbl-soraka
igt@gem_exec_suspend@basic-s3
<6> [216.443799] Console: switching to colour dummy device 80x25
<6> [216.444179] [IGT] gem_exec_suspend: executing
<5> [216.512731] Setting dangerous option reset - tainting kernel
<6> [216.538246] [IGT] gem_exec_suspend: starting subtest basic-S3
<7> [216.544499] [drm:intel_power_well_enable [i915]] enabling DC off
<7> [216.545062] [drm:gen9_set_dc_state [i915]] Setting DC state from 02 to 00
<7> [217.497899] [drm:intel_power_well_disable [i915]] disabling DC off
<7> [217.498081] [drm:gen9_dc_off_power_well_disable [i915]] Enabling DC6
<7> [217.498245] [drm:gen9_set_dc_state [i915]] Setting DC state from 00 to 02
<7> [217.508637] [drm:intel_power_well_enable [i915]] enabling DC off
<7> [217.509321] [drm:gen9_set_dc_state [i915]] Setting DC state from 02 to 00
<7> [218.437523] [drm:intel_power_well_disable [i915]] disabling DC off
<7> [218.438691] [drm:gen9_dc_off_power_well_disable [i915]] Enabling DC6
<7> [218.439205] [drm:gen9_set_dc_state [i915]] Setting DC state from 00 to 02
<7> [218.456345] [drm:intel_power_well_enable [i915]] enabling DC off
<7> [218.457078] [drm:gen9_set_dc_state [i915]] Setting DC state from 02 to 00
<7> [219.376048] [drm:intel_power_well_disable [i915]] disabling DC off
...
 
 
 
 
 
 
 
 
 
 
 
 
 
 
 
 
 
 
 
 
 
 
 
 
 
 
 
 
 
 
 
 
 
 
 
 
 
 
 
 
 
 
 
 
 
 
 
 
 
 
 
 
 
 
 
 
 
 
 
 
 
 
 
 
 
 
 
 
 
 
 
 
 
 
 
 
 
 
 
 
 
 
 
 
 
 
 
 
 
 
 
 
 
 
 
 
 
 
 
 
 
 
 
 
 
 
 
 
 
 
 
 
 
 
 
 
 
 
 
 
 
 
 
 
 
 
 
 
 
 
 
 
 
 
 
 
 
 
 
 
 
 
 IGT_4688 / fi-ilk-m540
<6> [82.178972] Console: switching to colour dummy device 80x25
<6> [82.179055] [IGT] gem_exec_suspend: executing
<5> [82.185911] Setting dangerous option reset - tainting kernel
<6> [82.193485] [IGT] gem_exec_suspend: starting subtest basic-S3
<7> [82.681567] [drm:i915_gem_do_execbuffer [i915]] EINVAL at i915_gem_do_exec...
<7> [82.681680] [drm:i915_gem_do_execbuffer [i915]] EINVAL at i915_gem_do_exec...
<6> [83.012062] PM: suspend entry (deep)
<6> [83.012098] PM: Syncing filesystems ... done.
<6> [83.018942] Freezing user space processes ... (elapsed 0.002 seconds) done.
<6> [83.021399] OOM killer disabled.
<6> [83.021403] Freezing remaining freezable tasks ... (elapsed 0.001 seconds)...
<6> [83.023660] Suspending console(s) (use no_console_suspend to debug)
<5> [83.035485] sd 0:0:0:0: [sda] Synchronizing SCSI cache
<5> [83.035836] sd 0:0:0:0: [sda] Stopping disk
<6> [83.036710] e1000e: EEE TX LPI TIMER: 00000000
<7> [83.039552] [drm:edp_panel_vdd_on [i915]] Turning eDP port A VDD on
<7> [83.039748] [drm:edp_panel_vdd_on [i915]] PP_STATUS: 0x80000008 PP_CONTROL...
...
 IGT_4687 / fi-ilk-m540
<6> [78.618447] Console: switching to colour dummy device 80x25
<6> [78.618530] [IGT] gem_exec_suspend: executing
<5> [78.623856] Setting dangerous option reset - tainting kernel
<6> [78.631150] [IGT] gem_exec_suspend: starting subtest basic-S3
<7> [79.140536] [drm:i915_gem_do_execbuffer [i915]] EINVAL at i915_gem_do_exec...
<7> [79.140612] [drm:i915_gem_do_execbuffer [i915]] EINVAL at i915_gem_do_exec...
<6> [79.487669] PM: suspend entry (deep)
<6> [79.487705] PM: Syncing filesystems ... done.
<6> [79.496300] Freezing user space processes ... (elapsed 0.003 seconds) done.
<6> [79.499449] OOM killer disabled.
<6> [79.499453] Freezing remaining freezable tasks ... (elapsed 0.001 seconds)...
<6> [79.501948] Suspending console(s) (use no_console_suspend to debug)
<6> [79.515929] e1000e: EEE TX LPI TIMER: 00000000
<5> [79.518916] sd 0:0:0:0: [sda] Synchronizing SCSI cache
<5> [79.519636] sd 0:0:0:0: [sda] Stopping disk
<7> [79.519971] [drm:edp_panel_vdd_on [i915]] Turning eDP port A VDD on
<7> [79.520141] [drm:edp_panel_vdd_on [i915]] PP_STATUS: 0x80000008 PP_CONTROL...
...
 IGT_4686 / fi-ilk-m540
<6> [79.405973] Console: switching to colour dummy device 80x25
<6> [79.406053] [IGT] gem_exec_suspend: executing
<5> [79.412597] Setting dangerous option reset - tainting kernel
<6> [79.417593] [IGT] gem_exec_suspend: starting subtest basic-S3
<7> [79.894797] [drm:i915_gem_do_execbuffer [i915]] EINVAL at i915_gem_do_exec...
<7> [79.894883] [drm:i915_gem_do_execbuffer [i915]] EINVAL at i915_gem_do_exec...
<6> [80.244614] PM: suspend entry (deep)
<6> [80.244648] PM: Syncing filesystems ... done.
<6> [80.251717] Freezing user space processes ... (elapsed 0.002 seconds) done.
<6> [80.254188] OOM killer disabled.
<6> [80.254192] Freezing remaining freezable tasks ... (elapsed 0.001 seconds)...
<6> [80.256450] Suspending console(s) (use no_console_suspend to debug)
<6> [80.271215] e1000e: EEE TX LPI TIMER: 00000000
<5> [80.272628] sd 0:0:0:0: [sda] Synchronizing SCSI cache
<5> [80.273092] sd 0:0:0:0: [sda] Stopping disk
<7> [80.273833] [drm:edp_panel_vdd_on [i915]] Turning eDP port A VDD on
<7> [80.273930] [drm:edp_panel_vdd_on [i915]] PP_STATUS: 0x80000008 PP_CONTROL...
...
 IGT_4685 / fi-ilk-m540
<6> [81.742789] Console: switching to colour dummy device 80x25
<6> [81.742873] [IGT] gem_exec_suspend: executing
<5> [81.749163] Setting dangerous option reset - tainting kernel
<6> [81.754709] [IGT] gem_exec_suspend: starting subtest basic-S3
<7> [82.243093] [drm:i915_gem_do_execbuffer [i915]] EINVAL at i915_gem_do_exec...
<7> [82.243195] [drm:i915_gem_do_execbuffer [i915]] EINVAL at i915_gem_do_exec...
<6> [82.611121] PM: suspend entry (deep)
<6> [82.611164] PM: Syncing filesystems ... done.
<6> [82.617697] Freezing user space processes ... (elapsed 0.002 seconds) done.
<6> [82.620498] OOM killer disabled.
<6> [82.620502] Freezing remaining freezable tasks ... (elapsed 0.001 seconds)...
<6> [82.622741] Suspending console(s) (use no_console_suspend to debug)
<6> [82.635506] e1000e: EEE TX LPI TIMER: 00000000
<5> [82.638477] sd 0:0:0:0: [sda] Synchronizing SCSI cache
<5> [82.639103] sd 0:0:0:0: [sda] Stopping disk
<7> [82.639453] [drm:edp_panel_vdd_on [i915]] Turning eDP port A VDD on
<7> [82.639602] [drm:edp_panel_vdd_on [i915]] PP_STATUS: 0x80000008 PP_CONTROL...
...
 IGT_4684 / fi-ilk-m540
<6> [83.137688] Console: switching to colour dummy device 80x25
<6> [83.137771] [IGT] gem_exec_suspend: executing
<5> [83.145210] Setting dangerous option reset - tainting kernel
<6> [83.153685] [IGT] gem_exec_suspend: starting subtest basic-S3
<7> [83.662750] [drm:i915_gem_do_execbuffer [i915]] EINVAL at i915_gem_do_exec...
<7> [83.662863] [drm:i915_gem_do_execbuffer [i915]] EINVAL at i915_gem_do_exec...
<6> [83.991710] PM: suspend entry (deep)
<6> [83.991756] PM: Syncing filesystems ... done.
<6> [84.000286] Freezing user space processes ... (elapsed 0.003 seconds) done.
<6> [84.003568] OOM killer disabled.
<6> [84.003573] Freezing remaining freezable tasks ... (elapsed 0.001 seconds)...
<6> [84.005638] Suspending console(s) (use no_console_suspend to debug)
<6> [84.018356] e1000e: EEE TX LPI TIMER: 00000000
<5> [84.018811] sd 0:0:0:0: [sda] Synchronizing SCSI cache
<5> [84.019274] sd 0:0:0:0: [sda] Stopping disk
<7> [84.021562] [drm:edp_panel_vdd_on [i915]] Turning eDP port A VDD on
<7> [84.021718] [drm:edp_panel_vdd_on [i915]] PP_STATUS: 0x80000008 PP_CONTROL...
...
 
 
 
 
 
 
 
 
 
 
 
 
 
 
 
 IGT_4688 / fi-blb-e6850
igt@gem_exec_suspend@basic-s3
<6> [68.414514] Console: switching to colour dummy device 80x25
<6> [68.414597] [IGT] gem_exec_suspend: executing
<5> [68.418828] Setting dangerous option reset - tainting kernel
<6> [68.424321] [IGT] gem_exec_suspend: starting subtest basic-S3
<7> [68.635348] [drm:i915_gem_do_execbuffer [i915]] EINVAL at i915_gem_do_exec...
<7> [68.635396] [drm:i915_gem_do_execbuffer [i915]] EINVAL at i915_gem_do_exec...
<7> [68.635442] [drm:i915_gem_do_execbuffer [i915]] EINVAL at i915_gem_do_exec...
<6> [68.940613] PM: suspend entry (deep)
<6> [68.940637] PM: Syncing filesystems ... done.
 
 
 
 
 
igt@kms_chamelium@common-hpd-after-suspend
 
 
 
 
 
 
 
 
 
 
 
 IGT_4688 / fi-kbl-7500u
<6> [183.308127] Console: switching to colour dummy device 80x25
<6> [183.308226] [IGT] kms_chamelium: executing
<7> [183.352320] [drm:drm_helper_probe_single_connector_modes] [CONNECTOR:90:H...
<7> [183.352457] [drm:intel_hdmi_detect [i915]] [CONNECTOR:90:HDMI-A-1]
<7> [183.352977] [drm:do_gmbus_xfer [i915]] GMBUS [i915 gmbus dpb] NAK for add...
<7> [183.353132] [drm:do_gmbus_xfer [i915]] GMBUS [i915 gmbus dpb] NAK on firs...
<7> [183.353498] [drm:do_gmbus_xfer [i915]] GMBUS [i915 gmbus dpb] NAK for add...
<7> [183.353539] [drm:drm_do_probe_ddc_edid] drm: skipping non-existent adapte...
<7> [183.353688] [drm:intel_hdmi_set_edid [i915]] HDMI GMBUS EDID read failed,...
<7> [183.353919] [drm:intel_gmbus_force_bit [i915]] enabling bit-banging on i9...
<7> [183.356877] [drm:drm_do_probe_ddc_edid] drm: skipping non-existent adapte...
<7> [183.356999] [drm:intel_gmbus_force_bit [i915]] disabling bit-banging on i...
<7> [183.357380] [drm:do_gmbus_xfer [i915]] GMBUS [i915 gmbus dpb] NAK for add...
<7> [183.357493] [drm:do_gmbus_xfer [i915]] GMBUS [i915 gmbus dpb] NAK on firs...
<7> [183.357889] [drm:do_gmbus_xfer [i915]] GMBUS [i915 gmbus dpb] NAK for add...
<7> [183.357930] [drm:drm_dp_dual_mode_detect] DP dual mode HDMI ID:  (err -6)
<7> [183.357950] [drm:drm_helper_probe_single_connector_modes] [CONNECTOR:90:H...
...
 IGT_4687 / fi-kbl-7500u
<6> [182.750532] Console: switching to colour dummy device 80x25
<6> [182.750604] [IGT] kms_chamelium: executing
<7> [182.780352] [drm:drm_helper_probe_single_connector_modes] [CONNECTOR:90:H...
<7> [182.780393] [drm:intel_hdmi_detect [i915]] [CONNECTOR:90:HDMI-A-1]
<7> [182.780634] [drm:do_gmbus_xfer [i915]] GMBUS [i915 gmbus dpb] NAK for add...
<7> [182.780665] [drm:do_gmbus_xfer [i915]] GMBUS [i915 gmbus dpb] NAK on firs...
<7> [182.780877] [drm:do_gmbus_xfer [i915]] GMBUS [i915 gmbus dpb] NAK for add...
<7> [182.780897] [drm:drm_do_probe_ddc_edid] drm: skipping non-existent adapte...
<7> [182.780925] [drm:intel_hdmi_set_edid [i915]] HDMI GMBUS EDID read failed,...
<7> [182.780955] [drm:intel_gmbus_force_bit [i915]] enabling bit-banging on i9...
<7> [182.783625] [drm:drm_do_probe_ddc_edid] drm: skipping non-existent adapte...
<7> [182.783659] [drm:intel_gmbus_force_bit [i915]] disabling bit-banging on i...
<7> [182.783892] [drm:do_gmbus_xfer [i915]] GMBUS [i915 gmbus dpb] NAK for add...
<7> [182.783922] [drm:do_gmbus_xfer [i915]] GMBUS [i915 gmbus dpb] NAK on firs...
<7> [182.784192] [drm:do_gmbus_xfer [i915]] GMBUS [i915 gmbus dpb] NAK for add...
<7> [182.784215] [drm:drm_dp_dual_mode_detect] DP dual mode HDMI ID:  (err -6)
<7> [182.784219] [drm:drm_helper_probe_single_connector_modes] [CONNECTOR:90:H...
...
 IGT_4686 / fi-kbl-7500u
<6> [177.718647] Console: switching to colour dummy device 80x25
<6> [177.718749] [IGT] kms_chamelium: executing
<7> [177.749096] [drm:drm_helper_probe_single_connector_modes] [CONNECTOR:90:H...
<7> [177.749145] [drm:intel_hdmi_detect [i915]] [CONNECTOR:90:HDMI-A-1]
<7> [177.749431] [drm:do_gmbus_xfer [i915]] GMBUS [i915 gmbus dpb] NAK for add...
<7> [177.749520] [drm:do_gmbus_xfer [i915]] GMBUS [i915 gmbus dpb] NAK on firs...
<7> [177.749782] [drm:do_gmbus_xfer [i915]] GMBUS [i915 gmbus dpb] NAK for add...
<7> [177.749802] [drm:drm_do_probe_ddc_edid] drm: skipping non-existent adapte...
<7> [177.749840] [drm:intel_hdmi_set_edid [i915]] HDMI GMBUS EDID read failed,...
<7> [177.749878] [drm:intel_gmbus_force_bit [i915]] enabling bit-banging on i9...
<7> [177.752568] [drm:drm_do_probe_ddc_edid] drm: skipping non-existent adapte...
<7> [177.752608] [drm:intel_gmbus_force_bit [i915]] disabling bit-banging on i...
<7> [177.752852] [drm:do_gmbus_xfer [i915]] GMBUS [i915 gmbus dpb] NAK for add...
<7> [177.752889] [drm:do_gmbus_xfer [i915]] GMBUS [i915 gmbus dpb] NAK on firs...
<7> [177.753151] [drm:do_gmbus_xfer [i915]] GMBUS [i915 gmbus dpb] NAK for add...
<7> [177.753173] [drm:drm_dp_dual_mode_detect] DP dual mode HDMI ID:  (err -6)
<7> [177.753180] [drm:drm_helper_probe_single_connector_modes] [CONNECTOR:90:H...
...
 IGT_4685 / fi-kbl-7500u
<6> [182.846392] Console: switching to colour dummy device 80x25
<6> [182.846480] [IGT] kms_chamelium: executing
<7> [182.875157] [drm:drm_helper_probe_single_connector_modes] [CONNECTOR:90:H...
<7> [182.875201] [drm:intel_hdmi_detect [i915]] [CONNECTOR:90:HDMI-A-1]
<7> [182.875449] [drm:do_gmbus_xfer [i915]] GMBUS [i915 gmbus dpb] NAK for add...
<7> [182.875485] [drm:do_gmbus_xfer [i915]] GMBUS [i915 gmbus dpb] NAK on firs...
<7> [182.875704] [drm:do_gmbus_xfer [i915]] GMBUS [i915 gmbus dpb] NAK for add...
<7> [182.875723] [drm:drm_do_probe_ddc_edid] drm: skipping non-existent adapte...
<7> [182.875757] [drm:intel_hdmi_set_edid [i915]] HDMI GMBUS EDID read failed,...
<7> [182.875790] [drm:intel_gmbus_force_bit [i915]] enabling bit-banging on i9...
<7> [182.878476] [drm:drm_do_probe_ddc_edid] drm: skipping non-existent adapte...
<7> [182.878513] [drm:intel_gmbus_force_bit [i915]] disabling bit-banging on i...
<7> [182.878752] [drm:do_gmbus_xfer [i915]] GMBUS [i915 gmbus dpb] NAK for add...
<7> [182.878786] [drm:do_gmbus_xfer [i915]] GMBUS [i915 gmbus dpb] NAK on firs...
<7> [182.879049] [drm:do_gmbus_xfer [i915]] GMBUS [i915 gmbus dpb] NAK for add...
<7> [182.879069] [drm:drm_dp_dual_mode_detect] DP dual mode HDMI ID:  (err -6)
<7> [182.879073] [drm:drm_helper_probe_single_connector_modes] [CONNECTOR:90:H...
...
 IGT_4684 / fi-kbl-7500u
<7> [181.765900] [drm:drm_dp_i2c_xfer] Partial I2C reply: requested 16 bytes g...
<7> [181.791157] [drm:drm_detect_monitor_audio] Monitor has basic audio support
<7> [181.791479] [drm:drm_add_display_info] non_desktop set to 0
<7> [181.791496] [drm:drm_add_edid_modes] ELD monitor AthenaDP
<7> [181.791500] [drm:drm_add_edid_modes] ELD size 32, SAD count 1
<7> [181.791503] [drm:drm_add_display_info] non_desktop set to 0
<7> [181.792146] [drm:drm_mode_debug_printmodeline] Modeline 116:"1600x1200" 0...
<7> [181.792151] [drm:drm_mode_prune_invalid] Not using 1600x1200 mode: VIRTUA...
<7> [181.792171] [drm:drm_helper_probe_single_connector_modes] [CONNECTOR:83:D...
<7> [181.792178] [drm:drm_mode_debug_printmodeline] Modeline 104:"1920x1080" 6...
<7> [181.792182] [drm:drm_mode_debug_printmodeline] Modeline 132:"1920x1080" 6...
<7> [181.792186] [drm:drm_mode_debug_printmodeline] Modeline 137:"1920x1080" 6...
<7> [181.792190] [drm:drm_mode_debug_printmodeline] Modeline 106:"1920x1080" 5...
<7> [181.792193] [drm:drm_mode_debug_printmodeline] Modeline 133:"1920x1080" 5...
<7> [181.792197] [drm:drm_mode_debug_printmodeline] Modeline 113:"1680x1050" 6...
<7> [181.792201] [drm:drm_mode_debug_printmodeline] Modeline 124:"1280x1024" 7...
<7> [181.792204] [drm:drm_mode_debug_printmodeline] Modeline 109:"1280x1024" 6...
...
 
 
 
 
 
 
 
 
 
 
 
 
 
 
 
 
 
 
 
 
 
 
 
igt@kms_flip@basic-flip-vs-dpms
 
 
 
 
 
 
 
 
 
 
 
 
 
 
 
 
 
 
 
 
 
 
 
 
 
 
 
 
 
 
 
 
 
 
 
 
 
 
 
 
 
 
 
 
 
 
 
 
 
 
 
 
 
 
 
 
 
 
 
 
 
 
 
 
 
 
 
 
 
 
 
 
 
 
 
 
 
 
 
 
 
 
 
 
 
 
 
 
 
 
 
 
 
 
 
 
 
 
 
 
 IGT_4688 / fi-skl-6700hq
<6> [191.435074] Console: switching to colour dummy device 80x25
<6> [191.435143] [IGT] kms_flip: executing
<7> [191.438763] [drm:drm_helper_probe_single_connector_modes] [CONNECTOR:83:e...
<7> [191.438813] [drm:intel_dp_detect [i915]] [CONNECTOR:83:eDP-1]
<7> [191.438841] [drm:intel_power_well_enable [i915]] enabling DC off
<7> [191.438868] [drm:gen9_set_dc_state [i915]] Setting DC state from 02 to 00
<7> [191.438921] [drm:intel_dp_print_rates [i915]] source rates: 162000, 21600...
<7> [191.438964] [drm:intel_dp_print_rates [i915]] sink rates: 162000, 270000
<7> [191.439042] [drm:intel_dp_print_rates [i915]] common rates: 162000, 270000
<7> [191.439122] [drm:edp_panel_vdd_on [i915]] Turning eDP port A VDD on
<7> [191.439234] [drm:edp_panel_vdd_on [i915]] PP_STATUS: 0x80000008 PP_CONTRO...
<7> [191.439725] [drm:drm_dp_read_desc] DP sink: OUI 00-22-b9 dev-ID sivarT HW...
<7> [191.440190] [drm:intel_dp_detect [i915]] MST support? port A: no, sink: n...
<7> [191.440591] [drm:drm_add_display_info] non_desktop set to 0
<7> [191.440610] [drm:drm_add_edid_modes] ELD: no CEA Extension found
<7> [191.440613] [drm:drm_add_display_info] non_desktop set to 0
<7> [191.440651] [drm:drm_helper_probe_single_connector_modes] [CONNECTOR:83:e...
...
 IGT_4687 / fi-skl-6700hq
<6> [187.620703] Console: switching to colour dummy device 80x25
<6> [187.620770] [IGT] kms_flip: executing
<7> [187.624872] [drm:drm_helper_probe_single_connector_modes] [CONNECTOR:83:e...
<7> [187.624969] [drm:intel_dp_detect [i915]] [CONNECTOR:83:eDP-1]
<7> [187.625029] [drm:intel_power_well_enable [i915]] enabling DC off
<7> [187.625068] [drm:gen9_set_dc_state [i915]] Setting DC state from 02 to 00
<7> [187.625121] [drm:intel_dp_print_rates [i915]] source rates: 162000, 21600...
<7> [187.625165] [drm:intel_dp_print_rates [i915]] sink rates: 162000, 270000
<7> [187.625200] [drm:intel_dp_print_rates [i915]] common rates: 162000, 270000
<7> [187.625260] [drm:edp_panel_vdd_on [i915]] Turning eDP port A VDD on
<7> [187.625361] [drm:edp_panel_vdd_on [i915]] PP_STATUS: 0x80000008 PP_CONTRO...
<7> [187.625837] [drm:drm_dp_read_desc] DP sink: OUI 00-22-b9 dev-ID sivarT HW...
<7> [187.626302] [drm:intel_dp_detect [i915]] MST support? port A: no, sink: n...
<7> [187.626717] [drm:drm_add_display_info] non_desktop set to 0
<7> [187.626736] [drm:drm_add_edid_modes] ELD: no CEA Extension found
<7> [187.626739] [drm:drm_add_display_info] non_desktop set to 0
<7> [187.626777] [drm:drm_helper_probe_single_connector_modes] [CONNECTOR:83:e...
...
 IGT_4686 / fi-skl-6700hq
<6> [186.860725] Console: switching to colour dummy device 80x25
<6> [186.860788] [IGT] kms_flip: executing
<7> [186.864915] [drm:drm_helper_probe_single_connector_modes] [CONNECTOR:83:e...
<7> [186.864988] [drm:intel_dp_detect [i915]] [CONNECTOR:83:eDP-1]
<7> [186.865020] [drm:intel_power_well_enable [i915]] enabling DC off
<7> [186.865076] [drm:gen9_set_dc_state [i915]] Setting DC state from 02 to 00
<7> [186.865127] [drm:intel_dp_print_rates [i915]] source rates: 162000, 21600...
<7> [186.865167] [drm:intel_dp_print_rates [i915]] sink rates: 162000, 270000
<7> [186.865204] [drm:intel_dp_print_rates [i915]] common rates: 162000, 270000
<7> [186.865264] [drm:edp_panel_vdd_on [i915]] Turning eDP port A VDD on
<7> [186.865360] [drm:edp_panel_vdd_on [i915]] PP_STATUS: 0x80000008 PP_CONTRO...
<7> [186.865840] [drm:drm_dp_read_desc] DP sink: OUI 00-22-b9 dev-ID sivarT HW...
<7> [186.866278] [drm:intel_dp_detect [i915]] MST support? port A: no, sink: n...
<7> [186.866696] [drm:drm_add_display_info] non_desktop set to 0
<7> [186.866714] [drm:drm_add_edid_modes] ELD: no CEA Extension found
<7> [186.866717] [drm:drm_add_display_info] non_desktop set to 0
<7> [186.866754] [drm:drm_helper_probe_single_connector_modes] [CONNECTOR:83:e...
...
 
 
 
 
 
 
 
 
 
 
 
 
 
 
 
 
 
 
 
 
 
 
 
 
 
 
 
 
 
 
 
 
 
 
 
 
 
 
 
 
 
 
 
 
 
 
 
 
 
 
 
 
 
 
 
 
 
 
 
 
 
 
 
 
 
 
 
 
 
 
 
 
 
 
 
 
 
 
 
 
 
 
 
 
 
 
 
 
 
 
 
 
 
 
 
 
 
 
 
 
 
 
 
 
 
 
 
 
 
 
 
 
 
 
 
 
 
 
 
 
 
 
 
 
 
 
 
 
 
 
 
 
 
 
 
 
 
 
 
 
 
 
igt@kms_frontbuffer_tracking@basic
 
 
 
 
 
 
 
 
 
 IGT_4684 / fi-icl-u2
Starting subtest: basic
(kms_frontbuffer_tracking:2810) igt_debugfs-CRITICAL: Test assertion failure f...
(kms_frontbuffer_tracking:2810) igt_debugfs-CRITICAL: Failed assertion: !misma...
Subtest basic failed.
**** DEBUG ****
(kms_frontbuffer_tracking:2810) igt_kms-DEBUG: display:     SetCursor pipe A, ...
(kms_frontbuffer_tracking:2810) igt_kms-DEBUG: display:     MoveCursor pipe A,...
(kms_frontbuffer_tracking:2810) igt_kms-DEBUG: display:     Fixing up initial ...
(kms_frontbuffer_tracking:2810) igt_kms-DEBUG: display:     SetCrtc pipe B, di...
(kms_frontbuffer_tracking:2810) igt_kms-DEBUG: display:     Fixing up initial ...
(kms_frontbuffer_tracking:2810) igt_kms-DEBUG: display:     SetPlane pipe B, p...
(kms_frontbuffer_tracking:2810) igt_kms-DEBUG: display:     SetProp plane B.1 ...
(kms_frontbuffer_tracking:2810) igt_kms-DEBUG: display:     SetProp plane B.1 ...
(kms_frontbuffer_tracking:2810) igt_kms-DEBUG: display:     SetProp plane B.1 ...
(kms_frontbuffer_tracking:2810) igt_kms-DEBUG: display:     Fixing up initial ...
(kms_frontbuffer_tracking:2810) igt_kms-DEBUG: display:     SetCursor pipe B, ...
(kms_frontbuffer_tracking:2810) igt_kms-DEBUG: display:     MoveCursor pipe B,...
...
 
 
 
 
 
 
 
 
 
 
 
 
 
 
 
 
 
 
 
 
 
 
 
 
 
 
 
 
 
 
 
 
 
 
 
 
 
 
 
 
 
 
 
 
 
 
 
 
 
 
 
 
 
 
 
 
 
 
 
 
 
 
 
 
 
 
 
 
 
 
 
 
 
 
 
 
 
 
 
 
 
 
 
 
 
 
 
 
 
 
 
 
 
 
 
 
 
 
 
 
 
 
 
 
 
 
 
 
 
 
 
 
 
 
 
 
 
 
 
 
 
 
 
 
 
 
 
 
 
 
 
 
 
 
 
 
 
 
 
 
 
 
 
 
 
 
 
 
 
 
 
 
 
 
 
 
 
 
 
 
 
 
 
 
 
 
 IGT_4687 / fi-byt-clapper
Starting subtest: basic
(kms_frontbuffer_tracking:2600) igt_debugfs-CRITICAL: Test assertion failure f...
(kms_frontbuffer_tracking:2600) igt_debugfs-CRITICAL: Failed assertion: !misma...
Subtest basic failed.
**** DEBUG ****
(kms_frontbuffer_tracking:2600) igt_kms-DEBUG: display:     Fixing up initial ...
(kms_frontbuffer_tracking:2600) igt_kms-DEBUG: display:     SetCrtc pipe B, di...
(kms_frontbuffer_tracking:2600) igt_kms-DEBUG: display:     Fixing up initial ...
(kms_frontbuffer_tracking:2600) igt_kms-DEBUG: display:     SetPlane pipe B, p...
(kms_frontbuffer_tracking:2600) igt_kms-DEBUG: display:     SetProp plane B.1 ...
(kms_frontbuffer_tracking:2600) igt_kms-DEBUG: display:     SetProp plane B.1 ...
(kms_frontbuffer_tracking:2600) igt_kms-DEBUG: display:     SetProp plane B.1 ...
(kms_frontbuffer_tracking:2600) igt_kms-DEBUG: display:     Fixing up initial ...
(kms_frontbuffer_tracking:2600) igt_kms-DEBUG: display:     SetPlane pipe B, p...
(kms_frontbuffer_tracking:2600) igt_kms-DEBUG: display:     SetProp plane B.2 ...
(kms_frontbuffer_tracking:2600) igt_kms-DEBUG: display:     SetProp plane B.2 ...
(kms_frontbuffer_tracking:2600) igt_kms-DEBUG: display:     SetProp plane B.2 ...
...
 
 
 
 
 
 
 
 
 
 
 
 
 
 IGT_4688 / fi-byt-squawks
Starting subtest: basic
(kms_frontbuffer_tracking:2559) igt_debugfs-CRITICAL: Test assertion failure f...
(kms_frontbuffer_tracking:2559) igt_debugfs-CRITICAL: Failed assertion: !misma...
Subtest basic failed.
**** DEBUG ****
(kms_frontbuffer_tracking:2559) igt_kms-DEBUG: display:     SetPlane pipe A, p...
(kms_frontbuffer_tracking:2559) igt_kms-DEBUG: display:     SetProp plane A.2 ...
(kms_frontbuffer_tracking:2559) igt_kms-DEBUG: display:     SetProp plane A.2 ...
(kms_frontbuffer_tracking:2559) igt_kms-DEBUG: display:     SetProp plane A.2 ...
(kms_frontbuffer_tracking:2559) igt_kms-DEBUG: display:     Fixing up initial ...
(kms_frontbuffer_tracking:2559) igt_kms-DEBUG: display:     SetCursor pipe A, ...
(kms_frontbuffer_tracking:2559) igt_kms-DEBUG: display:     MoveCursor pipe A,...
(kms_frontbuffer_tracking:2559) igt_kms-DEBUG: display:     Fixing up initial ...
(kms_frontbuffer_tracking:2559) igt_kms-DEBUG: display:     SetCrtc pipe B, di...
(kms_frontbuffer_tracking:2559) igt_kms-DEBUG: display:     Fixing up initial ...
(kms_frontbuffer_tracking:2559) igt_kms-DEBUG: display:     SetPlane pipe B, p...
(kms_frontbuffer_tracking:2559) igt_kms-DEBUG: display:     SetProp plane B.1 ...
...
 IGT_4687 / fi-byt-squawks
Starting subtest: basic
(kms_frontbuffer_tracking:2634) igt_debugfs-CRITICAL: Test assertion failure f...
(kms_frontbuffer_tracking:2634) igt_debugfs-CRITICAL: Failed assertion: !misma...
Subtest basic failed.
**** DEBUG ****
(kms_frontbuffer_tracking:2634) igt_kms-DEBUG: display:     SetPlane pipe A, p...
(kms_frontbuffer_tracking:2634) igt_kms-DEBUG: display:     SetProp plane A.2 ...
(kms_frontbuffer_tracking:2634) igt_kms-DEBUG: display:     SetProp plane A.2 ...
(kms_frontbuffer_tracking:2634) igt_kms-DEBUG: display:     SetProp plane A.2 ...
(kms_frontbuffer_tracking:2634) igt_kms-DEBUG: display:     Fixing up initial ...
(kms_frontbuffer_tracking:2634) igt_kms-DEBUG: display:     SetCursor pipe A, ...
(kms_frontbuffer_tracking:2634) igt_kms-DEBUG: display:     MoveCursor pipe A,...
(kms_frontbuffer_tracking:2634) igt_kms-DEBUG: display:     Fixing up initial ...
(kms_frontbuffer_tracking:2634) igt_kms-DEBUG: display:     SetCrtc pipe B, di...
(kms_frontbuffer_tracking:2634) igt_kms-DEBUG: display:     Fixing up initial ...
(kms_frontbuffer_tracking:2634) igt_kms-DEBUG: display:     SetPlane pipe B, p...
(kms_frontbuffer_tracking:2634) igt_kms-DEBUG: display:     SetProp plane B.1 ...
...
 IGT_4686 / fi-byt-squawks
Starting subtest: basic
(kms_frontbuffer_tracking:2588) igt_debugfs-CRITICAL: Test assertion failure f...
(kms_frontbuffer_tracking:2588) igt_debugfs-CRITICAL: Failed assertion: !misma...
Subtest basic failed.
**** DEBUG ****
(kms_frontbuffer_tracking:2588) igt_kms-DEBUG: display:     SetPlane pipe A, p...
(kms_frontbuffer_tracking:2588) igt_kms-DEBUG: display:     SetProp plane A.2 ...
(kms_frontbuffer_tracking:2588) igt_kms-DEBUG: display:     SetProp plane A.2 ...
(kms_frontbuffer_tracking:2588) igt_kms-DEBUG: display:     SetProp plane A.2 ...
(kms_frontbuffer_tracking:2588) igt_kms-DEBUG: display:     Fixing up initial ...
(kms_frontbuffer_tracking:2588) igt_kms-DEBUG: display:     SetCursor pipe A, ...
(kms_frontbuffer_tracking:2588) igt_kms-DEBUG: display:     MoveCursor pipe A,...
(kms_frontbuffer_tracking:2588) igt_kms-DEBUG: display:     Fixing up initial ...
(kms_frontbuffer_tracking:2588) igt_kms-DEBUG: display:     SetCrtc pipe B, di...
(kms_frontbuffer_tracking:2588) igt_kms-DEBUG: display:     Fixing up initial ...
(kms_frontbuffer_tracking:2588) igt_kms-DEBUG: display:     SetPlane pipe B, p...
(kms_frontbuffer_tracking:2588) igt_kms-DEBUG: display:     SetProp plane B.1 ...
...
 IGT_4685 / fi-byt-squawks
Starting subtest: basic
(kms_frontbuffer_tracking:2640) igt_debugfs-CRITICAL: Test assertion failure f...
(kms_frontbuffer_tracking:2640) igt_debugfs-CRITICAL: Failed assertion: !misma...
Subtest basic failed.
**** DEBUG ****
    SetPlane pipe A, plane 2, disabling
(kms_frontbuffer_tracking:2640) igt_kms-DEBUG: display:     SetProp plane A.2 ...
(kms_frontbuffer_tracking:2640) igt_kms-DEBUG: display:     SetProp plane A.2 ...
(kms_frontbuffer_tracking:2640) igt_kms-DEBUG: display:     SetProp plane A.2 ...
(kms_frontbuffer_tracking:2640) igt_kms-DEBUG: display:     Fixing up initial ...
(kms_frontbuffer_tracking:2640) igt_kms-DEBUG: display:     SetCursor pipe A, ...
(kms_frontbuffer_tracking:2640) igt_kms-DEBUG: display:     MoveCursor pipe A,...
(kms_frontbuffer_tracking:2640) igt_kms-DEBUG: display:     Fixing up initial ...
(kms_frontbuffer_tracking:2640) igt_kms-DEBUG: display:     SetCrtc pipe B, di...
(kms_frontbuffer_tracking:2640) igt_kms-DEBUG: display:     Fixing up initial ...
(kms_frontbuffer_tracking:2640) igt_kms-DEBUG: display:     SetPlane pipe B, p...
(kms_frontbuffer_tracking:2640) igt_kms-DEBUG: display:     SetProp plane B.1 ...
...
 IGT_4684 / fi-byt-squawks
Starting subtest: basic
(kms_frontbuffer_tracking:2626) igt_debugfs-CRITICAL: Test assertion failure f...
(kms_frontbuffer_tracking:2626) igt_debugfs-CRITICAL: Failed assertion: !misma...
Subtest basic failed.
**** DEBUG ****
(kms_frontbuffer_tracking:2626) igt_kms-DEBUG: display:     SetPlane pipe A, p...
(kms_frontbuffer_tracking:2626) igt_kms-DEBUG: display:     SetProp plane A.2 ...
(kms_frontbuffer_tracking:2626) igt_kms-DEBUG: display:     SetProp plane A.2 ...
(kms_frontbuffer_tracking:2626) igt_kms-DEBUG: display:     SetProp plane A.2 ...
(kms_frontbuffer_tracking:2626) igt_kms-DEBUG: display:     Fixing up initial ...
(kms_frontbuffer_tracking:2626) igt_kms-DEBUG: display:     SetCursor pipe A, ...
(kms_frontbuffer_tracking:2626) igt_kms-DEBUG: display:     MoveCursor pipe A,...
(kms_frontbuffer_tracking:2626) igt_kms-DEBUG: display:     Fixing up initial ...
(kms_frontbuffer_tracking:2626) igt_kms-DEBUG: display:     SetCrtc pipe B, di...
(kms_frontbuffer_tracking:2626) igt_kms-DEBUG: display:     Fixing up initial ...
(kms_frontbuffer_tracking:2626) igt_kms-DEBUG: display:     SetPlane pipe B, p...
(kms_frontbuffer_tracking:2626) igt_kms-DEBUG: display:     SetProp plane B.1 ...
...
 
 
 
 
 
 
 
 
 
 
 
 
 
 
 
 
 
 
 
 
 
 
 
 
 
 
igt@kms_pipe_crc_basic@hang-read-crc-pipe-a
 
 
 
 
 
 
 
 
 
 
 
 
 
 
 
 
 
 
 
 
 
 
 
 
 
 
 
 
 
 
 
 
 
 
 
 
 
 
 
 
 
 
 
 
 
 
 
 
 
 
 
 
 
 
 
 
 
 
 
 
 
 
 
 
 
 
 
 
 
 
 
 
 
 
 
 
 
 
 
 
 
 
 
 
 
 
 
 
 
 
 
 
 
 
 
 
 
 
 
 
 
 
 
 
 
 
 IGT_4687 / fi-skl-6700k2
Starting subtest: hang-read-crc-pipe-A
(kms_pipe_crc_basic:3236) igt_debugfs-CRITICAL: Test assertion failure functio...
(kms_pipe_crc_basic:3236) igt_debugfs-CRITICAL: Failed assertion: !mismatch
(kms_pipe_crc_basic:3236) igt_debugfs-CRITICAL: Last errno: 9, Bad file descri...
Subtest hang-read-crc-pipe-A failed.
**** DEBUG ****
(kms_pipe_crc_basic:3236) DEBUG: CRC for this fb: bed119d0 00000000 00000000 0...
(kms_pipe_crc_basic:3236) igt_kms-DEBUG: display: A.0: plane_set_fb(0)
(kms_pipe_crc_basic:3236) igt_kms-DEBUG: display: A.0: plane_set_size (0x0)
(kms_pipe_crc_basic:3236) igt_kms-DEBUG: display: A.0: fb_set_position(0,0)
(kms_pipe_crc_basic:3236) igt_kms-DEBUG: display: A.0: fb_set_size(0x0)
(kms_pipe_crc_basic:3236) igt_kms-DEBUG: display: DP-2: set_pipe(None)
(kms_pipe_crc_basic:3236) igt_kms-DEBUG: display: DP-2: Selecting pipe None
(kms_pipe_crc_basic:3236) igt_kms-DEBUG: display: DP-2: set_pipe(A)
(kms_pipe_crc_basic:3236) igt_kms-DEBUG: display: DP-2: Selecting pipe A
(kms_pipe_crc_basic:3236) DEBUG: Clearing the fb with color (0.00,1.00,1.00)
(kms_pipe_crc_basic:3236) igt_fb-DEBUG: igt_create_fb_with_bo_size(width=1024,...
...
 
 
 
 
 
 
 
 
 
 
 
 
 
 
 
 
 
 
 
 
 
 
 
 
 
 
 
 
 
 
 
 
 
 
 
 
 
 
 
 
 
 
 
 
 
 
 
 
 
 
 
 
 
 
 
 
 
 
 
 
 
 
 
 
 
 
 
 
 
 
 
 
 
 
 
 
 
 
 IGT_4688 / fi-byt-squawks
Starting subtest: hang-read-crc-pipe-A
(kms_pipe_crc_basic:2563) igt_debugfs-CRITICAL: Test assertion failure functio...
(kms_pipe_crc_basic:2563) igt_debugfs-CRITICAL: Failed assertion: !mismatch
(kms_pipe_crc_basic:2563) igt_debugfs-CRITICAL: Last errno: 9, Bad file descri...
Subtest hang-read-crc-pipe-A failed.
**** DEBUG ****
(kms_pipe_crc_basic:2563) drmtest-DEBUG: Test requirement passed: is_i915_devi...
(kms_pipe_crc_basic:2563) igt_debugfs-DEBUG: Opening debugfs directory '/sys/k...
(kms_pipe_crc_basic:2563) ioctl_wrappers-DEBUG: Test requirement passed: dir >...
(kms_pipe_crc_basic:2563) ioctl_wrappers-DEBUG: Test requirement passed: err =...
(kms_pipe_crc_basic:2563) i915/gem_context-DEBUG: Test requirement passed: has...
(kms_pipe_crc_basic:2563) igt_gt-DEBUG: Test requirement passed: has_gpu_reset...
(kms_pipe_crc_basic:2563) DEBUG: Test requirement passed: !(pipe >= data->disp...
(kms_pipe_crc_basic:2563) INFO: hang-read-crc-pipe-A: Testing connector eDP-1 ...
(kms_pipe_crc_basic:2563) igt_kms-DEBUG: display: eDP-1: set_pipe(A)
(kms_pipe_crc_basic:2563) igt_kms-DEBUG: display: eDP-1: Selecting pipe A
(kms_pipe_crc_basic:2563) DEBUG: Clearing the fb with color (0.00,1.00,0.00)
...
 IGT_4687 / fi-byt-squawks
Starting subtest: hang-read-crc-pipe-A
(kms_pipe_crc_basic:2636) igt_debugfs-CRITICAL: Test assertion failure functio...
(kms_pipe_crc_basic:2636) igt_debugfs-CRITICAL: Failed assertion: !mismatch
(kms_pipe_crc_basic:2636) igt_debugfs-CRITICAL: Last errno: 9, Bad file descri...
Subtest hang-read-crc-pipe-A failed.
**** DEBUG ****
(kms_pipe_crc_basic:2636) drmtest-DEBUG: Test requirement passed: is_i915_devi...
(kms_pipe_crc_basic:2636) igt_debugfs-DEBUG: Opening debugfs directory '/sys/k...
(kms_pipe_crc_basic:2636) ioctl_wrappers-DEBUG: Test requirement passed: dir >...
(kms_pipe_crc_basic:2636) ioctl_wrappers-DEBUG: Test requirement passed: err =...
(kms_pipe_crc_basic:2636) i915/gem_context-DEBUG: Test requirement passed: has...
(kms_pipe_crc_basic:2636) igt_gt-DEBUG: Test requirement passed: has_gpu_reset...
(kms_pipe_crc_basic:2636) DEBUG: Test requirement passed: !(pipe >= data->disp...
(kms_pipe_crc_basic:2636) INFO: hang-read-crc-pipe-A: Testing connector eDP-1 ...
(kms_pipe_crc_basic:2636) igt_kms-DEBUG: display: eDP-1: set_pipe(A)
(kms_pipe_crc_basic:2636) igt_kms-DEBUG: display: eDP-1: Selecting pipe A
(kms_pipe_crc_basic:2636) DEBUG: Clearing the fb with color (0.00,1.00,0.00)
...
 IGT_4686 / fi-byt-squawks
Starting subtest: hang-read-crc-pipe-A
(kms_pipe_crc_basic:2590) igt_debugfs-CRITICAL: Test assertion failure functio...
(kms_pipe_crc_basic:2590) igt_debugfs-CRITICAL: Failed assertion: !mismatch
(kms_pipe_crc_basic:2590) igt_debugfs-CRITICAL: Last errno: 9, Bad file descri...
Subtest hang-read-crc-pipe-A failed.
**** DEBUG ****
(kms_pipe_crc_basic:2590) drmtest-DEBUG: Test requirement passed: is_i915_devi...
(kms_pipe_crc_basic:2590) igt_debugfs-DEBUG: Opening debugfs directory '/sys/k...
(kms_pipe_crc_basic:2590) ioctl_wrappers-DEBUG: Test requirement passed: dir >...
(kms_pipe_crc_basic:2590) ioctl_wrappers-DEBUG: Test requirement passed: err =...
(kms_pipe_crc_basic:2590) i915/gem_context-DEBUG: Test requirement passed: has...
(kms_pipe_crc_basic:2590) igt_gt-DEBUG: Test requirement passed: has_gpu_reset...
(kms_pipe_crc_basic:2590) DEBUG: Test requirement passed: !(pipe >= data->disp...
(kms_pipe_crc_basic:2590) INFO: hang-read-crc-pipe-A: Testing connector eDP-1 ...
(kms_pipe_crc_basic:2590) igt_kms-DEBUG: display: eDP-1: set_pipe(A)
(kms_pipe_crc_basic:2590) igt_kms-DEBUG: display: eDP-1: Selecting pipe A
(kms_pipe_crc_basic:2590) DEBUG: Clearing the fb with color (0.00,1.00,0.00)
...
 IGT_4685 / fi-byt-squawks
Starting subtest: hang-read-crc-pipe-A
(kms_pipe_crc_basic:2642) igt_debugfs-CRITICAL: Test assertion failure functio...
(kms_pipe_crc_basic:2642) igt_debugfs-CRITICAL: Failed assertion: !mismatch
(kms_pipe_crc_basic:2642) igt_debugfs-CRITICAL: Last errno: 9, Bad file descri...
Subtest hang-read-crc-pipe-A failed.
**** DEBUG ****
(kms_pipe_crc_basic:2642) drmtest-DEBUG: Test requirement passed: is_i915_devi...
(kms_pipe_crc_basic:2642) igt_debugfs-DEBUG: Opening debugfs directory '/sys/k...
(kms_pipe_crc_basic:2642) ioctl_wrappers-DEBUG: Test requirement passed: dir >...
(kms_pipe_crc_basic:2642) ioctl_wrappers-DEBUG: Test requirement passed: err =...
(kms_pipe_crc_basic:2642) i915/gem_context-DEBUG: Test requirement passed: has...
(kms_pipe_crc_basic:2642) igt_gt-DEBUG: Test requirement passed: has_gpu_reset...
(kms_pipe_crc_basic:2642) DEBUG: Test requirement passed: !(pipe >= data->disp...
(kms_pipe_crc_basic:2642) INFO: hang-read-crc-pipe-A: Testing connector eDP-1 ...
(kms_pipe_crc_basic:2642) igt_kms-DEBUG: display: eDP-1: set_pipe(A)
(kms_pipe_crc_basic:2642) igt_kms-DEBUG: display: eDP-1: Selecting pipe A
(kms_pipe_crc_basic:2642) DEBUG: Clearing the fb with color (0.00,1.00,0.00)
...
 IGT_4684 / fi-byt-squawks
Starting subtest: hang-read-crc-pipe-A
(kms_pipe_crc_basic:2628) igt_debugfs-CRITICAL: Test assertion failure functio...
(kms_pipe_crc_basic:2628) igt_debugfs-CRITICAL: Failed assertion: !mismatch
(kms_pipe_crc_basic:2628) igt_debugfs-CRITICAL: Last errno: 9, Bad file descri...
Subtest hang-read-crc-pipe-A failed.
**** DEBUG ****
(kms_pipe_crc_basic:2628) drmtest-DEBUG: Test requirement passed: is_i915_devi...
(kms_pipe_crc_basic:2628) igt_debugfs-DEBUG: Opening debugfs directory '/sys/k...
(kms_pipe_crc_basic:2628) ioctl_wrappers-DEBUG: Test requirement passed: dir >...
(kms_pipe_crc_basic:2628) ioctl_wrappers-DEBUG: Test requirement passed: err =...
(kms_pipe_crc_basic:2628) i915/gem_context-DEBUG: Test requirement passed: has...
(kms_pipe_crc_basic:2628) igt_gt-DEBUG: Test requirement passed: has_gpu_reset...
(kms_pipe_crc_basic:2628) DEBUG: Test requirement passed: !(pipe >= data->disp...
(kms_pipe_crc_basic:2628) INFO: hang-read-crc-pipe-A: Testing connector eDP-1 ...
(kms_pipe_crc_basic:2628) igt_kms-DEBUG: display: eDP-1: set_pipe(A)
(kms_pipe_crc_basic:2628) igt_kms-DEBUG: display: eDP-1: Selecting pipe A
(kms_pipe_crc_basic:2628) DEBUG: Clearing the fb with color (0.00,1.00,0.00)
...
 
 
 
 
 
 
 
 
 
 
 
 
 
 
 
 
 
 
 
 
 
 
 
 
 
 
 
 
 
 
 
 
 
 
 
 
 
 
 
 
 
 
 
 
 
 
 
 
 
 
igt@kms_pipe_crc_basic@hang-read-crc-pipe-b
 
 
 
 
 
 
 
 
 
 
 
 
 
 
 
 
 
 
 
 
 
 
 
 
 
 
 
 
 
 
 
 
 
 
 
 
 
 
 
 
 
 
 
 
 
 
 
 
 
 
 
 
 
 
 
 
 
 
 
 
 
 
 
 
 
 
 
 
 
 
 
 
 
 
 
 
 
 
 
 
 
 
 
 
 
 
 
 
 
 
 
 
 
 
 
 
 
 
 
 
 
 
 
 
 
 
 
 
 
 
 
 
 
 
 
 
 
 
 
 
 
 
 
 
 
 
 
 
 
 
 
 
 
 
 
 
 
 
 
 
 
 
 
 
 
 
 
 
 
 
 
 
 
 
 
 
 
 
 
 
 
 
 
 
 
 
 
 
 
 
 
 
 
 
 
 
 
 
 
 
 
 
 
 
 
 IGT_4688 / fi-byt-squawks
Starting subtest: hang-read-crc-pipe-B
(kms_pipe_crc_basic:2564) igt_debugfs-CRITICAL: Test assertion failure functio...
(kms_pipe_crc_basic:2564) igt_debugfs-CRITICAL: Failed assertion: !mismatch
(kms_pipe_crc_basic:2564) igt_debugfs-CRITICAL: Last errno: 9, Bad file descri...
Subtest hang-read-crc-pipe-B failed.
**** DEBUG ****
(kms_pipe_crc_basic:2564) drmtest-DEBUG: Test requirement passed: is_i915_devi...
(kms_pipe_crc_basic:2564) igt_debugfs-DEBUG: Opening debugfs directory '/sys/k...
(kms_pipe_crc_basic:2564) ioctl_wrappers-DEBUG: Test requirement passed: dir >...
(kms_pipe_crc_basic:2564) ioctl_wrappers-DEBUG: Test requirement passed: err =...
(kms_pipe_crc_basic:2564) i915/gem_context-DEBUG: Test requirement passed: has...
(kms_pipe_crc_basic:2564) igt_gt-DEBUG: Test requirement passed: has_gpu_reset...
(kms_pipe_crc_basic:2564) DEBUG: Test requirement passed: !(pipe >= data->disp...
(kms_pipe_crc_basic:2564) INFO: hang-read-crc-pipe-B: Testing connector eDP-1 ...
(kms_pipe_crc_basic:2564) igt_kms-DEBUG: display: eDP-1: set_pipe(B)
(kms_pipe_crc_basic:2564) igt_kms-DEBUG: display: eDP-1: Selecting pipe B
(kms_pipe_crc_basic:2564) DEBUG: Clearing the fb with color (0.00,1.00,0.00)
...
 IGT_4687 / fi-byt-squawks
Starting subtest: hang-read-crc-pipe-B
(kms_pipe_crc_basic:2637) igt_debugfs-CRITICAL: Test assertion failure functio...
(kms_pipe_crc_basic:2637) igt_debugfs-CRITICAL: Failed assertion: !mismatch
(kms_pipe_crc_basic:2637) igt_debugfs-CRITICAL: Last errno: 9, Bad file descri...
Subtest hang-read-crc-pipe-B failed.
**** DEBUG ****
(kms_pipe_crc_basic:2637) drmtest-DEBUG: Test requirement passed: is_i915_devi...
(kms_pipe_crc_basic:2637) igt_debugfs-DEBUG: Opening debugfs directory '/sys/k...
(kms_pipe_crc_basic:2637) ioctl_wrappers-DEBUG: Test requirement passed: dir >...
(kms_pipe_crc_basic:2637) ioctl_wrappers-DEBUG: Test requirement passed: err =...
(kms_pipe_crc_basic:2637) i915/gem_context-DEBUG: Test requirement passed: has...
(kms_pipe_crc_basic:2637) igt_gt-DEBUG: Test requirement passed: has_gpu_reset...
(kms_pipe_crc_basic:2637) DEBUG: Test requirement passed: !(pipe >= data->disp...
(kms_pipe_crc_basic:2637) INFO: hang-read-crc-pipe-B: Testing connector eDP-1 ...
(kms_pipe_crc_basic:2637) igt_kms-DEBUG: display: eDP-1: set_pipe(B)
(kms_pipe_crc_basic:2637) igt_kms-DEBUG: display: eDP-1: Selecting pipe B
(kms_pipe_crc_basic:2637) DEBUG: Clearing the fb with color (0.00,1.00,0.00)
...
 IGT_4686 / fi-byt-squawks
Starting subtest: hang-read-crc-pipe-B
(kms_pipe_crc_basic:2592) igt_debugfs-CRITICAL: Test assertion failure functio...
(kms_pipe_crc_basic:2592) igt_debugfs-CRITICAL: Failed assertion: !mismatch
(kms_pipe_crc_basic:2592) igt_debugfs-CRITICAL: Last errno: 9, Bad file descri...
Subtest hang-read-crc-pipe-B failed.
**** DEBUG ****
(kms_pipe_crc_basic:2592) drmtest-DEBUG: Test requirement passed: is_i915_devi...
(kms_pipe_crc_basic:2592) igt_debugfs-DEBUG: Opening debugfs directory '/sys/k...
(kms_pipe_crc_basic:2592) ioctl_wrappers-DEBUG: Test requirement passed: dir >...
(kms_pipe_crc_basic:2592) ioctl_wrappers-DEBUG: Test requirement passed: err =...
(kms_pipe_crc_basic:2592) i915/gem_context-DEBUG: Test requirement passed: has...
(kms_pipe_crc_basic:2592) igt_gt-DEBUG: Test requirement passed: has_gpu_reset...
(kms_pipe_crc_basic:2592) DEBUG: Test requirement passed: !(pipe >= data->disp...
(kms_pipe_crc_basic:2592) INFO: hang-read-crc-pipe-B: Testing connector eDP-1 ...
(kms_pipe_crc_basic:2592) igt_kms-DEBUG: display: eDP-1: set_pipe(B)
(kms_pipe_crc_basic:2592) igt_kms-DEBUG: display: eDP-1: Selecting pipe B
(kms_pipe_crc_basic:2592) DEBUG: Clearing the fb with color (0.00,1.00,0.00)
...
 IGT_4685 / fi-byt-squawks
Starting subtest: hang-read-crc-pipe-B
(kms_pipe_crc_basic:2643) igt_debugfs-CRITICAL: Test assertion failure functio...
(kms_pipe_crc_basic:2643) igt_debugfs-CRITICAL: Failed assertion: !mismatch
(kms_pipe_crc_basic:2643) igt_debugfs-CRITICAL: Last errno: 9, Bad file descri...
Subtest hang-read-crc-pipe-B failed.
**** DEBUG ****
(kms_pipe_crc_basic:2643) drmtest-DEBUG: Test requirement passed: is_i915_devi...
(kms_pipe_crc_basic:2643) igt_debugfs-DEBUG: Opening debugfs directory '/sys/k...
(kms_pipe_crc_basic:2643) ioctl_wrappers-DEBUG: Test requirement passed: dir >...
(kms_pipe_crc_basic:2643) ioctl_wrappers-DEBUG: Test requirement passed: err =...
(kms_pipe_crc_basic:2643) i915/gem_context-DEBUG: Test requirement passed: has...
(kms_pipe_crc_basic:2643) igt_gt-DEBUG: Test requirement passed: has_gpu_reset...
(kms_pipe_crc_basic:2643) DEBUG: Test requirement passed: !(pipe >= data->disp...
(kms_pipe_crc_basic:2643) INFO: hang-read-crc-pipe-B: Testing connector eDP-1 ...
(kms_pipe_crc_basic:2643) igt_kms-DEBUG: display: eDP-1: set_pipe(B)
(kms_pipe_crc_basic:2643) igt_kms-DEBUG: display: eDP-1: Selecting pipe B
(kms_pipe_crc_basic:2643) DEBUG: Clearing the fb with color (0.00,1.00,0.00)
...
 IGT_4684 / fi-byt-squawks
Starting subtest: hang-read-crc-pipe-B
(kms_pipe_crc_basic:2629) igt_debugfs-CRITICAL: Test assertion failure functio...
(kms_pipe_crc_basic:2629) igt_debugfs-CRITICAL: Failed assertion: !mismatch
(kms_pipe_crc_basic:2629) igt_debugfs-CRITICAL: Last errno: 9, Bad file descri...
Subtest hang-read-crc-pipe-B failed.
**** DEBUG ****
(kms_pipe_crc_basic:2629) drmtest-DEBUG: Test requirement passed: is_i915_devi...
(kms_pipe_crc_basic:2629) igt_debugfs-DEBUG: Opening debugfs directory '/sys/k...
(kms_pipe_crc_basic:2629) ioctl_wrappers-DEBUG: Test requirement passed: dir >...
(kms_pipe_crc_basic:2629) ioctl_wrappers-DEBUG: Test requirement passed: err =...
(kms_pipe_crc_basic:2629) i915/gem_context-DEBUG: Test requirement passed: has...
(kms_pipe_crc_basic:2629) igt_gt-DEBUG: Test requirement passed: has_gpu_reset...
(kms_pipe_crc_basic:2629) DEBUG: Test requirement passed: !(pipe >= data->disp...
(kms_pipe_crc_basic:2629) INFO: hang-read-crc-pipe-B: Testing connector eDP-1 ...
(kms_pipe_crc_basic:2629) igt_kms-DEBUG: display: eDP-1: set_pipe(B)
(kms_pipe_crc_basic:2629) igt_kms-DEBUG: display: eDP-1: Selecting pipe B
(kms_pipe_crc_basic:2629) DEBUG: Clearing the fb with color (0.00,1.00,0.00)
...
 
 
 
 
 
 
 
 
 
 
 
 
 
 
 
 
 
 
 
 
 
 
 
 
 
 
 
 
 
 
 
 
 
 
 
 
 
 
 
 
 
 
 
 
 
 
 
 
 
 
igt@kms_pipe_crc_basic@nonblocking-crc-pipe-a
 
 
 
 
 
 
 
 
 
 
 
 
 
 
 
 
 
 
 
 
 
 
 
 
 
 
 
 
 
 
 
 
 
 
 
 
 
 
 
 
 
 
 
 
 
 
 
 
 
 
 
 
 
 
 
 
 
 
 
 
 
 
 
 
 
 
 
 
 
 
 
 
 
 
 
 
 
 
 
 
 
 
 
 
 
 
 
 
 
 
 
 
 
 
 
 
 
 
 
 
 
 
 
 
 
 
 
 
 
 
 
 
 
 
 
 
 
 
 
 
 
 
 
 
 
 
 
 
 
 
 
 
 
 
 
 
 
 
 
 
 
 
 
 
 
 
 
 
 
 
 
 
 
 
 
 
 
 
 
 
 
 
 
 
 
 
 
 
 
 
 
 
 
 IGT_4685 / fi-byt-clapper
Starting subtest: nonblocking-crc-pipe-A
(kms_pipe_crc_basic:2618) igt_debugfs-CRITICAL: Test assertion failure functio...
(kms_pipe_crc_basic:2618) igt_debugfs-CRITICAL: Failed assertion: !mismatch
(kms_pipe_crc_basic:2618) igt_debugfs-CRITICAL: Last errno: 9, Bad file descri...
Subtest nonblocking-crc-pipe-A failed.
**** DEBUG ****
(kms_pipe_crc_basic:2618) DEBUG: Test requirement passed: !(pipe >= data->disp...
(kms_pipe_crc_basic:2618) INFO: nonblocking-crc-pipe-A: Testing connector eDP-...
(kms_pipe_crc_basic:2618) igt_kms-DEBUG: display: eDP-1: set_pipe(A)
(kms_pipe_crc_basic:2618) igt_kms-DEBUG: display: eDP-1: Selecting pipe A
(kms_pipe_crc_basic:2618) DEBUG: Clearing the fb with color (0.00,1.00,0.00)
(kms_pipe_crc_basic:2618) igt_fb-DEBUG: igt_create_fb_with_bo_size(width=1366,...
(kms_pipe_crc_basic:2618) igt_fb-DEBUG: igt_create_fb_with_bo_size(handle=1, p...
(kms_pipe_crc_basic:2618) ioctl_wrappers-DEBUG: Test requirement passed: igt_h...
(kms_pipe_crc_basic:2618) igt_fb-DEBUG: Test requirement passed: cairo_surface...
(kms_pipe_crc_basic:2618) igt_kms-DEBUG: Test requirement passed: plane_idx >=...
(kms_pipe_crc_basic:2618) igt_kms-DEBUG: display: A.0: plane_set_fb(81)
...
 
 
 
 
 
 
 
 
 
 
 
 IGT_4688 / fi-byt-squawks
Starting subtest: nonblocking-crc-pipe-A
(kms_pipe_crc_basic:2566) igt_debugfs-CRITICAL: Test assertion failure functio...
(kms_pipe_crc_basic:2566) igt_debugfs-CRITICAL: Failed assertion: !mismatch
(kms_pipe_crc_basic:2566) igt_debugfs-CRITICAL: Last errno: 9, Bad file descri...
Subtest nonblocking-crc-pipe-A failed.
**** DEBUG ****
(kms_pipe_crc_basic:2566) DEBUG: Test requirement passed: !(pipe >= data->disp...
(kms_pipe_crc_basic:2566) INFO: nonblocking-crc-pipe-A: Testing connector eDP-...
(kms_pipe_crc_basic:2566) igt_kms-DEBUG: display: eDP-1: set_pipe(A)
(kms_pipe_crc_basic:2566) igt_kms-DEBUG: display: eDP-1: Selecting pipe A
(kms_pipe_crc_basic:2566) DEBUG: Clearing the fb with color (0.00,1.00,0.00)
(kms_pipe_crc_basic:2566) igt_fb-DEBUG: igt_create_fb_with_bo_size(width=1366,...
(kms_pipe_crc_basic:2566) igt_fb-DEBUG: igt_create_fb_with_bo_size(handle=1, p...
(kms_pipe_crc_basic:2566) ioctl_wrappers-DEBUG: Test requirement passed: igt_h...
(kms_pipe_crc_basic:2566) igt_fb-DEBUG: Test requirement passed: cairo_surface...
(kms_pipe_crc_basic:2566) igt_kms-DEBUG: Test requirement passed: plane_idx >=...
(kms_pipe_crc_basic:2566) igt_kms-DEBUG: display: A.0: plane_set_fb(80)
...
 IGT_4687 / fi-byt-squawks
Starting subtest: nonblocking-crc-pipe-A
(kms_pipe_crc_basic:2639) igt_debugfs-CRITICAL: Test assertion failure functio...
(kms_pipe_crc_basic:2639) igt_debugfs-CRITICAL: Failed assertion: !mismatch
(kms_pipe_crc_basic:2639) igt_debugfs-CRITICAL: Last errno: 9, Bad file descri...
Subtest nonblocking-crc-pipe-A failed.
**** DEBUG ****
(kms_pipe_crc_basic:2639) DEBUG: Test requirement passed: !(pipe >= data->disp...
(kms_pipe_crc_basic:2639) INFO: nonblocking-crc-pipe-A: Testing connector eDP-...
(kms_pipe_crc_basic:2639) igt_kms-DEBUG: display: eDP-1: set_pipe(A)
(kms_pipe_crc_basic:2639) igt_kms-DEBUG: display: eDP-1: Selecting pipe A
(kms_pipe_crc_basic:2639) DEBUG: Clearing the fb with color (0.00,1.00,0.00)
(kms_pipe_crc_basic:2639) igt_fb-DEBUG: igt_create_fb_with_bo_size(width=1366,...
(kms_pipe_crc_basic:2639) igt_fb-DEBUG: igt_create_fb_with_bo_size(handle=1, p...
(kms_pipe_crc_basic:2639) ioctl_wrappers-DEBUG: Test requirement passed: igt_h...
(kms_pipe_crc_basic:2639) igt_fb-DEBUG: Test requirement passed: cairo_surface...
(kms_pipe_crc_basic:2639) igt_kms-DEBUG: Test requirement passed: plane_idx >=...
(kms_pipe_crc_basic:2639) igt_kms-DEBUG: display: A.0: plane_set_fb(80)
...
 IGT_4686 / fi-byt-squawks
Starting subtest: nonblocking-crc-pipe-A
(kms_pipe_crc_basic:2596) igt_debugfs-CRITICAL: Test assertion failure functio...
(kms_pipe_crc_basic:2596) igt_debugfs-CRITICAL: Failed assertion: !mismatch
(kms_pipe_crc_basic:2596) igt_debugfs-CRITICAL: Last errno: 9, Bad file descri...
Subtest nonblocking-crc-pipe-A failed.
**** DEBUG ****
(kms_pipe_crc_basic:2596) DEBUG: Test requirement passed: !(pipe >= data->disp...
(kms_pipe_crc_basic:2596) INFO: nonblocking-crc-pipe-A: Testing connector eDP-...
(kms_pipe_crc_basic:2596) igt_kms-DEBUG: display: eDP-1: set_pipe(A)
(kms_pipe_crc_basic:2596) igt_kms-DEBUG: display: eDP-1: Selecting pipe A
(kms_pipe_crc_basic:2596) DEBUG: Clearing the fb with color (0.00,1.00,0.00)
(kms_pipe_crc_basic:2596) igt_fb-DEBUG: igt_create_fb_with_bo_size(width=1366,...
(kms_pipe_crc_basic:2596) igt_fb-DEBUG: igt_create_fb_with_bo_size(handle=1, p...
(kms_pipe_crc_basic:2596) ioctl_wrappers-DEBUG: Test requirement passed: igt_h...
(kms_pipe_crc_basic:2596) igt_fb-DEBUG: Test requirement passed: cairo_surface...
(kms_pipe_crc_basic:2596) igt_kms-DEBUG: Test requirement passed: plane_idx >=...
(kms_pipe_crc_basic:2596) igt_kms-DEBUG: display: A.0: plane_set_fb(80)
...
 IGT_4685 / fi-byt-squawks
Starting subtest: nonblocking-crc-pipe-A
(kms_pipe_crc_basic:2708) igt_debugfs-CRITICAL: Test assertion failure functio...
(kms_pipe_crc_basic:2708) igt_debugfs-CRITICAL: Failed assertion: !mismatch
(kms_pipe_crc_basic:2708) igt_debugfs-CRITICAL: Last errno: 9, Bad file descri...
Subtest nonblocking-crc-pipe-A failed.
**** DEBUG ****
(kms_pipe_crc_basic:2708) DEBUG: Test requirement passed: !(pipe >= data->disp...
(kms_pipe_crc_basic:2708) INFO: nonblocking-crc-pipe-A: Testing connector eDP-...
(kms_pipe_crc_basic:2708) igt_kms-DEBUG: display: eDP-1: set_pipe(A)
(kms_pipe_crc_basic:2708) igt_kms-DEBUG: display: eDP-1: Selecting pipe A
(kms_pipe_crc_basic:2708) DEBUG: Clearing the fb with color (0.00,1.00,0.00)
(kms_pipe_crc_basic:2708) igt_fb-DEBUG: igt_create_fb_with_bo_size(width=1366,...
(kms_pipe_crc_basic:2708) igt_fb-DEBUG: igt_create_fb_with_bo_size(handle=1, p...
(kms_pipe_crc_basic:2708) ioctl_wrappers-DEBUG: Test requirement passed: igt_h...
(kms_pipe_crc_basic:2708) igt_fb-DEBUG: Test requirement passed: cairo_surface...
(kms_pipe_crc_basic:2708) igt_kms-DEBUG: Test requirement passed: plane_idx >=...
(kms_pipe_crc_basic:2708) igt_kms-DEBUG: display: A.0: plane_set_fb(80)
...
 IGT_4684 / fi-byt-squawks
Starting subtest: nonblocking-crc-pipe-A
(kms_pipe_crc_basic:2631) igt_debugfs-CRITICAL: Test assertion failure functio...
(kms_pipe_crc_basic:2631) igt_debugfs-CRITICAL: Failed assertion: !mismatch
(kms_pipe_crc_basic:2631) igt_debugfs-CRITICAL: Last errno: 9, Bad file descri...
Subtest nonblocking-crc-pipe-A failed.
**** DEBUG ****
(kms_pipe_crc_basic:2631) DEBUG: Test requirement passed: !(pipe >= data->disp...
(kms_pipe_crc_basic:2631) INFO: nonblocking-crc-pipe-A: Testing connector eDP-...
(kms_pipe_crc_basic:2631) igt_kms-DEBUG: display: eDP-1: set_pipe(A)
(kms_pipe_crc_basic:2631) igt_kms-DEBUG: display: eDP-1: Selecting pipe A
(kms_pipe_crc_basic:2631) DEBUG: Clearing the fb with color (0.00,1.00,0.00)
(kms_pipe_crc_basic:2631) igt_fb-DEBUG: igt_create_fb_with_bo_size(width=1366,...
(kms_pipe_crc_basic:2631) igt_fb-DEBUG: igt_create_fb_with_bo_size(handle=1, p...
(kms_pipe_crc_basic:2631) ioctl_wrappers-DEBUG: Test requirement passed: igt_h...
(kms_pipe_crc_basic:2631) igt_fb-DEBUG: Test requirement passed: cairo_surface...
(kms_pipe_crc_basic:2631) igt_kms-DEBUG: Test requirement passed: plane_idx >=...
(kms_pipe_crc_basic:2631) igt_kms-DEBUG: display: A.0: plane_set_fb(80)
...
 
 
 
 
 
 
 
 
 
 
 
 
 
 
 
 
 
 
 
 
 
 
 
 
 
 
 
 
 
 
 
 
 
 
 
 
 
 
 
 
 
 
 
 
 
 
 
 
 
 
igt@kms_pipe_crc_basic@nonblocking-crc-pipe-a-frame-sequence
 
 
 
 
 
 
 
 
 
 
 
 
 
 
 
 
 
 
 
 
 
 
 
 
 
 
 
 
 
 
 
 
 
 
 
 
 
 
 
 
 
 
 
 
 
 
 
 
 
 
 
 
 
 
 
 
 
 
 
 
 
 
 
 
 
 
 
 
 
 
 
 
 
 
 
 
 
 
 
 
 
 
 
 
 
 
 
 
 
 
 
 
 
 
 
 
 
 
 
 
 
 
 
 
 
 
 
 
 
 
 
 
 
 
 
 
 
 
 
 
 
 
 
 
 
 
 
 
 
 
 
 
 
 
 
 
 
 
 
 
 
 
 
 
 
 
 
 
 
 
 
 
 
 
 
 
 
 
 
 
 
 
 
 
 
 
 
 
 
 
 
 
 
 
 
 
 
 
 
 
 
 
 
 
 
 IGT_4688 / fi-byt-squawks
Starting subtest: nonblocking-crc-pipe-A-frame-sequence
(kms_pipe_crc_basic:2567) igt_debugfs-CRITICAL: Test assertion failure functio...
(kms_pipe_crc_basic:2567) igt_debugfs-CRITICAL: Failed assertion: !mismatch
(kms_pipe_crc_basic:2567) igt_debugfs-CRITICAL: Last errno: 9, Bad file descri...
Subtest nonblocking-crc-pipe-A-frame-sequence failed.
**** DEBUG ****
(kms_pipe_crc_basic:2567) DEBUG: Test requirement passed: !(pipe >= data->disp...
(kms_pipe_crc_basic:2567) INFO: nonblocking-crc-pipe-A-frame-sequence: Testing...
(kms_pipe_crc_basic:2567) igt_kms-DEBUG: display: eDP-1: set_pipe(A)
(kms_pipe_crc_basic:2567) igt_kms-DEBUG: display: eDP-1: Selecting pipe A
(kms_pipe_crc_basic:2567) DEBUG: Clearing the fb with color (0.00,1.00,0.00)
(kms_pipe_crc_basic:2567) igt_fb-DEBUG: igt_create_fb_with_bo_size(width=1366,...
(kms_pipe_crc_basic:2567) igt_fb-DEBUG: igt_create_fb_with_bo_size(handle=1, p...
(kms_pipe_crc_basic:2567) ioctl_wrappers-DEBUG: Test requirement passed: igt_h...
(kms_pipe_crc_basic:2567) igt_fb-DEBUG: Test requirement passed: cairo_surface...
(kms_pipe_crc_basic:2567) igt_kms-DEBUG: Test requirement passed: plane_idx >=...
(kms_pipe_crc_basic:2567) igt_kms-DEBUG: display: A.0: plane_set_fb(80)
...
 IGT_4687 / fi-byt-squawks
Starting subtest: nonblocking-crc-pipe-A-frame-sequence
(kms_pipe_crc_basic:2640) igt_debugfs-CRITICAL: Test assertion failure functio...
(kms_pipe_crc_basic:2640) igt_debugfs-CRITICAL: Failed assertion: !mismatch
(kms_pipe_crc_basic:2640) igt_debugfs-CRITICAL: Last errno: 9, Bad file descri...
Subtest nonblocking-crc-pipe-A-frame-sequence failed.
**** DEBUG ****
(kms_pipe_crc_basic:2640) DEBUG: Test requirement passed: !(pipe >= data->disp...
(kms_pipe_crc_basic:2640) INFO: nonblocking-crc-pipe-A-frame-sequence: Testing...
(kms_pipe_crc_basic:2640) igt_kms-DEBUG: display: eDP-1: set_pipe(A)
(kms_pipe_crc_basic:2640) igt_kms-DEBUG: display: eDP-1: Selecting pipe A
(kms_pipe_crc_basic:2640) DEBUG: Clearing the fb with color (0.00,1.00,0.00)
(kms_pipe_crc_basic:2640) igt_fb-DEBUG: igt_create_fb_with_bo_size(width=1366,...
(kms_pipe_crc_basic:2640) igt_fb-DEBUG: igt_create_fb_with_bo_size(handle=1, p...
(kms_pipe_crc_basic:2640) ioctl_wrappers-DEBUG: Test requirement passed: igt_h...
(kms_pipe_crc_basic:2640) igt_fb-DEBUG: Test requirement passed: cairo_surface...
(kms_pipe_crc_basic:2640) igt_kms-DEBUG: Test requirement passed: plane_idx >=...
(kms_pipe_crc_basic:2640) igt_kms-DEBUG: display: A.0: plane_set_fb(80)
...
 IGT_4686 / fi-byt-squawks
Starting subtest: nonblocking-crc-pipe-A-frame-sequence
(kms_pipe_crc_basic:2597) igt_debugfs-CRITICAL: Test assertion failure functio...
(kms_pipe_crc_basic:2597) igt_debugfs-CRITICAL: Failed assertion: !mismatch
(kms_pipe_crc_basic:2597) igt_debugfs-CRITICAL: Last errno: 9, Bad file descri...
Subtest nonblocking-crc-pipe-A-frame-sequence failed.
**** DEBUG ****
(kms_pipe_crc_basic:2597) DEBUG: Test requirement passed: !(pipe >= data->disp...
(kms_pipe_crc_basic:2597) INFO: nonblocking-crc-pipe-A-frame-sequence: Testing...
(kms_pipe_crc_basic:2597) igt_kms-DEBUG: display: eDP-1: set_pipe(A)
(kms_pipe_crc_basic:2597) igt_kms-DEBUG: display: eDP-1: Selecting pipe A
(kms_pipe_crc_basic:2597) DEBUG: Clearing the fb with color (0.00,1.00,0.00)
(kms_pipe_crc_basic:2597) igt_fb-DEBUG: igt_create_fb_with_bo_size(width=1366,...
(kms_pipe_crc_basic:2597) igt_fb-DEBUG: igt_create_fb_with_bo_size(handle=1, p...
(kms_pipe_crc_basic:2597) ioctl_wrappers-DEBUG: Test requirement passed: igt_h...
(kms_pipe_crc_basic:2597) igt_fb-DEBUG: Test requirement passed: cairo_surface...
(kms_pipe_crc_basic:2597) igt_kms-DEBUG: Test requirement passed: plane_idx >=...
(kms_pipe_crc_basic:2597) igt_kms-DEBUG: display: A.0: plane_set_fb(80)
...
 IGT_4685 / fi-byt-squawks
Starting subtest: nonblocking-crc-pipe-A-frame-sequence
(kms_pipe_crc_basic:2709) igt_debugfs-CRITICAL: Test assertion failure functio...
(kms_pipe_crc_basic:2709) igt_debugfs-CRITICAL: Failed assertion: !mismatch
(kms_pipe_crc_basic:2709) igt_debugfs-CRITICAL: Last errno: 9, Bad file descri...
Subtest nonblocking-crc-pipe-A-frame-sequence failed.
**** DEBUG ****
(kms_pipe_crc_basic:2709) DEBUG: Test requirement passed: !(pipe >= data->disp...
(kms_pipe_crc_basic:2709) INFO: nonblocking-crc-pipe-A-frame-sequence: Testing...
(kms_pipe_crc_basic:2709) igt_kms-DEBUG: display: eDP-1: set_pipe(A)
(kms_pipe_crc_basic:2709) igt_kms-DEBUG: display: eDP-1: Selecting pipe A
(kms_pipe_crc_basic:2709) DEBUG: Clearing the fb with color (0.00,1.00,0.00)
(kms_pipe_crc_basic:2709) igt_fb-DEBUG: igt_create_fb_with_bo_size(width=1366,...
(kms_pipe_crc_basic:2709) igt_fb-DEBUG: igt_create_fb_with_bo_size(handle=1, p...
(kms_pipe_crc_basic:2709) ioctl_wrappers-DEBUG: Test requirement passed: igt_h...
(kms_pipe_crc_basic:2709) igt_fb-DEBUG: Test requirement passed: cairo_surface...
(kms_pipe_crc_basic:2709) igt_kms-DEBUG: Test requirement passed: plane_idx >=...
(kms_pipe_crc_basic:2709) igt_kms-DEBUG: display: A.0: plane_set_fb(80)
...
 IGT_4684 / fi-byt-squawks
Starting subtest: nonblocking-crc-pipe-A-frame-sequence
(kms_pipe_crc_basic:2632) igt_debugfs-CRITICAL: Test assertion failure functio...
(kms_pipe_crc_basic:2632) igt_debugfs-CRITICAL: Failed assertion: !mismatch
(kms_pipe_crc_basic:2632) igt_debugfs-CRITICAL: Last errno: 9, Bad file descri...
Subtest nonblocking-crc-pipe-A-frame-sequence failed.
**** DEBUG ****
(kms_pipe_crc_basic:2632) DEBUG: Test requirement passed: !(pipe >= data->disp...
(kms_pipe_crc_basic:2632) INFO: nonblocking-crc-pipe-A-frame-sequence: Testing...
(kms_pipe_crc_basic:2632) igt_kms-DEBUG: display: eDP-1: set_pipe(A)
(kms_pipe_crc_basic:2632) igt_kms-DEBUG: display: eDP-1: Selecting pipe A
(kms_pipe_crc_basic:2632) DEBUG: Clearing the fb with color (0.00,1.00,0.00)
(kms_pipe_crc_basic:2632) igt_fb-DEBUG: igt_create_fb_with_bo_size(width=1366,...
(kms_pipe_crc_basic:2632) igt_fb-DEBUG: igt_create_fb_with_bo_size(handle=1, p...
(kms_pipe_crc_basic:2632) ioctl_wrappers-DEBUG: Test requirement passed: igt_h...
(kms_pipe_crc_basic:2632) igt_fb-DEBUG: Test requirement passed: cairo_surface...
(kms_pipe_crc_basic:2632) igt_kms-DEBUG: Test requirement passed: plane_idx >=...
(kms_pipe_crc_basic:2632) igt_kms-DEBUG: display: A.0: plane_set_fb(80)
...
 
 
 
 
 
 
 
 
 
 
 
 
 
 
 
 
 
 
 
 
 
 
 
 
 
 
 
 
 
 
 
 
 
 
 
 
 
 
 
 
 
 
 
 
 
 
 
 
 
 
igt@kms_pipe_crc_basic@nonblocking-crc-pipe-b
 
 
 
 
 
 
 
 
 
 
 
 
 
 
 
 
 
 
 
 
 
 
 
 
 
 
 
 
 
 
 
 
 
 
 
 
 
 
 
 
 
 
 
 
 
 
 
 
 
 
 
 
 
 
 
 
 
 
 
 
 
 
 
 
 
 
 
 
 
 
 
 
 
 
 
 
 
 
 
 
 
 
 
 
 
 
 
 
 
 
 
 
 
 
 
 
 
 
 
 
 
 
 
 
 
 
 
 
 
 
 
 
 
 
 
 
 
 
 
 
 
 
 
 
 
 
 
 
 
 
 
 
 
 
 
 
 
 
 
 
 
 
 
 
 
 
 
 
 
 
 
 
 
 
 
 
 
 
 
 
 
 
 
 
 
 
 
 
 
 
 
 
 
 
 
 
 
 
 
 
 
 
 
 
 
 
 IGT_4687 / fi-byt-squawks
Starting subtest: nonblocking-crc-pipe-B
(kms_pipe_crc_basic:2641) igt_debugfs-CRITICAL: Test assertion failure functio...
(kms_pipe_crc_basic:2641) igt_debugfs-CRITICAL: Failed assertion: !mismatch
(kms_pipe_crc_basic:2641) igt_debugfs-CRITICAL: Last errno: 9, Bad file descri...
Subtest nonblocking-crc-pipe-B failed.
**** DEBUG ****
(kms_pipe_crc_basic:2641) DEBUG: Test requirement passed: !(pipe >= data->disp...
(kms_pipe_crc_basic:2641) INFO: nonblocking-crc-pipe-B: Testing connector eDP-...
(kms_pipe_crc_basic:2641) igt_kms-DEBUG: display: eDP-1: set_pipe(B)
(kms_pipe_crc_basic:2641) igt_kms-DEBUG: display: eDP-1: Selecting pipe B
(kms_pipe_crc_basic:2641) DEBUG: Clearing the fb with color (0.00,1.00,0.00)
(kms_pipe_crc_basic:2641) igt_fb-DEBUG: igt_create_fb_with_bo_size(width=1366,...
(kms_pipe_crc_basic:2641) igt_fb-DEBUG: igt_create_fb_with_bo_size(handle=1, p...
(kms_pipe_crc_basic:2641) ioctl_wrappers-DEBUG: Test requirement passed: igt_h...
(kms_pipe_crc_basic:2641) igt_fb-DEBUG: Test requirement passed: cairo_surface...
(kms_pipe_crc_basic:2641) igt_kms-DEBUG: Test requirement passed: plane_idx >=...
(kms_pipe_crc_basic:2641) igt_kms-DEBUG: display: B.0: plane_set_fb(80)
...
 IGT_4686 / fi-byt-squawks
Starting subtest: nonblocking-crc-pipe-B
(kms_pipe_crc_basic:2598) igt_debugfs-CRITICAL: Test assertion failure functio...
(kms_pipe_crc_basic:2598) igt_debugfs-CRITICAL: Failed assertion: !mismatch
(kms_pipe_crc_basic:2598) igt_debugfs-CRITICAL: Last errno: 9, Bad file descri...
Subtest nonblocking-crc-pipe-B failed.
**** DEBUG ****
(kms_pipe_crc_basic:2598) DEBUG: Test requirement passed: !(pipe >= data->disp...
(kms_pipe_crc_basic:2598) INFO: nonblocking-crc-pipe-B: Testing connector eDP-...
(kms_pipe_crc_basic:2598) igt_kms-DEBUG: display: eDP-1: set_pipe(B)
(kms_pipe_crc_basic:2598) igt_kms-DEBUG: display: eDP-1: Selecting pipe B
(kms_pipe_crc_basic:2598) DEBUG: Clearing the fb with color (0.00,1.00,0.00)
(kms_pipe_crc_basic:2598) igt_fb-DEBUG: igt_create_fb_with_bo_size(width=1366,...
(kms_pipe_crc_basic:2598) igt_fb-DEBUG: igt_create_fb_with_bo_size(handle=1, p...
(kms_pipe_crc_basic:2598) ioctl_wrappers-DEBUG: Test requirement passed: igt_h...
(kms_pipe_crc_basic:2598) igt_fb-DEBUG: Test requirement passed: cairo_surface...
(kms_pipe_crc_basic:2598) igt_kms-DEBUG: Test requirement passed: plane_idx >=...
(kms_pipe_crc_basic:2598) igt_kms-DEBUG: display: B.0: plane_set_fb(80)
...
 IGT_4685 / fi-byt-squawks
Starting subtest: nonblocking-crc-pipe-B
(kms_pipe_crc_basic:2710) igt_debugfs-CRITICAL: Test assertion failure functio...
(kms_pipe_crc_basic:2710) igt_debugfs-CRITICAL: Failed assertion: !mismatch
(kms_pipe_crc_basic:2710) igt_debugfs-CRITICAL: Last errno: 9, Bad file descri...
Subtest nonblocking-crc-pipe-B failed.
**** DEBUG ****
(kms_pipe_crc_basic:2710) DEBUG: Test requirement passed: !(pipe >= data->disp...
(kms_pipe_crc_basic:2710) INFO: nonblocking-crc-pipe-B: Testing connector eDP-...
(kms_pipe_crc_basic:2710) igt_kms-DEBUG: display: eDP-1: set_pipe(B)
(kms_pipe_crc_basic:2710) igt_kms-DEBUG: display: eDP-1: Selecting pipe B
(kms_pipe_crc_basic:2710) DEBUG: Clearing the fb with color (0.00,1.00,0.00)
(kms_pipe_crc_basic:2710) igt_fb-DEBUG: igt_create_fb_with_bo_size(width=1366,...
(kms_pipe_crc_basic:2710) igt_fb-DEBUG: igt_create_fb_with_bo_size(handle=1, p...
(kms_pipe_crc_basic:2710) ioctl_wrappers-DEBUG: Test requirement passed: igt_h...
(kms_pipe_crc_basic:2710) igt_fb-DEBUG: Test requirement passed: cairo_surface...
(kms_pipe_crc_basic:2710) igt_kms-DEBUG: Test requirement passed: plane_idx >=...
(kms_pipe_crc_basic:2710) igt_kms-DEBUG: display: B.0: plane_set_fb(80)
...
 IGT_4684 / fi-byt-squawks
Starting subtest: nonblocking-crc-pipe-B
(kms_pipe_crc_basic:2633) igt_debugfs-CRITICAL: Test assertion failure functio...
(kms_pipe_crc_basic:2633) igt_debugfs-CRITICAL: Failed assertion: !mismatch
(kms_pipe_crc_basic:2633) igt_debugfs-CRITICAL: Last errno: 9, Bad file descri...
Subtest nonblocking-crc-pipe-B failed.
**** DEBUG ****
(kms_pipe_crc_basic:2633) DEBUG: Test requirement passed: !(pipe >= data->disp...
(kms_pipe_crc_basic:2633) INFO: nonblocking-crc-pipe-B: Testing connector eDP-...
(kms_pipe_crc_basic:2633) igt_kms-DEBUG: display: eDP-1: set_pipe(B)
(kms_pipe_crc_basic:2633) igt_kms-DEBUG: display: eDP-1: Selecting pipe B
(kms_pipe_crc_basic:2633) DEBUG: Clearing the fb with color (0.00,1.00,0.00)
(kms_pipe_crc_basic:2633) igt_fb-DEBUG: igt_create_fb_with_bo_size(width=1366,...
(kms_pipe_crc_basic:2633) igt_fb-DEBUG: igt_create_fb_with_bo_size(handle=1, p...
(kms_pipe_crc_basic:2633) ioctl_wrappers-DEBUG: Test requirement passed: igt_h...
(kms_pipe_crc_basic:2633) igt_fb-DEBUG: Test requirement passed: cairo_surface...
(kms_pipe_crc_basic:2633) igt_kms-DEBUG: Test requirement passed: plane_idx >=...
(kms_pipe_crc_basic:2633) igt_kms-DEBUG: display: B.0: plane_set_fb(80)
...
 
 
 
 
 
 
 
 
 
 
 
 
 
 
 
 
 
 
 
 
 
 
 
 
 
 
 
 
 
 
 
 
 
 
 
 
 
 
 
 
 
 
 
 
 
 
 
 
 
 
igt@kms_pipe_crc_basic@nonblocking-crc-pipe-b-frame-sequence
 
 
 
 
 
 
 
 
 
 
 
 
 
 
 
 
 
 
 
 
 
 
 
 
 
 
 
 
 
 
 
 
 
 
 
 
 
 
 
 
 
 
 
 
 
 
 
 
 
 
 
 
 
 
 
 
 
 
 
 
 
 
 
 
 
 
 
 
 
 
 
 
 
 
 
 
 
 
 
 
 
 
 
 
 
 
 
 
 
 
 
 
 
 
 
 
 
 
 
 
 
 
 
 
 
 
 
 
 
 
 
 
 
 
 
 
 
 
 
 
 
 
 
 
 
 
 
 
 
 
 
 
 
 
 
 
 
 
 
 
 
 
 
 
 
 
 
 
 
 
 
 
 
 
 
 
 
 
 
 
 
 
 
 
 
 
 
 
 
 
 
 
 
 
 
 
 
 
 
 
 
 
 
 
 
 IGT_4688 / fi-byt-squawks
Starting subtest: nonblocking-crc-pipe-B-frame-sequence
(kms_pipe_crc_basic:2569) igt_debugfs-CRITICAL: Test assertion failure functio...
(kms_pipe_crc_basic:2569) igt_debugfs-CRITICAL: Failed assertion: !mismatch
(kms_pipe_crc_basic:2569) igt_debugfs-CRITICAL: Last errno: 9, Bad file descri...
Subtest nonblocking-crc-pipe-B-frame-sequence failed.
**** DEBUG ****
(kms_pipe_crc_basic:2569) DEBUG: Test requirement passed: !(pipe >= data->disp...
(kms_pipe_crc_basic:2569) INFO: nonblocking-crc-pipe-B-frame-sequence: Testing...
(kms_pipe_crc_basic:2569) igt_kms-DEBUG: display: eDP-1: set_pipe(B)
(kms_pipe_crc_basic:2569) igt_kms-DEBUG: display: eDP-1: Selecting pipe B
(kms_pipe_crc_basic:2569) DEBUG: Clearing the fb with color (0.00,1.00,0.00)
(kms_pipe_crc_basic:2569) igt_fb-DEBUG: igt_create_fb_with_bo_size(width=1366,...
(kms_pipe_crc_basic:2569) igt_fb-DEBUG: igt_create_fb_with_bo_size(handle=1, p...
(kms_pipe_crc_basic:2569) ioctl_wrappers-DEBUG: Test requirement passed: igt_h...
(kms_pipe_crc_basic:2569) igt_fb-DEBUG: Test requirement passed: cairo_surface...
(kms_pipe_crc_basic:2569) igt_kms-DEBUG: Test requirement passed: plane_idx >=...
(kms_pipe_crc_basic:2569) igt_kms-DEBUG: display: B.0: plane_set_fb(80)
...
 IGT_4687 / fi-byt-squawks
Starting subtest: nonblocking-crc-pipe-B-frame-sequence
(kms_pipe_crc_basic:2642) igt_debugfs-CRITICAL: Test assertion failure functio...
(kms_pipe_crc_basic:2642) igt_debugfs-CRITICAL: Failed assertion: !mismatch
(kms_pipe_crc_basic:2642) igt_debugfs-CRITICAL: Last errno: 9, Bad file descri...
Subtest nonblocking-crc-pipe-B-frame-sequence failed.
**** DEBUG ****
(kms_pipe_crc_basic:2642) DEBUG: Test requirement passed: !(pipe >= data->disp...
(kms_pipe_crc_basic:2642) INFO: nonblocking-crc-pipe-B-frame-sequence: Testing...
(kms_pipe_crc_basic:2642) igt_kms-DEBUG: display: eDP-1: set_pipe(B)
(kms_pipe_crc_basic:2642) igt_kms-DEBUG: display: eDP-1: Selecting pipe B
(kms_pipe_crc_basic:2642) DEBUG: Clearing the fb with color (0.00,1.00,0.00)
(kms_pipe_crc_basic:2642) igt_fb-DEBUG: igt_create_fb_with_bo_size(width=1366,...
(kms_pipe_crc_basic:2642) igt_fb-DEBUG: igt_create_fb_with_bo_size(handle=1, p...
(kms_pipe_crc_basic:2642) ioctl_wrappers-DEBUG: Test requirement passed: igt_h...
(kms_pipe_crc_basic:2642) igt_fb-DEBUG: Test requirement passed: cairo_surface...
(kms_pipe_crc_basic:2642) igt_kms-DEBUG: Test requirement passed: plane_idx >=...
(kms_pipe_crc_basic:2642) igt_kms-DEBUG: display: B.0: plane_set_fb(80)
...
 IGT_4686 / fi-byt-squawks
Starting subtest: nonblocking-crc-pipe-B-frame-sequence
(kms_pipe_crc_basic:2599) igt_debugfs-CRITICAL: Test assertion failure functio...
(kms_pipe_crc_basic:2599) igt_debugfs-CRITICAL: Failed assertion: !mismatch
(kms_pipe_crc_basic:2599) igt_debugfs-CRITICAL: Last errno: 9, Bad file descri...
Subtest nonblocking-crc-pipe-B-frame-sequence failed.
**** DEBUG ****
(kms_pipe_crc_basic:2599) DEBUG: Test requirement passed: !(pipe >= data->disp...
(kms_pipe_crc_basic:2599) INFO: nonblocking-crc-pipe-B-frame-sequence: Testing...
(kms_pipe_crc_basic:2599) igt_kms-DEBUG: display: eDP-1: set_pipe(B)
(kms_pipe_crc_basic:2599) igt_kms-DEBUG: display: eDP-1: Selecting pipe B
(kms_pipe_crc_basic:2599) DEBUG: Clearing the fb with color (0.00,1.00,0.00)
(kms_pipe_crc_basic:2599) igt_fb-DEBUG: igt_create_fb_with_bo_size(width=1366,...
(kms_pipe_crc_basic:2599) igt_fb-DEBUG: igt_create_fb_with_bo_size(handle=1, p...
(kms_pipe_crc_basic:2599) ioctl_wrappers-DEBUG: Test requirement passed: igt_h...
(kms_pipe_crc_basic:2599) igt_fb-DEBUG: Test requirement passed: cairo_surface...
(kms_pipe_crc_basic:2599) igt_kms-DEBUG: Test requirement passed: plane_idx >=...
(kms_pipe_crc_basic:2599) igt_kms-DEBUG: display: B.0: plane_set_fb(80)
...
 IGT_4685 / fi-byt-squawks
Starting subtest: nonblocking-crc-pipe-B-frame-sequence
(kms_pipe_crc_basic:2711) igt_debugfs-CRITICAL: Test assertion failure functio...
(kms_pipe_crc_basic:2711) igt_debugfs-CRITICAL: Failed assertion: !mismatch
(kms_pipe_crc_basic:2711) igt_debugfs-CRITICAL: Last errno: 9, Bad file descri...
Subtest nonblocking-crc-pipe-B-frame-sequence failed.
**** DEBUG ****
(kms_pipe_crc_basic:2711) DEBUG: Test requirement passed: !(pipe >= data->disp...
(kms_pipe_crc_basic:2711) INFO: nonblocking-crc-pipe-B-frame-sequence: Testing...
(kms_pipe_crc_basic:2711) igt_kms-DEBUG: display: eDP-1: set_pipe(B)
(kms_pipe_crc_basic:2711) igt_kms-DEBUG: display: eDP-1: Selecting pipe B
(kms_pipe_crc_basic:2711) DEBUG: Clearing the fb with color (0.00,1.00,0.00)
(kms_pipe_crc_basic:2711) igt_fb-DEBUG: igt_create_fb_with_bo_size(width=1366,...
(kms_pipe_crc_basic:2711) igt_fb-DEBUG: igt_create_fb_with_bo_size(handle=1, p...
(kms_pipe_crc_basic:2711) ioctl_wrappers-DEBUG: Test requirement passed: igt_h...
(kms_pipe_crc_basic:2711) igt_fb-DEBUG: Test requirement passed: cairo_surface...
(kms_pipe_crc_basic:2711) igt_kms-DEBUG: Test requirement passed: plane_idx >=...
(kms_pipe_crc_basic:2711) igt_kms-DEBUG: display: B.0: plane_set_fb(80)
...
 
 
 
 
 
 
 
 
 
 
 
 
 
 
 
 
 
 
 
 
 
 
 
 
 
 
 
 
 
 
 
 
 
 
 
 
 
 
 
 
 
 
 
 
 
 
 
 
 
 
 
igt@kms_pipe_crc_basic@read-crc-pipe-a
 
 
 
 
 
 
 
 
 
 
 
 
 
 
 
 
 
 
 
 
 
 
 
 
 
 
 
 
 
 
 
 
 
 
 
 
 
 
 
 
 
 
 
 
 
 
 
 
 
 
 
 
 
 
 
 
 
 
 
 
 
 
 
 
 
 
 
 
 
 
 
 
 
 
 
 
 
 
 
 
 
 
 
 
 
 
 
 
 
 
 
 
 
 
 
 
 
 
 
 
 
 
 
 
 
 
 
 
 
 
 
 
 
 
 
 
 
 
 
 
 
 
 
 
 
 
 
 
 
 
 
 
 
 
 
 
 
 
 
 
 
 
 
 
 
 
 
 
 
 
 
 
 
 
 
 
 
 
 
 
 
 
 
 
 
 
 
 
 
 
 
 
 IGT_4686 / fi-byt-clapper
Starting subtest: read-crc-pipe-A
(kms_pipe_crc_basic:2619) igt_debugfs-CRITICAL: Test assertion failure functio...
(kms_pipe_crc_basic:2619) igt_debugfs-CRITICAL: Failed assertion: !mismatch
(kms_pipe_crc_basic:2619) igt_debugfs-CRITICAL: Last errno: 9, Bad file descri...
Subtest read-crc-pipe-A failed.
**** DEBUG ****
(kms_pipe_crc_basic:2619) DEBUG: Test requirement passed: !(pipe >= data->disp...
(kms_pipe_crc_basic:2619) INFO: read-crc-pipe-A: Testing connector eDP-1 using...
(kms_pipe_crc_basic:2619) igt_kms-DEBUG: display: eDP-1: set_pipe(A)
(kms_pipe_crc_basic:2619) igt_kms-DEBUG: display: eDP-1: Selecting pipe A
(kms_pipe_crc_basic:2619) DEBUG: Clearing the fb with color (0.00,1.00,0.00)
(kms_pipe_crc_basic:2619) igt_fb-DEBUG: igt_create_fb_with_bo_size(width=1366,...
(kms_pipe_crc_basic:2619) igt_fb-DEBUG: igt_create_fb_with_bo_size(handle=1, p...
(kms_pipe_crc_basic:2619) ioctl_wrappers-DEBUG: Test requirement passed: igt_h...
(kms_pipe_crc_basic:2619) igt_fb-DEBUG: Test requirement passed: cairo_surface...
(kms_pipe_crc_basic:2619) igt_kms-DEBUG: Test requirement passed: plane_idx >=...
(kms_pipe_crc_basic:2619) igt_kms-DEBUG: display: A.0: plane_set_fb(81)
...
 
 
 
 
 
 
 
 
 
 
 
 
 IGT_4688 / fi-byt-squawks
Starting subtest: read-crc-pipe-A
(kms_pipe_crc_basic:2574) igt_debugfs-CRITICAL: Test assertion failure functio...
(kms_pipe_crc_basic:2574) igt_debugfs-CRITICAL: Failed assertion: !mismatch
(kms_pipe_crc_basic:2574) igt_debugfs-CRITICAL: Last errno: 9, Bad file descri...
Subtest read-crc-pipe-A failed.
**** DEBUG ****
(kms_pipe_crc_basic:2574) DEBUG: Test requirement passed: !(pipe >= data->disp...
(kms_pipe_crc_basic:2574) INFO: read-crc-pipe-A: Testing connector eDP-1 using...
(kms_pipe_crc_basic:2574) igt_kms-DEBUG: display: eDP-1: set_pipe(A)
(kms_pipe_crc_basic:2574) igt_kms-DEBUG: display: eDP-1: Selecting pipe A
(kms_pipe_crc_basic:2574) DEBUG: Clearing the fb with color (0.00,1.00,0.00)
(kms_pipe_crc_basic:2574) igt_fb-DEBUG: igt_create_fb_with_bo_size(width=1366,...
(kms_pipe_crc_basic:2574) igt_fb-DEBUG: igt_create_fb_with_bo_size(handle=1, p...
(kms_pipe_crc_basic:2574) ioctl_wrappers-DEBUG: Test requirement passed: igt_h...
(kms_pipe_crc_basic:2574) igt_fb-DEBUG: Test requirement passed: cairo_surface...
(kms_pipe_crc_basic:2574) igt_kms-DEBUG: Test requirement passed: plane_idx >=...
(kms_pipe_crc_basic:2574) igt_kms-DEBUG: display: A.0: plane_set_fb(80)
...
 IGT_4687 / fi-byt-squawks
Starting subtest: read-crc-pipe-A
(kms_pipe_crc_basic:2646) igt_debugfs-CRITICAL: Test assertion failure functio...
(kms_pipe_crc_basic:2646) igt_debugfs-CRITICAL: Failed assertion: !mismatch
(kms_pipe_crc_basic:2646) igt_debugfs-CRITICAL: Last errno: 9, Bad file descri...
Subtest read-crc-pipe-A failed.
**** DEBUG ****
(kms_pipe_crc_basic:2646) DEBUG: Test requirement passed: !(pipe >= data->disp...
(kms_pipe_crc_basic:2646) INFO: read-crc-pipe-A: Testing connector eDP-1 using...
(kms_pipe_crc_basic:2646) igt_kms-DEBUG: display: eDP-1: set_pipe(A)
(kms_pipe_crc_basic:2646) igt_kms-DEBUG: display: eDP-1: Selecting pipe A
(kms_pipe_crc_basic:2646) DEBUG: Clearing the fb with color (0.00,1.00,0.00)
(kms_pipe_crc_basic:2646) igt_fb-DEBUG: igt_create_fb_with_bo_size(width=1366,...
(kms_pipe_crc_basic:2646) igt_fb-DEBUG: igt_create_fb_with_bo_size(handle=1, p...
(kms_pipe_crc_basic:2646) ioctl_wrappers-DEBUG: Test requirement passed: igt_h...
(kms_pipe_crc_basic:2646) igt_fb-DEBUG: Test requirement passed: cairo_surface...
(kms_pipe_crc_basic:2646) igt_kms-DEBUG: Test requirement passed: plane_idx >=...
(kms_pipe_crc_basic:2646) igt_kms-DEBUG: display: A.0: plane_set_fb(80)
...
 IGT_4686 / fi-byt-squawks
Starting subtest: read-crc-pipe-A
(kms_pipe_crc_basic:2602) igt_debugfs-CRITICAL: Test assertion failure functio...
(kms_pipe_crc_basic:2602) igt_debugfs-CRITICAL: Failed assertion: !mismatch
(kms_pipe_crc_basic:2602) igt_debugfs-CRITICAL: Last errno: 9, Bad file descri...
Subtest read-crc-pipe-A failed.
**** DEBUG ****
(kms_pipe_crc_basic:2602) DEBUG: Test requirement passed: !(pipe >= data->disp...
(kms_pipe_crc_basic:2602) INFO: read-crc-pipe-A: Testing connector eDP-1 using...
(kms_pipe_crc_basic:2602) igt_kms-DEBUG: display: eDP-1: set_pipe(A)
(kms_pipe_crc_basic:2602) igt_kms-DEBUG: display: eDP-1: Selecting pipe A
(kms_pipe_crc_basic:2602) DEBUG: Clearing the fb with color (0.00,1.00,0.00)
(kms_pipe_crc_basic:2602) igt_fb-DEBUG: igt_create_fb_with_bo_size(width=1366,...
(kms_pipe_crc_basic:2602) igt_fb-DEBUG: igt_create_fb_with_bo_size(handle=1, p...
(kms_pipe_crc_basic:2602) ioctl_wrappers-DEBUG: Test requirement passed: igt_h...
(kms_pipe_crc_basic:2602) igt_fb-DEBUG: Test requirement passed: cairo_surface...
(kms_pipe_crc_basic:2602) igt_kms-DEBUG: Test requirement passed: plane_idx >=...
(kms_pipe_crc_basic:2602) igt_kms-DEBUG: display: A.0: plane_set_fb(80)
...
 IGT_4685 / fi-byt-squawks
Starting subtest: read-crc-pipe-A
(kms_pipe_crc_basic:2716) igt_debugfs-CRITICAL: Test assertion failure functio...
(kms_pipe_crc_basic:2716) igt_debugfs-CRITICAL: Failed assertion: !mismatch
(kms_pipe_crc_basic:2716) igt_debugfs-CRITICAL: Last errno: 9, Bad file descri...
Subtest read-crc-pipe-A failed.
**** DEBUG ****
(kms_pipe_crc_basic:2716) DEBUG: Test requirement passed: !(pipe >= data->disp...
(kms_pipe_crc_basic:2716) INFO: read-crc-pipe-A: Testing connector eDP-1 using...
(kms_pipe_crc_basic:2716) igt_kms-DEBUG: display: eDP-1: set_pipe(A)
(kms_pipe_crc_basic:2716) igt_kms-DEBUG: display: eDP-1: Selecting pipe A
(kms_pipe_crc_basic:2716) DEBUG: Clearing the fb with color (0.00,1.00,0.00)
(kms_pipe_crc_basic:2716) igt_fb-DEBUG: igt_create_fb_with_bo_size(width=1366,...
(kms_pipe_crc_basic:2716) igt_fb-DEBUG: igt_create_fb_with_bo_size(handle=1, p...
(kms_pipe_crc_basic:2716) ioctl_wrappers-DEBUG: Test requirement passed: igt_h...
(kms_pipe_crc_basic:2716) igt_fb-DEBUG: Test requirement passed: cairo_surface...
(kms_pipe_crc_basic:2716) igt_kms-DEBUG: Test requirement passed: plane_idx >=...
(kms_pipe_crc_basic:2716) igt_kms-DEBUG: display: A.0: plane_set_fb(80)
...
 IGT_4684 / fi-byt-squawks
Starting subtest: read-crc-pipe-A
(kms_pipe_crc_basic:2637) igt_debugfs-CRITICAL: Test assertion failure functio...
(kms_pipe_crc_basic:2637) igt_debugfs-CRITICAL: Failed assertion: !mismatch
(kms_pipe_crc_basic:2637) igt_debugfs-CRITICAL: Last errno: 9, Bad file descri...
Subtest read-crc-pipe-A failed.
**** DEBUG ****
(kms_pipe_crc_basic:2637) DEBUG: Test requirement passed: !(pipe >= data->disp...
(kms_pipe_crc_basic:2637) INFO: read-crc-pipe-A: Testing connector eDP-1 using...
(kms_pipe_crc_basic:2637) igt_kms-DEBUG: display: eDP-1: set_pipe(A)
(kms_pipe_crc_basic:2637) igt_kms-DEBUG: display: eDP-1: Selecting pipe A
(kms_pipe_crc_basic:2637) DEBUG: Clearing the fb with color (0.00,1.00,0.00)
(kms_pipe_crc_basic:2637) igt_fb-DEBUG: igt_create_fb_with_bo_size(width=1366,...
(kms_pipe_crc_basic:2637) igt_fb-DEBUG: igt_create_fb_with_bo_size(handle=1, p...
(kms_pipe_crc_basic:2637) ioctl_wrappers-DEBUG: Test requirement passed: igt_h...
(kms_pipe_crc_basic:2637) igt_fb-DEBUG: Test requirement passed: cairo_surface...
(kms_pipe_crc_basic:2637) igt_kms-DEBUG: Test requirement passed: plane_idx >=...
(kms_pipe_crc_basic:2637) igt_kms-DEBUG: display: A.0: plane_set_fb(80)
...
 
 
 
 
 
 
 
 
 
 
 
 
 
 
 
 
 
 
 
 
 
 
 
 
 
 
 
 
 
 
 
 
 
 
 
 
 
 
 
 
 
 
 
 
 
 
 
 
 
 
igt@kms_pipe_crc_basic@read-crc-pipe-a-frame-sequence
 
 
 
 
 
 
 
 
 
 
 
 
 
 
 
 
 
 
 
 
 
 
 
 
 
 
 
 
 
 
 
 
 
 
 
 
 
 
 
 
 
 
 
 
 
 
 
 
 
 
 
 
 
 
 
 
 
 
 
 
 
 
 
 
 
 
 
 
 
 
 
 
 
 
 
 
 
 
 
 
 
 
 
 
 
 
 
 
 
 
 
 
 
 
 
 
 
 
 
 
 
 
 
 
 
 
 
 
 
 
 
 
 
 
 
 
 
 
 
 
 
 
 
 
 
 
 
 
 
 
 
 
 
 
 
 
 
 
 
 
 
 
 
 
 
 
 
 
 
 
 
 
 
 
 
 
 
 
 
 
 
 
 
 
 
 
 
 
 
 
 
 
 
 
 
 
 
 
 
 
 
 
 
 
 
 IGT_4688 / fi-byt-squawks
Starting subtest: read-crc-pipe-A-frame-sequence
(kms_pipe_crc_basic:2575) igt_debugfs-CRITICAL: Test assertion failure functio...
(kms_pipe_crc_basic:2575) igt_debugfs-CRITICAL: Failed assertion: !mismatch
(kms_pipe_crc_basic:2575) igt_debugfs-CRITICAL: Last errno: 9, Bad file descri...
Subtest read-crc-pipe-A-frame-sequence failed.
**** DEBUG ****
(kms_pipe_crc_basic:2575) DEBUG: Test requirement passed: !(pipe >= data->disp...
(kms_pipe_crc_basic:2575) INFO: read-crc-pipe-A-frame-sequence: Testing connec...
(kms_pipe_crc_basic:2575) igt_kms-DEBUG: display: eDP-1: set_pipe(A)
(kms_pipe_crc_basic:2575) igt_kms-DEBUG: display: eDP-1: Selecting pipe A
(kms_pipe_crc_basic:2575) DEBUG: Clearing the fb with color (0.00,1.00,0.00)
(kms_pipe_crc_basic:2575) igt_fb-DEBUG: igt_create_fb_with_bo_size(width=1366,...
(kms_pipe_crc_basic:2575) igt_fb-DEBUG: igt_create_fb_with_bo_size(handle=1, p...
(kms_pipe_crc_basic:2575) ioctl_wrappers-DEBUG: Test requirement passed: igt_h...
(kms_pipe_crc_basic:2575) igt_fb-DEBUG: Test requirement passed: cairo_surface...
(kms_pipe_crc_basic:2575) igt_kms-DEBUG: Test requirement passed: plane_idx >=...
(kms_pipe_crc_basic:2575) igt_kms-DEBUG: display: A.0: plane_set_fb(80)
...
 IGT_4687 / fi-byt-squawks
Starting subtest: read-crc-pipe-A-frame-sequence
(kms_pipe_crc_basic:2647) igt_debugfs-CRITICAL: Test assertion failure functio...
(kms_pipe_crc_basic:2647) igt_debugfs-CRITICAL: Failed assertion: !mismatch
(kms_pipe_crc_basic:2647) igt_debugfs-CRITICAL: Last errno: 9, Bad file descri...
Subtest read-crc-pipe-A-frame-sequence failed.
**** DEBUG ****
(kms_pipe_crc_basic:2647) DEBUG: Test requirement passed: !(pipe >= data->disp...
(kms_pipe_crc_basic:2647) INFO: read-crc-pipe-A-frame-sequence: Testing connec...
(kms_pipe_crc_basic:2647) igt_kms-DEBUG: display: eDP-1: set_pipe(A)
(kms_pipe_crc_basic:2647) igt_kms-DEBUG: display: eDP-1: Selecting pipe A
(kms_pipe_crc_basic:2647) DEBUG: Clearing the fb with color (0.00,1.00,0.00)
(kms_pipe_crc_basic:2647) igt_fb-DEBUG: igt_create_fb_with_bo_size(width=1366,...
(kms_pipe_crc_basic:2647) igt_fb-DEBUG: igt_create_fb_with_bo_size(handle=1, p...
(kms_pipe_crc_basic:2647) ioctl_wrappers-DEBUG: Test requirement passed: igt_h...
(kms_pipe_crc_basic:2647) igt_fb-DEBUG: Test requirement passed: cairo_surface...
(kms_pipe_crc_basic:2647) igt_kms-DEBUG: Test requirement passed: plane_idx >=...
(kms_pipe_crc_basic:2647) igt_kms-DEBUG: display: A.0: plane_set_fb(80)
...
 IGT_4686 / fi-byt-squawks
Starting subtest: read-crc-pipe-A-frame-sequence
(kms_pipe_crc_basic:2603) igt_debugfs-CRITICAL: Test assertion failure functio...
(kms_pipe_crc_basic:2603) igt_debugfs-CRITICAL: Failed assertion: !mismatch
(kms_pipe_crc_basic:2603) igt_debugfs-CRITICAL: Last errno: 9, Bad file descri...
Subtest read-crc-pipe-A-frame-sequence failed.
**** DEBUG ****
(kms_pipe_crc_basic:2603) DEBUG: Test requirement passed: !(pipe >= data->disp...
(kms_pipe_crc_basic:2603) INFO: read-crc-pipe-A-frame-sequence: Testing connec...
(kms_pipe_crc_basic:2603) igt_kms-DEBUG: display: eDP-1: set_pipe(A)
(kms_pipe_crc_basic:2603) igt_kms-DEBUG: display: eDP-1: Selecting pipe A
(kms_pipe_crc_basic:2603) DEBUG: Clearing the fb with color (0.00,1.00,0.00)
(kms_pipe_crc_basic:2603) igt_fb-DEBUG: igt_create_fb_with_bo_size(width=1366,...
(kms_pipe_crc_basic:2603) igt_fb-DEBUG: igt_create_fb_with_bo_size(handle=1, p...
(kms_pipe_crc_basic:2603) ioctl_wrappers-DEBUG: Test requirement passed: igt_h...
(kms_pipe_crc_basic:2603) igt_fb-DEBUG: Test requirement passed: cairo_surface...
(kms_pipe_crc_basic:2603) igt_kms-DEBUG: Test requirement passed: plane_idx >=...
(kms_pipe_crc_basic:2603) igt_kms-DEBUG: display: A.0: plane_set_fb(80)
...
 IGT_4685 / fi-byt-squawks
Starting subtest: read-crc-pipe-A-frame-sequence
(kms_pipe_crc_basic:2717) igt_debugfs-CRITICAL: Test assertion failure functio...
(kms_pipe_crc_basic:2717) igt_debugfs-CRITICAL: Failed assertion: !mismatch
(kms_pipe_crc_basic:2717) igt_debugfs-CRITICAL: Last errno: 9, Bad file descri...
Subtest read-crc-pipe-A-frame-sequence failed.
**** DEBUG ****
(kms_pipe_crc_basic:2717) DEBUG: Test requirement passed: !(pipe >= data->disp...
(kms_pipe_crc_basic:2717) INFO: read-crc-pipe-A-frame-sequence: Testing connec...
(kms_pipe_crc_basic:2717) igt_kms-DEBUG: display: eDP-1: set_pipe(A)
(kms_pipe_crc_basic:2717) igt_kms-DEBUG: display: eDP-1: Selecting pipe A
(kms_pipe_crc_basic:2717) DEBUG: Clearing the fb with color (0.00,1.00,0.00)
(kms_pipe_crc_basic:2717) igt_fb-DEBUG: igt_create_fb_with_bo_size(width=1366,...
(kms_pipe_crc_basic:2717) igt_fb-DEBUG: igt_create_fb_with_bo_size(handle=1, p...
(kms_pipe_crc_basic:2717) ioctl_wrappers-DEBUG: Test requirement passed: igt_h...
(kms_pipe_crc_basic:2717) igt_fb-DEBUG: Test requirement passed: cairo_surface...
(kms_pipe_crc_basic:2717) igt_kms-DEBUG: Test requirement passed: plane_idx >=...
(kms_pipe_crc_basic:2717) igt_kms-DEBUG: display: A.0: plane_set_fb(80)
...
 IGT_4684 / fi-byt-squawks
Starting subtest: read-crc-pipe-A-frame-sequence
(kms_pipe_crc_basic:2638) igt_debugfs-CRITICAL: Test assertion failure functio...
(kms_pipe_crc_basic:2638) igt_debugfs-CRITICAL: Failed assertion: !mismatch
(kms_pipe_crc_basic:2638) igt_debugfs-CRITICAL: Last errno: 9, Bad file descri...
Subtest read-crc-pipe-A-frame-sequence failed.
**** DEBUG ****
(kms_pipe_crc_basic:2638) DEBUG: Test requirement passed: !(pipe >= data->disp...
(kms_pipe_crc_basic:2638) INFO: read-crc-pipe-A-frame-sequence: Testing connec...
(kms_pipe_crc_basic:2638) igt_kms-DEBUG: display: eDP-1: set_pipe(A)
(kms_pipe_crc_basic:2638) igt_kms-DEBUG: display: eDP-1: Selecting pipe A
(kms_pipe_crc_basic:2638) DEBUG: Clearing the fb with color (0.00,1.00,0.00)
(kms_pipe_crc_basic:2638) igt_fb-DEBUG: igt_create_fb_with_bo_size(width=1366,...
(kms_pipe_crc_basic:2638) igt_fb-DEBUG: igt_create_fb_with_bo_size(handle=1, p...
(kms_pipe_crc_basic:2638) ioctl_wrappers-DEBUG: Test requirement passed: igt_h...
(kms_pipe_crc_basic:2638) igt_fb-DEBUG: Test requirement passed: cairo_surface...
(kms_pipe_crc_basic:2638) igt_kms-DEBUG: Test requirement passed: plane_idx >=...
(kms_pipe_crc_basic:2638) igt_kms-DEBUG: display: A.0: plane_set_fb(80)
...
 
 
 
 
 
 
 
 
 
 
 
 
 
 
 
 
 
 
 
 
 
 
 
 
 
 
 
 
 
 
 
 
 
 
 
 
 
 
 
 
 
 
 
 
 
 
 
 
 
 
igt@kms_pipe_crc_basic@read-crc-pipe-b
 
 
 
 
 
 
 
 
 
 
 
 
 
 
 
 
 
 
 
 
 
 
 
 
 
 
 
 
 
 
 
 
 
 
 
 
 
 
 
 
 
 
 
 
 
 
 
 
 
 
 
 
 
 
 
 
 
 
 
 
 
 
 
 
 
 
 
 
 
 
 
 
 
 
 
 
 
 
 
 
 
 
 
 
 
 
 
 
 
 
 
 
 
 
 
 
 
 
 
 
 
 
 
 
 
 
 
 
 
 
 
 
 
 
 
 
 
 
 
 
 
 
 
 
 
 
 
 
 
 
 
 
 
 
 
 
 
 
 
 
 
 
 
 
 
 
 
 
 
 
 
 
 
 
 
 
 
 
 
 
 
 
 
 
 
 
 
 
 
 
 
 
 
 
 
 
 
 
 
 
 
 
 
 
 
 IGT_4688 / fi-byt-squawks
Starting subtest: read-crc-pipe-B
(kms_pipe_crc_basic:2576) igt_debugfs-CRITICAL: Test assertion failure functio...
(kms_pipe_crc_basic:2576) igt_debugfs-CRITICAL: Failed assertion: !mismatch
(kms_pipe_crc_basic:2576) igt_debugfs-CRITICAL: Last errno: 9, Bad file descri...
Subtest read-crc-pipe-B failed.
**** DEBUG ****
(kms_pipe_crc_basic:2576) DEBUG: Test requirement passed: !(pipe >= data->disp...
(kms_pipe_crc_basic:2576) INFO: read-crc-pipe-B: Testing connector eDP-1 using...
(kms_pipe_crc_basic:2576) igt_kms-DEBUG: display: eDP-1: set_pipe(B)
(kms_pipe_crc_basic:2576) igt_kms-DEBUG: display: eDP-1: Selecting pipe B
(kms_pipe_crc_basic:2576) DEBUG: Clearing the fb with color (0.00,1.00,0.00)
(kms_pipe_crc_basic:2576) igt_fb-DEBUG: igt_create_fb_with_bo_size(width=1366,...
(kms_pipe_crc_basic:2576) igt_fb-DEBUG: igt_create_fb_with_bo_size(handle=1, p...
(kms_pipe_crc_basic:2576) ioctl_wrappers-DEBUG: Test requirement passed: igt_h...
(kms_pipe_crc_basic:2576) igt_fb-DEBUG: Test requirement passed: cairo_surface...
(kms_pipe_crc_basic:2576) igt_kms-DEBUG: Test requirement passed: plane_idx >=...
(kms_pipe_crc_basic:2576) igt_kms-DEBUG: display: B.0: plane_set_fb(80)
...
 IGT_4687 / fi-byt-squawks
Starting subtest: read-crc-pipe-B
(kms_pipe_crc_basic:2648) igt_debugfs-CRITICAL: Test assertion failure functio...
(kms_pipe_crc_basic:2648) igt_debugfs-CRITICAL: Failed assertion: !mismatch
(kms_pipe_crc_basic:2648) igt_debugfs-CRITICAL: Last errno: 9, Bad file descri...
Subtest read-crc-pipe-B failed.
**** DEBUG ****
(kms_pipe_crc_basic:2648) DEBUG: Test requirement passed: !(pipe >= data->disp...
(kms_pipe_crc_basic:2648) INFO: read-crc-pipe-B: Testing connector eDP-1 using...
(kms_pipe_crc_basic:2648) igt_kms-DEBUG: display: eDP-1: set_pipe(B)
(kms_pipe_crc_basic:2648) igt_kms-DEBUG: display: eDP-1: Selecting pipe B
(kms_pipe_crc_basic:2648) DEBUG: Clearing the fb with color (0.00,1.00,0.00)
(kms_pipe_crc_basic:2648) igt_fb-DEBUG: igt_create_fb_with_bo_size(width=1366,...
(kms_pipe_crc_basic:2648) igt_fb-DEBUG: igt_create_fb_with_bo_size(handle=1, p...
(kms_pipe_crc_basic:2648) ioctl_wrappers-DEBUG: Test requirement passed: igt_h...
(kms_pipe_crc_basic:2648) igt_fb-DEBUG: Test requirement passed: cairo_surface...
(kms_pipe_crc_basic:2648) igt_kms-DEBUG: Test requirement passed: plane_idx >=...
(kms_pipe_crc_basic:2648) igt_kms-DEBUG: display: B.0: plane_set_fb(80)
...
 IGT_4686 / fi-byt-squawks
Starting subtest: read-crc-pipe-B
(kms_pipe_crc_basic:2604) igt_debugfs-CRITICAL: Test assertion failure functio...
(kms_pipe_crc_basic:2604) igt_debugfs-CRITICAL: Failed assertion: !mismatch
(kms_pipe_crc_basic:2604) igt_debugfs-CRITICAL: Last errno: 9, Bad file descri...
Subtest read-crc-pipe-B failed.
**** DEBUG ****
(kms_pipe_crc_basic:2604) DEBUG: Test requirement passed: !(pipe >= data->disp...
(kms_pipe_crc_basic:2604) INFO: read-crc-pipe-B: Testing connector eDP-1 using...
(kms_pipe_crc_basic:2604) igt_kms-DEBUG: display: eDP-1: set_pipe(B)
(kms_pipe_crc_basic:2604) igt_kms-DEBUG: display: eDP-1: Selecting pipe B
(kms_pipe_crc_basic:2604) DEBUG: Clearing the fb with color (0.00,1.00,0.00)
(kms_pipe_crc_basic:2604) igt_fb-DEBUG: igt_create_fb_with_bo_size(width=1366,...
(kms_pipe_crc_basic:2604) igt_fb-DEBUG: igt_create_fb_with_bo_size(handle=1, p...
(kms_pipe_crc_basic:2604) ioctl_wrappers-DEBUG: Test requirement passed: igt_h...
(kms_pipe_crc_basic:2604) igt_fb-DEBUG: Test requirement passed: cairo_surface...
(kms_pipe_crc_basic:2604) igt_kms-DEBUG: Test requirement passed: plane_idx >=...
(kms_pipe_crc_basic:2604) igt_kms-DEBUG: display: B.0: plane_set_fb(80)
...
 IGT_4685 / fi-byt-squawks
Starting subtest: read-crc-pipe-B
(kms_pipe_crc_basic:2718) igt_debugfs-CRITICAL: Test assertion failure functio...
(kms_pipe_crc_basic:2718) igt_debugfs-CRITICAL: Failed assertion: !mismatch
(kms_pipe_crc_basic:2718) igt_debugfs-CRITICAL: Last errno: 9, Bad file descri...
Subtest read-crc-pipe-B failed.
**** DEBUG ****
(kms_pipe_crc_basic:2718) DEBUG: Test requirement passed: !(pipe >= data->disp...
(kms_pipe_crc_basic:2718) INFO: read-crc-pipe-B: Testing connector eDP-1 using...
(kms_pipe_crc_basic:2718) igt_kms-DEBUG: display: eDP-1: set_pipe(B)
(kms_pipe_crc_basic:2718) igt_kms-DEBUG: display: eDP-1: Selecting pipe B
(kms_pipe_crc_basic:2718) DEBUG: Clearing the fb with color (0.00,1.00,0.00)
(kms_pipe_crc_basic:2718) igt_fb-DEBUG: igt_create_fb_with_bo_size(width=1366,...
(kms_pipe_crc_basic:2718) igt_fb-DEBUG: igt_create_fb_with_bo_size(handle=1, p...
(kms_pipe_crc_basic:2718) ioctl_wrappers-DEBUG: Test requirement passed: igt_h...
(kms_pipe_crc_basic:2718) igt_fb-DEBUG: Test requirement passed: cairo_surface...
(kms_pipe_crc_basic:2718) igt_kms-DEBUG: Test requirement passed: plane_idx >=...
(kms_pipe_crc_basic:2718) igt_kms-DEBUG: display: B.0: plane_set_fb(80)
...
 
 
 
 
 
 
 
 
 
 
 
 
 
 
 
 
 
 
 
 
 
 
 
 
 
 
 
 
 
 
 
 
 
 
 
 
 
 
 
 
 
 
 
 
 
 
 
 
 
 
 
igt@kms_pipe_crc_basic@read-crc-pipe-b-frame-sequence
 
 
 
 
 
 
 
 
 
 
 
 
 
 
 
 
 
 
 
 
 
 
 
 
 
 
 
 
 
 
 
 
 
 
 
 
 
 
 
 
 
 
 
 
 
 
 
 
 
 
 
 
 
 
 
 
 
 
 
 
 
 
 
 
 
 
 
 
 
 
 
 
 
 
 
 
 
 
 
 
 
 
 
 
 
 
 
 
 
 
 
 
 
 
 
 
 
 
 
 
 
 
 
 
 
 
 
 
 
 
 
 
 
 
 
 
 
 
 
 
 
 
 
 
 
 
 
 
 
 
 
 
 
 
 
 
 
 
 
 
 
 
 
 
 
 
 
 
 
 
 
 
 
 
 
 
 
 
 
 
 
 
 
 
 
 
 
 
 
 
 
 
 
 
 
 
 
 
 
 
 
 
 
 
 
 IGT_4688 / fi-byt-squawks
Starting subtest: read-crc-pipe-B-frame-sequence
(kms_pipe_crc_basic:2577) igt_debugfs-CRITICAL: Test assertion failure functio...
(kms_pipe_crc_basic:2577) igt_debugfs-CRITICAL: Failed assertion: !mismatch
(kms_pipe_crc_basic:2577) igt_debugfs-CRITICAL: Last errno: 9, Bad file descri...
Subtest read-crc-pipe-B-frame-sequence failed.
**** DEBUG ****
(kms_pipe_crc_basic:2577) DEBUG: Test requirement passed: !(pipe >= data->disp...
(kms_pipe_crc_basic:2577) INFO: read-crc-pipe-B-frame-sequence: Testing connec...
(kms_pipe_crc_basic:2577) igt_kms-DEBUG: display: eDP-1: set_pipe(B)
(kms_pipe_crc_basic:2577) igt_kms-DEBUG: display: eDP-1: Selecting pipe B
(kms_pipe_crc_basic:2577) DEBUG: Clearing the fb with color (0.00,1.00,0.00)
(kms_pipe_crc_basic:2577) igt_fb-DEBUG: igt_create_fb_with_bo_size(width=1366,...
(kms_pipe_crc_basic:2577) igt_fb-DEBUG: igt_create_fb_with_bo_size(handle=1, p...
(kms_pipe_crc_basic:2577) ioctl_wrappers-DEBUG: Test requirement passed: igt_h...
(kms_pipe_crc_basic:2577) igt_fb-DEBUG: Test requirement passed: cairo_surface...
(kms_pipe_crc_basic:2577) igt_kms-DEBUG: Test requirement passed: plane_idx >=...
(kms_pipe_crc_basic:2577) igt_kms-DEBUG: display: B.0: plane_set_fb(80)
...
 IGT_4687 / fi-byt-squawks
Starting subtest: read-crc-pipe-B-frame-sequence
(kms_pipe_crc_basic:2649) igt_debugfs-CRITICAL: Test assertion failure functio...
(kms_pipe_crc_basic:2649) igt_debugfs-CRITICAL: Failed assertion: !mismatch
(kms_pipe_crc_basic:2649) igt_debugfs-CRITICAL: Last errno: 9, Bad file descri...
Subtest read-crc-pipe-B-frame-sequence failed.
**** DEBUG ****
(kms_pipe_crc_basic:2649) DEBUG: Test requirement passed: !(pipe >= data->disp...
(kms_pipe_crc_basic:2649) INFO: read-crc-pipe-B-frame-sequence: Testing connec...
(kms_pipe_crc_basic:2649) igt_kms-DEBUG: display: eDP-1: set_pipe(B)
(kms_pipe_crc_basic:2649) igt_kms-DEBUG: display: eDP-1: Selecting pipe B
(kms_pipe_crc_basic:2649) DEBUG: Clearing the fb with color (0.00,1.00,0.00)
(kms_pipe_crc_basic:2649) igt_fb-DEBUG: igt_create_fb_with_bo_size(width=1366,...
(kms_pipe_crc_basic:2649) igt_fb-DEBUG: igt_create_fb_with_bo_size(handle=1, p...
(kms_pipe_crc_basic:2649) ioctl_wrappers-DEBUG: Test requirement passed: igt_h...
(kms_pipe_crc_basic:2649) igt_fb-DEBUG: Test requirement passed: cairo_surface...
(kms_pipe_crc_basic:2649) igt_kms-DEBUG: Test requirement passed: plane_idx >=...
(kms_pipe_crc_basic:2649) igt_kms-DEBUG: display: B.0: plane_set_fb(80)
...
 IGT_4686 / fi-byt-squawks
Starting subtest: read-crc-pipe-B-frame-sequence
(kms_pipe_crc_basic:2605) igt_debugfs-CRITICAL: Test assertion failure functio...
(kms_pipe_crc_basic:2605) igt_debugfs-CRITICAL: Failed assertion: !mismatch
(kms_pipe_crc_basic:2605) igt_debugfs-CRITICAL: Last errno: 9, Bad file descri...
Subtest read-crc-pipe-B-frame-sequence failed.
**** DEBUG ****
(kms_pipe_crc_basic:2605) DEBUG: Test requirement passed: !(pipe >= data->disp...
(kms_pipe_crc_basic:2605) INFO: read-crc-pipe-B-frame-sequence: Testing connec...
(kms_pipe_crc_basic:2605) igt_kms-DEBUG: display: eDP-1: set_pipe(B)
(kms_pipe_crc_basic:2605) igt_kms-DEBUG: display: eDP-1: Selecting pipe B
(kms_pipe_crc_basic:2605) DEBUG: Clearing the fb with color (0.00,1.00,0.00)
(kms_pipe_crc_basic:2605) igt_fb-DEBUG: igt_create_fb_with_bo_size(width=1366,...
(kms_pipe_crc_basic:2605) igt_fb-DEBUG: igt_create_fb_with_bo_size(handle=1, p...
(kms_pipe_crc_basic:2605) ioctl_wrappers-DEBUG: Test requirement passed: igt_h...
(kms_pipe_crc_basic:2605) igt_fb-DEBUG: Test requirement passed: cairo_surface...
(kms_pipe_crc_basic:2605) igt_kms-DEBUG: Test requirement passed: plane_idx >=...
(kms_pipe_crc_basic:2605) igt_kms-DEBUG: display: B.0: plane_set_fb(80)
...
 IGT_4685 / fi-byt-squawks
Starting subtest: read-crc-pipe-B-frame-sequence
(kms_pipe_crc_basic:2744) igt_debugfs-CRITICAL: Test assertion failure functio...
(kms_pipe_crc_basic:2744) igt_debugfs-CRITICAL: Failed assertion: !mismatch
(kms_pipe_crc_basic:2744) igt_debugfs-CRITICAL: Last errno: 9, Bad file descri...
Subtest read-crc-pipe-B-frame-sequence failed.
**** DEBUG ****
(kms_pipe_crc_basic:2744) DEBUG: Test requirement passed: !(pipe >= data->disp...
(kms_pipe_crc_basic:2744) INFO: read-crc-pipe-B-frame-sequence: Testing connec...
(kms_pipe_crc_basic:2744) igt_kms-DEBUG: display: eDP-1: set_pipe(B)
(kms_pipe_crc_basic:2744) igt_kms-DEBUG: display: eDP-1: Selecting pipe B
(kms_pipe_crc_basic:2744) DEBUG: Clearing the fb with color (0.00,1.00,0.00)
(kms_pipe_crc_basic:2744) igt_fb-DEBUG: igt_create_fb_with_bo_size(width=1366,...
(kms_pipe_crc_basic:2744) igt_fb-DEBUG: igt_create_fb_with_bo_size(handle=1, p...
(kms_pipe_crc_basic:2744) ioctl_wrappers-DEBUG: Test requirement passed: igt_h...
(kms_pipe_crc_basic:2744) igt_fb-DEBUG: Test requirement passed: cairo_surface...
(kms_pipe_crc_basic:2744) igt_kms-DEBUG: Test requirement passed: plane_idx >=...
(kms_pipe_crc_basic:2744) igt_kms-DEBUG: display: B.0: plane_set_fb(80)
...
 IGT_4684 / fi-byt-squawks
Starting subtest: read-crc-pipe-B-frame-sequence
(kms_pipe_crc_basic:2640) igt_debugfs-CRITICAL: Test assertion failure functio...
(kms_pipe_crc_basic:2640) igt_debugfs-CRITICAL: Failed assertion: !mismatch
(kms_pipe_crc_basic:2640) igt_debugfs-CRITICAL: Last errno: 9, Bad file descri...
Subtest read-crc-pipe-B-frame-sequence failed.
**** DEBUG ****
(kms_pipe_crc_basic:2640) DEBUG: Test requirement passed: !(pipe >= data->disp...
(kms_pipe_crc_basic:2640) INFO: read-crc-pipe-B-frame-sequence: Testing connec...
(kms_pipe_crc_basic:2640) igt_kms-DEBUG: display: eDP-1: set_pipe(B)
(kms_pipe_crc_basic:2640) igt_kms-DEBUG: display: eDP-1: Selecting pipe B
(kms_pipe_crc_basic:2640) DEBUG: Clearing the fb with color (0.00,1.00,0.00)
(kms_pipe_crc_basic:2640) igt_fb-DEBUG: igt_create_fb_with_bo_size(width=1366,...
(kms_pipe_crc_basic:2640) igt_fb-DEBUG: igt_create_fb_with_bo_size(handle=1, p...
(kms_pipe_crc_basic:2640) ioctl_wrappers-DEBUG: Test requirement passed: igt_h...
(kms_pipe_crc_basic:2640) igt_fb-DEBUG: Test requirement passed: cairo_surface...
(kms_pipe_crc_basic:2640) igt_kms-DEBUG: Test requirement passed: plane_idx >=...
(kms_pipe_crc_basic:2640) igt_kms-DEBUG: display: B.0: plane_set_fb(80)
...
 
 
 
 
 
 
 
 
 
 
 
 
 
 
 
 
 
 
 
 
 
 
 
 
 
 
 
 
 
 
 
 
 
 
 
 
 
 
 
 
 
 
 
 
 
 
 
 
 
 
igt@kms_pipe_crc_basic@suspend-read-crc-pipe-a
 
 
 
 
 
 
 
 
 
 
 
 
 
 
 
 
 
 
 
 
 
 
 
 
 
 
 
 
 
 
 
 
 
 
 
 
 
 
 
 
 
 
 
 
 
 
 
 
 
 
 
 
 
 
 
 
 
 
 
 
 
 
 
 
 
 
 
 
 
 
 
 
 
 
 
 
 
 
 
 
 
 
 
 
 
 
 
 
 
 
 
 
 
 
 
 
 
 
 
 
 
 
 
 
 
 
 
 
 
 
 
 
 
 
 
 
 
 
 
 
 
 
 
 
 
 
 
 
 
 
 
 
 
 
 
 
 
 
 
 
 
 
 
 
 
 
 
 
 
 
 
 
 
 
 
 
 
 
 
 
 
 
 
 
 
 
 
 
 
 
 
 
 
 
 
 
 
 
 
 
 
 
 
 
 
 IGT_4688 / fi-byt-squawks
Starting subtest: suspend-read-crc-pipe-A
(kms_pipe_crc_basic:2580) igt_debugfs-CRITICAL: Test assertion failure functio...
(kms_pipe_crc_basic:2580) igt_debugfs-CRITICAL: Failed assertion: !mismatch
(kms_pipe_crc_basic:2580) igt_debugfs-CRITICAL: Last errno: 9, Bad file descri...
Subtest suspend-read-crc-pipe-A failed.
**** DEBUG ****
(kms_pipe_crc_basic:2580) INFO: suspend-read-crc-pipe-A: Testing connector eDP...
(kms_pipe_crc_basic:2580) igt_kms-DEBUG: display: eDP-1: set_pipe(A)
(kms_pipe_crc_basic:2580) igt_kms-DEBUG: display: eDP-1: Selecting pipe A
(kms_pipe_crc_basic:2580) DEBUG: Clearing the fb with color (0.00,1.00,0.00)
(kms_pipe_crc_basic:2580) igt_fb-DEBUG: igt_create_fb_with_bo_size(width=1366,...
(kms_pipe_crc_basic:2580) igt_fb-DEBUG: igt_create_fb_with_bo_size(handle=1, p...
(kms_pipe_crc_basic:2580) ioctl_wrappers-DEBUG: Test requirement passed: igt_h...
(kms_pipe_crc_basic:2580) igt_fb-DEBUG: Test requirement passed: cairo_surface...
(kms_pipe_crc_basic:2580) igt_kms-DEBUG: Test requirement passed: plane_idx >=...
(kms_pipe_crc_basic:2580) igt_kms-DEBUG: display: A.0: plane_set_fb(80)
(kms_pipe_crc_basic:2580) igt_kms-DEBUG: display: A.0: plane_set_size (1366x768)
...
 IGT_4687 / fi-byt-squawks
Starting subtest: suspend-read-crc-pipe-A
(kms_pipe_crc_basic:2652) igt_debugfs-CRITICAL: Test assertion failure functio...
(kms_pipe_crc_basic:2652) igt_debugfs-CRITICAL: Failed assertion: !mismatch
(kms_pipe_crc_basic:2652) igt_debugfs-CRITICAL: Last errno: 9, Bad file descri...
Subtest suspend-read-crc-pipe-A failed.
**** DEBUG ****
(kms_pipe_crc_basic:2652) DEBUG: Test requirement passed: !(i >= data.display....
(kms_pipe_crc_basic:2652) DEBUG: Test requirement passed: !(pipe >= data->disp...
(kms_pipe_crc_basic:2652) INFO: suspend-read-crc-pipe-A: Testing connector eDP...
(kms_pipe_crc_basic:2652) igt_kms-DEBUG: display: eDP-1: set_pipe(A)
(kms_pipe_crc_basic:2652) igt_kms-DEBUG: display: eDP-1: Selecting pipe A
(kms_pipe_crc_basic:2652) DEBUG: Clearing the fb with color (0.00,1.00,0.00)
(kms_pipe_crc_basic:2652) igt_fb-DEBUG: igt_create_fb_with_bo_size(width=1366,...
(kms_pipe_crc_basic:2652) igt_fb-DEBUG: igt_create_fb_with_bo_size(handle=1, p...
(kms_pipe_crc_basic:2652) ioctl_wrappers-DEBUG: Test requirement passed: igt_h...
(kms_pipe_crc_basic:2652) igt_fb-DEBUG: Test requirement passed: cairo_surface...
(kms_pipe_crc_basic:2652) igt_kms-DEBUG: Test requirement passed: plane_idx >=...
...
 IGT_4686 / fi-byt-squawks
Starting subtest: suspend-read-crc-pipe-A
(kms_pipe_crc_basic:2608) igt_debugfs-CRITICAL: Test assertion failure functio...
(kms_pipe_crc_basic:2608) igt_debugfs-CRITICAL: Failed assertion: !mismatch
(kms_pipe_crc_basic:2608) igt_debugfs-CRITICAL: Last errno: 9, Bad file descri...
Subtest suspend-read-crc-pipe-A failed.
**** DEBUG ****
(kms_pipe_crc_basic:2608) DEBUG: Test requirement passed: !(i >= data.display....
(kms_pipe_crc_basic:2608) DEBUG: Test requirement passed: !(pipe >= data->disp...
(kms_pipe_crc_basic:2608) INFO: suspend-read-crc-pipe-A: Testing connector eDP...
(kms_pipe_crc_basic:2608) igt_kms-DEBUG: display: eDP-1: set_pipe(A)
(kms_pipe_crc_basic:2608) igt_kms-DEBUG: display: eDP-1: Selecting pipe A
(kms_pipe_crc_basic:2608) DEBUG: Clearing the fb with color (0.00,1.00,0.00)
(kms_pipe_crc_basic:2608) igt_fb-DEBUG: igt_create_fb_with_bo_size(width=1366,...
(kms_pipe_crc_basic:2608) igt_fb-DEBUG: igt_create_fb_with_bo_size(handle=1, p...
(kms_pipe_crc_basic:2608) ioctl_wrappers-DEBUG: Test requirement passed: igt_h...
(kms_pipe_crc_basic:2608) igt_fb-DEBUG: Test requirement passed: cairo_surface...
(kms_pipe_crc_basic:2608) igt_kms-DEBUG: Test requirement passed: plane_idx >=...
...
 IGT_4685 / fi-byt-squawks
Starting subtest: suspend-read-crc-pipe-A
(kms_pipe_crc_basic:2753) igt_debugfs-CRITICAL: Test assertion failure functio...
(kms_pipe_crc_basic:2753) igt_debugfs-CRITICAL: Failed assertion: !mismatch
(kms_pipe_crc_basic:2753) igt_debugfs-CRITICAL: Last errno: 9, Bad file descri...
Subtest suspend-read-crc-pipe-A failed.
**** DEBUG ****
(kms_pipe_crc_basic:2753) DEBUG: Test requirement passed: !(i >= data.display....
(kms_pipe_crc_basic:2753) DEBUG: Test requirement passed: !(pipe >= data->disp...
(kms_pipe_crc_basic:2753) INFO: suspend-read-crc-pipe-A: Testing connector eDP...
(kms_pipe_crc_basic:2753) igt_kms-DEBUG: display: eDP-1: set_pipe(A)
(kms_pipe_crc_basic:2753) igt_kms-DEBUG: display: eDP-1: Selecting pipe A
(kms_pipe_crc_basic:2753) DEBUG: Clearing the fb with color (0.00,1.00,0.00)
(kms_pipe_crc_basic:2753) igt_fb-DEBUG: igt_create_fb_with_bo_size(width=1366,...
(kms_pipe_crc_basic:2753) igt_fb-DEBUG: igt_create_fb_with_bo_size(handle=1, p...
(kms_pipe_crc_basic:2753) ioctl_wrappers-DEBUG: Test requirement passed: igt_h...
(kms_pipe_crc_basic:2753) igt_fb-DEBUG: Test requirement passed: cairo_surface...
(kms_pipe_crc_basic:2753) igt_kms-DEBUG: Test requirement passed: plane_idx >=...
...
 IGT_4684 / fi-byt-squawks
Starting subtest: suspend-read-crc-pipe-A
(kms_pipe_crc_basic:2643) igt_debugfs-CRITICAL: Test assertion failure functio...
(kms_pipe_crc_basic:2643) igt_debugfs-CRITICAL: Failed assertion: !mismatch
(kms_pipe_crc_basic:2643) igt_debugfs-CRITICAL: Last errno: 9, Bad file descri...
Subtest suspend-read-crc-pipe-A failed.
**** DEBUG ****
(kms_pipe_crc_basic:2643) DEBUG: Test requirement passed: !(i >= data.display....
(kms_pipe_crc_basic:2643) DEBUG: Test requirement passed: !(pipe >= data->disp...
(kms_pipe_crc_basic:2643) INFO: suspend-read-crc-pipe-A: Testing connector eDP...
(kms_pipe_crc_basic:2643) igt_kms-DEBUG: display: eDP-1: set_pipe(A)
(kms_pipe_crc_basic:2643) igt_kms-DEBUG: display: eDP-1: Selecting pipe A
(kms_pipe_crc_basic:2643) DEBUG: Clearing the fb with color (0.00,1.00,0.00)
(kms_pipe_crc_basic:2643) igt_fb-DEBUG: igt_create_fb_with_bo_size(width=1366,...
(kms_pipe_crc_basic:2643) igt_fb-DEBUG: igt_create_fb_with_bo_size(handle=1, p...
(kms_pipe_crc_basic:2643) ioctl_wrappers-DEBUG: Test requirement passed: igt_h...
(kms_pipe_crc_basic:2643) igt_fb-DEBUG: Test requirement passed: cairo_surface...
(kms_pipe_crc_basic:2643) igt_kms-DEBUG: Test requirement passed: plane_idx >=...
...
 
 
 
 
 
 
 
 
 
 
 
 
 
 
 
 
 
 
 
 
 
 IGT_4687 / fi-ctg-p8600
igt@kms_pipe_crc_basic@suspend-read-crc-pipe-a
<6> [497.647388] Console: switching to colour dummy device 80x25
<6> [497.647480] [IGT] kms_pipe_crc_basic: executing
<7> [497.674378] [drm:drm_helper_probe_single_connector_modes] [CONNECTOR:52:L...
<7> [497.674391] [drm:drm_add_edid_modes] ELD: no CEA Extension found
<7> [497.674398] [drm:drm_add_display_info] non_desktop set to 0
<7> [497.674488] [drm:drm_helper_probe_single_connector_modes] [CONNECTOR:52:L...
<7> [497.674497] [drm:drm_mode_debug_printmodeline] Modeline 55:"1280x800" 60 ...
<7> [497.674504] [drm:drm_mode_debug_printmodeline] Modeline 56:"1280x800" 50 ...
<7> [497.674538] [drm:drm_helper_probe_single_connector_modes] [CONNECTOR:59:V...
<7> [497.674650] [drm:intel_crt_detect [i915]] [CONNECTOR:59:VGA-1] force=1
<7> [497.681933] [drm:intel_crt_detect [i915]] CRT not detected via hotplug
<7> [497.682156] [drm:do_gmbus_xfer [i915]] GMBUS [i915 gmbus vga] NAK for add...
<7> [497.682236] [drm:do_gmbus_xfer [i915]] GMBUS [i915 gmbus vga] NAK on firs...
<7> [497.682466] [drm:do_gmbus_xfer [i915]] GMBUS [i915 gmbus vga] NAK for add...
<7> [497.682475] [drm:drm_do_probe_ddc_edid] drm: skipping non-existent adapte...
<7> [497.682554] [drm:intel_crt_get_edid [i915]] CRT GMBUS EDID read failed, r...
<7> [497.682634] [drm:intel_gmbus_force_bit [i915]] enabling bit-banging on i9...
...
 IGT_4686 / fi-ctg-p8600
igt@kms_pipe_crc_basic@suspend-read-crc-pipe-a
<6> [339.847889] Console: switching to colour dummy device 80x25
<6> [339.847982] [IGT] kms_pipe_crc_basic: executing
<7> [339.874910] [drm:drm_helper_probe_single_connector_modes] [CONNECTOR:52:L...
<7> [339.874919] [drm:drm_add_edid_modes] ELD: no CEA Extension found
<7> [339.874924] [drm:drm_add_display_info] non_desktop set to 0
<7> [339.874983] [drm:drm_helper_probe_single_connector_modes] [CONNECTOR:52:L...
<7> [339.874989] [drm:drm_mode_debug_printmodeline] Modeline 55:"1280x800" 60 ...
<7> [339.874994] [drm:drm_mode_debug_printmodeline] Modeline 56:"1280x800" 50 ...
<7> [339.875016] [drm:drm_helper_probe_single_connector_modes] [CONNECTOR:59:V...
<7> [339.875109] [drm:intel_crt_detect [i915]] [CONNECTOR:59:VGA-1] force=1
<7> [339.881799] [drm:intel_crt_detect [i915]] CRT not detected via hotplug
<7> [339.882036] [drm:do_gmbus_xfer [i915]] GMBUS [i915 gmbus vga] NAK for add...
<7> [339.882121] [drm:do_gmbus_xfer [i915]] GMBUS [i915 gmbus vga] NAK on firs...
<7> [339.882406] [drm:do_gmbus_xfer [i915]] GMBUS [i915 gmbus vga] NAK for add...
<7> [339.882415] [drm:drm_do_probe_ddc_edid] drm: skipping non-existent adapte...
<7> [339.882493] [drm:intel_crt_get_edid [i915]] CRT GMBUS EDID read failed, r...
<7> [339.882558] [drm:intel_gmbus_force_bit [i915]] enabling bit-banging on i9...
...
 IGT_4685 / fi-ctg-p8600
igt@kms_pipe_crc_basic@suspend-read-crc-pipe-a
<6> [392.112447] Console: switching to colour dummy device 80x25
<6> [392.112541] [IGT] kms_pipe_crc_basic: executing
<7> [392.147541] [drm:drm_helper_probe_single_connector_modes] [CONNECTOR:52:L...
<7> [392.147550] [drm:drm_add_edid_modes] ELD: no CEA Extension found
<7> [392.147555] [drm:drm_add_display_info] non_desktop set to 0
<7> [392.147616] [drm:drm_helper_probe_single_connector_modes] [CONNECTOR:52:L...
<7> [392.147622] [drm:drm_mode_debug_printmodeline] Modeline 55:"1280x800" 60 ...
<7> [392.147627] [drm:drm_mode_debug_printmodeline] Modeline 56:"1280x800" 50 ...
<7> [392.147650] [drm:drm_helper_probe_single_connector_modes] [CONNECTOR:59:V...
<7> [392.147741] [drm:intel_crt_detect [i915]] [CONNECTOR:59:VGA-1] force=1
<7> [392.157137] [drm:intel_crt_detect [i915]] CRT not detected via hotplug
<7> [392.157421] [drm:do_gmbus_xfer [i915]] GMBUS [i915 gmbus vga] NAK for add...
<7> [392.157501] [drm:do_gmbus_xfer [i915]] GMBUS [i915 gmbus vga] NAK on firs...
<7> [392.157810] [drm:do_gmbus_xfer [i915]] GMBUS [i915 gmbus vga] NAK for add...
<7> [392.157819] [drm:drm_do_probe_ddc_edid] drm: skipping non-existent adapte...
<7> [392.157898] [drm:intel_crt_get_edid [i915]] CRT GMBUS EDID read failed, r...
<7> [392.157978] [drm:intel_gmbus_force_bit [i915]] enabling bit-banging on i9...
...
 
 
 
 
 
 
 
 
 
 
 
 
 
 
 
 
 
 
 
 
 
 
 
 
 
 
igt@kms_pipe_crc_basic@suspend-read-crc-pipe-b
 
 
 
 
 
 
 
 
 
 
 
 
 
 
 
 
 
 
 
 
 
 
 
 
 
 
 
 
 
 
 
 
 
 
 
 
 
 
 
 
 
 
 
 
 
 
 
 
 
 
 
 
 
 
 
 
 
 
 
 
 
 
 
 
 
 
 
 
 
 
 
 
 
 
 
 
 
 
 
 
 
 
 
 
 
 
 
 
 
 
 
 
 
 
 
 
 
 
 
 
 
 
 
 
 
 
 
 
 
 
 
 
 
 
 
 
 
 
 
 
 
 
 
 
 
 
 
 
 
 
 
 
 
 
 
 
 
 
 
 
 
 
 
 
 
 
 
 
 
 
 
 
 
 
 
 
 
 
 
 
 
 
 
 
 
 
 
 
 
 
 
 
 
 
 
 
 
 
 
 
 
 
 
 
 
 IGT_4688 / fi-byt-squawks
Starting subtest: suspend-read-crc-pipe-B
(kms_pipe_crc_basic:2591) igt_debugfs-CRITICAL: Test assertion failure functio...
(kms_pipe_crc_basic:2591) igt_debugfs-CRITICAL: Failed assertion: !mismatch
(kms_pipe_crc_basic:2591) igt_debugfs-CRITICAL: Last errno: 9, Bad file descri...
Subtest suspend-read-crc-pipe-B failed.
**** DEBUG ****
(kms_pipe_crc_basic:2591) DEBUG: Test requirement passed: !(i >= data.display....
(kms_pipe_crc_basic:2591) DEBUG: Test requirement passed: !(pipe >= data->disp...
(kms_pipe_crc_basic:2591) INFO: suspend-read-crc-pipe-B: Testing connector eDP...
(kms_pipe_crc_basic:2591) igt_kms-DEBUG: display: eDP-1: set_pipe(B)
(kms_pipe_crc_basic:2591) igt_kms-DEBUG: display: eDP-1: Selecting pipe B
(kms_pipe_crc_basic:2591) DEBUG: Clearing the fb with color (0.00,1.00,0.00)
(kms_pipe_crc_basic:2591) igt_fb-DEBUG: igt_create_fb_with_bo_size(width=1366,...
(kms_pipe_crc_basic:2591) igt_fb-DEBUG: igt_create_fb_with_bo_size(handle=1, p...
(kms_pipe_crc_basic:2591) ioctl_wrappers-DEBUG: Test requirement passed: igt_h...
(kms_pipe_crc_basic:2591) igt_fb-DEBUG: Test requirement passed: cairo_surface...
(kms_pipe_crc_basic:2591) igt_kms-DEBUG: Test requirement passed: plane_idx >=...
...
 IGT_4687 / fi-byt-squawks
Starting subtest: suspend-read-crc-pipe-B
(kms_pipe_crc_basic:2653) igt_debugfs-CRITICAL: Test assertion failure functio...
(kms_pipe_crc_basic:2653) igt_debugfs-CRITICAL: Failed assertion: !mismatch
(kms_pipe_crc_basic:2653) igt_debugfs-CRITICAL: Last errno: 9, Bad file descri...
Subtest suspend-read-crc-pipe-B failed.
**** DEBUG ****
(kms_pipe_crc_basic:2653) DEBUG: Test requirement passed: !(i >= data.display....
(kms_pipe_crc_basic:2653) DEBUG: Test requirement passed: !(pipe >= data->disp...
(kms_pipe_crc_basic:2653) INFO: suspend-read-crc-pipe-B: Testing connector eDP...
(kms_pipe_crc_basic:2653) igt_kms-DEBUG: display: eDP-1: set_pipe(B)
(kms_pipe_crc_basic:2653) igt_kms-DEBUG: display: eDP-1: Selecting pipe B
(kms_pipe_crc_basic:2653) DEBUG: Clearing the fb with color (0.00,1.00,0.00)
(kms_pipe_crc_basic:2653) igt_fb-DEBUG: igt_create_fb_with_bo_size(width=1366,...
(kms_pipe_crc_basic:2653) igt_fb-DEBUG: igt_create_fb_with_bo_size(handle=1, p...
(kms_pipe_crc_basic:2653) ioctl_wrappers-DEBUG: Test requirement passed: igt_h...
(kms_pipe_crc_basic:2653) igt_fb-DEBUG: Test requirement passed: cairo_surface...
(kms_pipe_crc_basic:2653) igt_kms-DEBUG: Test requirement passed: plane_idx >=...
...
 IGT_4686 / fi-byt-squawks
Starting subtest: suspend-read-crc-pipe-B
(kms_pipe_crc_basic:2609) igt_debugfs-CRITICAL: Test assertion failure functio...
(kms_pipe_crc_basic:2609) igt_debugfs-CRITICAL: Failed assertion: !mismatch
(kms_pipe_crc_basic:2609) igt_debugfs-CRITICAL: Last errno: 9, Bad file descri...
Subtest suspend-read-crc-pipe-B failed.
**** DEBUG ****
(kms_pipe_crc_basic:2609) DEBUG: Test requirement passed: !(i >= data.display....
(kms_pipe_crc_basic:2609) DEBUG: Test requirement passed: !(pipe >= data->disp...
(kms_pipe_crc_basic:2609) INFO: suspend-read-crc-pipe-B: Testing connector eDP...
(kms_pipe_crc_basic:2609) igt_kms-DEBUG: display: eDP-1: set_pipe(B)
(kms_pipe_crc_basic:2609) igt_kms-DEBUG: display: eDP-1: Selecting pipe B
(kms_pipe_crc_basic:2609) DEBUG: Clearing the fb with color (0.00,1.00,0.00)
(kms_pipe_crc_basic:2609) igt_fb-DEBUG: igt_create_fb_with_bo_size(width=1366,...
(kms_pipe_crc_basic:2609) igt_fb-DEBUG: igt_create_fb_with_bo_size(handle=1, p...
(kms_pipe_crc_basic:2609) ioctl_wrappers-DEBUG: Test requirement passed: igt_h...
(kms_pipe_crc_basic:2609) igt_fb-DEBUG: Test requirement passed: cairo_surface...
(kms_pipe_crc_basic:2609) igt_kms-DEBUG: Test requirement passed: plane_idx >=...
...
 IGT_4685 / fi-byt-squawks
Starting subtest: suspend-read-crc-pipe-B
(kms_pipe_crc_basic:2754) igt_debugfs-CRITICAL: Test assertion failure functio...
(kms_pipe_crc_basic:2754) igt_debugfs-CRITICAL: Failed assertion: !mismatch
(kms_pipe_crc_basic:2754) igt_debugfs-CRITICAL: Last errno: 9, Bad file descri...
Subtest suspend-read-crc-pipe-B failed.
**** DEBUG ****
(kms_pipe_crc_basic:2754) INFO: suspend-read-crc-pipe-B: Testing connector eDP...
(kms_pipe_crc_basic:2754) igt_kms-DEBUG: display: eDP-1: set_pipe(B)
(kms_pipe_crc_basic:2754) igt_kms-DEBUG: display: eDP-1: Selecting pipe B
(kms_pipe_crc_basic:2754) DEBUG: Clearing the fb with color (0.00,1.00,0.00)
(kms_pipe_crc_basic:2754) igt_fb-DEBUG: igt_create_fb_with_bo_size(width=1366,...
(kms_pipe_crc_basic:2754) igt_fb-DEBUG: igt_create_fb_with_bo_size(handle=1, p...
(kms_pipe_crc_basic:2754) ioctl_wrappers-DEBUG: Test requirement passed: igt_h...
(kms_pipe_crc_basic:2754) igt_fb-DEBUG: Test requirement passed: cairo_surface...
(kms_pipe_crc_basic:2754) igt_kms-DEBUG: Test requirement passed: plane_idx >=...
(kms_pipe_crc_basic:2754) igt_kms-DEBUG: display: B.0: plane_set_fb(80)
(kms_pipe_crc_basic:2754) igt_kms-DEBUG: display: B.0: plane_set_size (1366x768)
...
 IGT_4684 / fi-byt-squawks
Starting subtest: suspend-read-crc-pipe-B
(kms_pipe_crc_basic:2644) igt_debugfs-CRITICAL: Test assertion failure functio...
(kms_pipe_crc_basic:2644) igt_debugfs-CRITICAL: Failed assertion: !mismatch
(kms_pipe_crc_basic:2644) igt_debugfs-CRITICAL: Last errno: 9, Bad file descri...
Subtest suspend-read-crc-pipe-B failed.
**** DEBUG ****
(kms_pipe_crc_basic:2644) DEBUG: Test requirement passed: !(i >= data.display....
(kms_pipe_crc_basic:2644) DEBUG: Test requirement passed: !(pipe >= data->disp...
(kms_pipe_crc_basic:2644) INFO: suspend-read-crc-pipe-B: Testing connector eDP...
(kms_pipe_crc_basic:2644) igt_kms-DEBUG: display: eDP-1: set_pipe(B)
(kms_pipe_crc_basic:2644) igt_kms-DEBUG: display: eDP-1: Selecting pipe B
(kms_pipe_crc_basic:2644) DEBUG: Clearing the fb with color (0.00,1.00,0.00)
(kms_pipe_crc_basic:2644) igt_fb-DEBUG: igt_create_fb_with_bo_size(width=1366,...
(kms_pipe_crc_basic:2644) igt_fb-DEBUG: igt_create_fb_with_bo_size(handle=1, p...
(kms_pipe_crc_basic:2644) ioctl_wrappers-DEBUG: Test requirement passed: igt_h...
(kms_pipe_crc_basic:2644) igt_fb-DEBUG: Test requirement passed: cairo_surface...
(kms_pipe_crc_basic:2644) igt_kms-DEBUG: Test requirement passed: plane_idx >=...
...
 
 
 
 
 
 
 
 
 
 
 
 
 
 
 
 
 
 
 
 
 IGT_4688 / fi-ctg-p8600
igt@kms_pipe_crc_basic@suspend-read-crc-pipe-b
<6> [478.474921] Console: switching to colour dummy device 80x25
<6> [478.475013] [IGT] kms_pipe_crc_basic: executing
<7> [478.504794] [drm:drm_helper_probe_single_connector_modes] [CONNECTOR:52:L...
<7> [478.504804] [drm:drm_add_edid_modes] ELD: no CEA Extension found
<7> [478.504809] [drm:drm_add_display_info] non_desktop set to 0
<7> [478.504868] [drm:drm_helper_probe_single_connector_modes] [CONNECTOR:52:L...
<7> [478.504874] [drm:drm_mode_debug_printmodeline] Modeline 55:"1280x800" 60 ...
<7> [478.504879] [drm:drm_mode_debug_printmodeline] Modeline 56:"1280x800" 50 ...
<7> [478.504902] [drm:drm_helper_probe_single_connector_modes] [CONNECTOR:59:V...
<7> [478.504994] [drm:intel_crt_detect [i915]] [CONNECTOR:59:VGA-1] force=1
<7> [478.512738] [drm:intel_crt_detect [i915]] CRT not detected via hotplug
<7> [478.513079] [drm:do_gmbus_xfer [i915]] GMBUS [i915 gmbus vga] NAK for add...
<7> [478.513165] [drm:do_gmbus_xfer [i915]] GMBUS [i915 gmbus vga] NAK on firs...
<7> [478.513448] [drm:do_gmbus_xfer [i915]] GMBUS [i915 gmbus vga] NAK for add...
<7> [478.513457] [drm:drm_do_probe_ddc_edid] drm: skipping non-existent adapte...
<7> [478.513536] [drm:intel_crt_get_edid [i915]] CRT GMBUS EDID read failed, r...
<7> [478.513671] [drm:intel_gmbus_force_bit [i915]] enabling bit-banging on i9...
...
 
 
 
 
 
 
 
 
 
 
 
 
 
 
 
 
 
 
 
 
 
 
 
 IGT_4684 / fi-blb-e6850
igt@kms_pipe_crc_basic@suspend-read-crc-pipe-b
<6> [202.431423] Console: switching to colour dummy device 80x25
<6> [202.431507] [IGT] kms_pipe_crc_basic: executing
<7> [202.436570] [drm:drm_helper_probe_single_connector_modes] [CONNECTOR:38:V...
<7> [202.436665] [drm:intel_crt_detect [i915]] [CONNECTOR:38:VGA-1] force=1
<7> [202.452419] [drm:intel_crt_detect [i915]] CRT detected via hotplug
<7> [202.452698] [drm:do_gmbus_xfer [i915]] GMBUS [i915 gmbus vga] NAK for add...
<7> [202.452762] [drm:do_gmbus_xfer [i915]] GMBUS [i915 gmbus vga] NAK on firs...
<7> [202.453193] [drm:do_gmbus_xfer [i915]] GMBUS [i915 gmbus vga] NAK for add...
<7> [202.453201] [drm:drm_do_probe_ddc_edid] drm: skipping non-existent adapte...
<7> [202.453256] [drm:intel_crt_get_edid [i915]] CRT GMBUS EDID read failed, r...
<7> [202.453311] [drm:intel_gmbus_force_bit [i915]] enabling bit-banging on i9...
<7> [202.454167] [drm:drm_do_probe_ddc_edid] drm: skipping non-existent adapte...
<7> [202.454224] [drm:intel_gmbus_force_bit [i915]] disabling bit-banging on i...
<7> [202.454332] [drm:drm_helper_probe_single_connector_modes] [CONNECTOR:38:V...
<7> [202.454339] [drm:drm_mode_debug_printmodeline] Modeline 45:"1024x768" 60 ...
<7> [202.454345] [drm:drm_mode_debug_printmodeline] Modeline 43:"800x600" 60 4...
<7> [202.454350] [drm:drm_mode_debug_printmodeline] Modeline 48:"800x600" 56 3...
...
 
 
 
 
 
igt@pm_rpm@module-reload
 
 
 
 
 
 
 
 
 
 
 
 
 
 
 
 
 
 
 
 
 
 
 
 
 
 
 
 
 
 
 
 
 
 
 
 
 
 
 
 
 
 
 
 
 
 
 
 
 IGT_4685 / fi-glk-j4005
<6> [326.821984] [IGT] pm_rpm: executing
<7> [326.942448] [drm:i915_driver_load [i915]] No PCH found.
<7> [326.942507] [drm:i915_driver_load [i915]] WOPCM size: 1024KiB
<4> [326.942511] [drm] GuC: No firmware known for this platform!
<4> [326.942517] [drm] HuC: No firmware known for this platform!
<7> [326.942634] [drm:intel_uc_init_early [i915]] enable_guc=0 (submission:no ...
<7> [326.942700] [drm:intel_uc_init_early [i915]] guc_log_level=0 (enabled:no,...
<7> [326.942766] [drm:intel_power_domains_init [i915]] Allowed DC state mask 09
<7> [326.944083] [drm:i915_ggtt_probe_hw [i915]] GGTT size = 4096M
<7> [326.944143] [drm:i915_ggtt_probe_hw [i915]] GMADR size = 256M
<7> [326.944202] [drm:i915_ggtt_probe_hw [i915]] DSM size = 64M
<6> [326.944218] [drm] Replacing VGA console driver
<7> [326.944518] [drm:i915_gem_init_stolen [i915]] GEN6_STOLEN_RESERVED = 7ff0...
<7> [326.944839] [drm:i915_gem_init_stolen [i915]] Memory reserved for graphic...
<7> [326.945960] [drm:intel_gvt_init [i915]] GVT-g is disabled by kernel params
<7> [326.946028] [drm:intel_opregion_setup [i915]] graphic opregion physical a...
<7> [326.946144] [drm:intel_opregion_setup [i915]] Public ACPI methods supported
...
 
 
 
 
 
 
 
 
 
 
 
 
 
 
 
 
 
 
 
 
 
 
 
 
 
 
 
 
 
 
 
 
 
 
 
 
 
 
 
 
 
 
 
 
 
 
 
 
 
 
 
 
 
 
 
 
 
 
 
 
 
 
 
 
 
 
 
 
 
 
 
 
 
 
 
 
 
 
 
 
 
 
 
 
 
 
 
 
 
 
 
 
 
 
 
 
 
 
 
 
 
 
 
 
 
 
 
 
 
 
 
 
 
 
 
 
 
 
 
 
 
 
 
 
 
 
 
 
 
 
 
 
 
 
 
 
 
 
 
 
 
 
 
 
 
 
 
 
 
 
 
 
 
 
 
 
 
 
 
 
 
 
 
 
 
igt@amdgpu/amd_basic@cs-compute
 
 
 
 
 
 
 
 
 
 
 
 
 IGT_4687 / fi-kbl-8809g
Starting subtest: cs-compute
(amd_basic:3928) CRITICAL: Test assertion failure function amdgpu_command_subm...
(amd_basic:3928) CRITICAL: Failed assertion: r == 0
(amd_basic:3928) CRITICAL: Last errno: 22, Invalid argument
(amd_basic:3928) CRITICAL: error: -22 != 0
Subtest cs-compute failed.
**** DEBUG ****
(amd_basic:3928) CRITICAL: Test assertion failure function amdgpu_command_subm...
(amd_basic:3928) CRITICAL: Failed assertion: r == 0
(amd_basic:3928) CRITICAL: Last errno: 22, Invalid argument
(amd_basic:3928) CRITICAL: error: -22 != 0
(amd_basic:3928) igt_core-INFO: Stack trace:
(amd_basic:3928) igt_core-INFO:   #0 ../lib/igt_core.c:1467 __igt_fail_assert()
(amd_basic:3928) igt_core-INFO:   #1 ../tests/amdgpu/amd_basic.c:724 amdgpu_co...
(amd_basic:3928) igt_core-INFO:   #2 ../tests/amdgpu/amd_basic.c:771 amdgpu_co...
(amd_basic:3928) igt_core-INFO:   #3 ../tests/amdgpu/amd_basic.c:1409 __real_m...
(amd_basic:3928) igt_core-INFO:   #4 ../tests/amdgpu/amd_basic.c:1379 main()
...
 IGT_4686 / fi-kbl-8809g
Starting subtest: cs-compute
(amd_basic:3919) CRITICAL: Test assertion failure function amdgpu_command_subm...
(amd_basic:3919) CRITICAL: Failed assertion: r == 0
(amd_basic:3919) CRITICAL: Last errno: 22, Invalid argument
(amd_basic:3919) CRITICAL: error: -22 != 0
Subtest cs-compute failed.
**** DEBUG ****
(amd_basic:3919) CRITICAL: Test assertion failure function amdgpu_command_subm...
(amd_basic:3919) CRITICAL: Failed assertion: r == 0
(amd_basic:3919) CRITICAL: Last errno: 22, Invalid argument
(amd_basic:3919) CRITICAL: error: -22 != 0
(amd_basic:3919) igt_core-INFO: Stack trace:
(amd_basic:3919) igt_core-INFO:   #0 ../lib/igt_core.c:1467 __igt_fail_assert()
(amd_basic:3919) igt_core-INFO:   #1 ../tests/amdgpu/amd_basic.c:724 amdgpu_co...
(amd_basic:3919) igt_core-INFO:   #2 ../tests/amdgpu/amd_basic.c:771 amdgpu_co...
(amd_basic:3919) igt_core-INFO:   #3 ../tests/amdgpu/amd_basic.c:1409 __real_m...
(amd_basic:3919) igt_core-INFO:   #4 ../tests/amdgpu/amd_basic.c:1379 main()
...
 IGT_4685 / fi-kbl-8809g
Starting subtest: cs-compute
(amd_basic:3899) CRITICAL: Test assertion failure function amdgpu_command_subm...
(amd_basic:3899) CRITICAL: Failed assertion: r == 0
(amd_basic:3899) CRITICAL: Last errno: 22, Invalid argument
(amd_basic:3899) CRITICAL: error: -22 != 0
Subtest cs-compute failed.
**** DEBUG ****
(amd_basic:3899) CRITICAL: Test assertion failure function amdgpu_command_subm...
(amd_basic:3899) CRITICAL: Failed assertion: r == 0
(amd_basic:3899) CRITICAL: Last errno: 22, Invalid argument
(amd_basic:3899) CRITICAL: error: -22 != 0
(amd_basic:3899) igt_core-INFO: Stack trace:
(amd_basic:3899) igt_core-INFO:   #0 ../lib/igt_core.c:1467 __igt_fail_assert()
(amd_basic:3899) igt_core-INFO:   #1 ../tests/amdgpu/amd_basic.c:724 amdgpu_co...
(amd_basic:3899) igt_core-INFO:   #2 ../tests/amdgpu/amd_basic.c:771 amdgpu_co...
(amd_basic:3899) igt_core-INFO:   #3 ../tests/amdgpu/amd_basic.c:1409 __real_m...
(amd_basic:3899) igt_core-INFO:   #4 ../tests/amdgpu/amd_basic.c:1379 main()
...
 IGT_4684 / fi-kbl-8809g
Starting subtest: cs-compute
(amd_basic:3942) CRITICAL: Test assertion failure function amdgpu_command_subm...
(amd_basic:3942) CRITICAL: Failed assertion: r == 0
(amd_basic:3942) CRITICAL: Last errno: 22, Invalid argument
(amd_basic:3942) CRITICAL: error: -22 != 0
Subtest cs-compute failed.
**** DEBUG ****
(amd_basic:3942) CRITICAL: Test assertion failure function amdgpu_command_subm...
(amd_basic:3942) CRITICAL: Failed assertion: r == 0
(amd_basic:3942) CRITICAL: Last errno: 22, Invalid argument
(amd_basic:3942) CRITICAL: error: -22 != 0
(amd_basic:3942) igt_core-INFO: Stack trace:
(amd_basic:3942) igt_core-INFO:   #0 ../lib/igt_core.c:1467 __igt_fail_assert()
(amd_basic:3942) igt_core-INFO:   #1 ../tests/amdgpu/amd_basic.c:724 amdgpu_co...
(amd_basic:3942) igt_core-INFO:   #2 ../tests/amdgpu/amd_basic.c:771 amdgpu_co...
(amd_basic:3942) igt_core-INFO:   #3 ../tests/amdgpu/amd_basic.c:1409 __real_m...
(amd_basic:3942) igt_core-INFO:   #4 ../tests/amdgpu/amd_basic.c:1379 main()
...
 
 
 
 
 
 
 
 
 
 
 
 
 
 
 
 
 
 
 
 
 
igt@amdgpu/amd_prime@amd-to-i915
 
 
 
 
 
 
 
 
 
 
 
 
 IGT_4687 / fi-kbl-8809g
Starting subtest: amd-to-i915
(amd_prime:4036) igt_vgem-CRITICAL: Test assertion failure function vgem_fence...
(amd_prime:4036) igt_vgem-CRITICAL: Failed assertion: __vgem_fence_signal(fd, ...
(amd_prime:4036) igt_vgem-CRITICAL: error: -110 != 0
Subtest amd-to-i915 failed.
**** DEBUG ****
(amd_prime:4036) drmtest-DEBUG: Test requirement passed: !(fd<0)
(amd_prime:4036) INFO: Reservation width = 4982
(amd_prime:4036) igt_vgem-CRITICAL: Test assertion failure function vgem_fence...
(amd_prime:4036) igt_vgem-CRITICAL: Failed assertion: __vgem_fence_signal(fd, ...
(amd_prime:4036) igt_vgem-CRITICAL: error: -110 != 0
(amd_prime:4036) igt_core-INFO: Stack trace:
(amd_prime:4036) igt_core-INFO:   #0 ../lib/igt_core.c:1467 __igt_fail_assert()
(amd_prime:4036) igt_core-INFO:   #1 ../lib/igt_vgem.c:194 vgem_fence_signal()
(amd_prime:4036) igt_core-INFO:   #2 ../tests/amdgpu/amd_prime.c:168 unplug()
(amd_prime:4036) igt_core-INFO:   #3 ../tests/amdgpu/amd_prime.c:381 amd_to_i9...
(amd_prime:4036) igt_core-INFO:   #4 ../tests/amdgpu/amd_prime.c:449 __real_ma...
...
 IGT_4686 / fi-kbl-8809g
Starting subtest: amd-to-i915
(amd_prime:4026) igt_vgem-CRITICAL: Test assertion failure function vgem_fence...
(amd_prime:4026) igt_vgem-CRITICAL: Failed assertion: __vgem_fence_signal(fd, ...
(amd_prime:4026) igt_vgem-CRITICAL: error: -110 != 0
Subtest amd-to-i915 failed.
**** DEBUG ****
(amd_prime:4026) drmtest-DEBUG: Test requirement passed: !(fd<0)
(amd_prime:4026) INFO: Reservation width = 4904
(amd_prime:4026) igt_vgem-CRITICAL: Test assertion failure function vgem_fence...
(amd_prime:4026) igt_vgem-CRITICAL: Failed assertion: __vgem_fence_signal(fd, ...
(amd_prime:4026) igt_vgem-CRITICAL: error: -110 != 0
(amd_prime:4026) igt_core-INFO: Stack trace:
(amd_prime:4026) igt_core-INFO:   #0 ../lib/igt_core.c:1467 __igt_fail_assert()
(amd_prime:4026) igt_core-INFO:   #1 ../lib/igt_vgem.c:194 vgem_fence_signal()
(amd_prime:4026) igt_core-INFO:   #2 ../tests/amdgpu/amd_prime.c:168 unplug()
(amd_prime:4026) igt_core-INFO:   #3 ../tests/amdgpu/amd_prime.c:381 amd_to_i9...
(amd_prime:4026) igt_core-INFO:   #4 ../tests/amdgpu/amd_prime.c:449 __real_ma...
...
 IGT_4685 / fi-kbl-8809g
Starting subtest: amd-to-i915
(amd_prime:4014) igt_vgem-CRITICAL: Test assertion failure function vgem_fence...
(amd_prime:4014) igt_vgem-CRITICAL: Failed assertion: __vgem_fence_signal(fd, ...
(amd_prime:4014) igt_vgem-CRITICAL: error: -110 != 0
Subtest amd-to-i915 failed.
**** DEBUG ****
(amd_prime:4014) drmtest-DEBUG: Test requirement passed: !(fd<0)
(amd_prime:4014) INFO: Reservation width = 4984
(amd_prime:4014) igt_vgem-CRITICAL: Test assertion failure function vgem_fence...
(amd_prime:4014) igt_vgem-CRITICAL: Failed assertion: __vgem_fence_signal(fd, ...
(amd_prime:4014) igt_vgem-CRITICAL: error: -110 != 0
(amd_prime:4014) igt_core-INFO: Stack trace:
(amd_prime:4014) igt_core-INFO:   #0 ../lib/igt_core.c:1467 __igt_fail_assert()
(amd_prime:4014) igt_core-INFO:   #1 ../lib/igt_vgem.c:194 vgem_fence_signal()
(amd_prime:4014) igt_core-INFO:   #2 ../tests/amdgpu/amd_prime.c:168 unplug()
(amd_prime:4014) igt_core-INFO:   #3 ../tests/amdgpu/amd_prime.c:381 amd_to_i9...
(amd_prime:4014) igt_core-INFO:   #4 ../tests/amdgpu/amd_prime.c:449 __real_ma...
...
 IGT_4684 / fi-kbl-8809g
Starting subtest: amd-to-i915
(amd_prime:4051) igt_vgem-CRITICAL: Test assertion failure function vgem_fence...
(amd_prime:4051) igt_vgem-CRITICAL: Failed assertion: __vgem_fence_signal(fd, ...
(amd_prime:4051) igt_vgem-CRITICAL: error: -110 != 0
Subtest amd-to-i915 failed.
**** DEBUG ****
(amd_prime:4051) drmtest-DEBUG: Test requirement passed: !(fd<0)
(amd_prime:4051) INFO: Reservation width = 4977
(amd_prime:4051) igt_vgem-CRITICAL: Test assertion failure function vgem_fence...
(amd_prime:4051) igt_vgem-CRITICAL: Failed assertion: __vgem_fence_signal(fd, ...
(amd_prime:4051) igt_vgem-CRITICAL: error: -110 != 0
(amd_prime:4051) igt_core-INFO: Stack trace:
(amd_prime:4051) igt_core-INFO:   #0 ../lib/igt_core.c:1467 __igt_fail_assert()
(amd_prime:4051) igt_core-INFO:   #1 ../lib/igt_vgem.c:194 vgem_fence_signal()
(amd_prime:4051) igt_core-INFO:   #2 ../tests/amdgpu/amd_prime.c:168 unplug()
(amd_prime:4051) igt_core-INFO:   #3 ../tests/amdgpu/amd_prime.c:381 amd_to_i9...
(amd_prime:4051) igt_core-INFO:   #4 ../tests/amdgpu/amd_prime.c:449 __real_ma...
...