Started CI_IGT_test #13534946
Started from command line by jenkins
Running as SYSTEM
Building remotely on bat-adlp-11 (KMD_BACKPORTS PATCHWORK TRYBOT WATCHDOG CIDRM) in workspace /opt/jenkins/workspace/CI_IGT_test
New run name is 'CI_DRM_15469/bat-adlp-11/0'
[CI_IGT_test] $ /bin/bash -xe /tmp/jenkins17109655014377007190.sh
+ set +x
bat-adlp-11 6.12.0-rc1-CI_DRM_15469-gfcdbbdcd11d4+
/opt/scripts/dut/deploy_igt.sh: CI_DRM_15469
IGT_DEVICE not set
IGT_8047
grep: /sys/module/i915/parameters/*: No such file or directory
cat: /sys/kernel/debug/dri/0/i915_display_info: No such file or directory
Testing --test-list /opt/jenkins/workspace/CI_IGT_test/CI_DRM_15469/bat-adlp-11/0/testlist.txt
-1000
FATAL: command execution failed
java.io.EOFException
	at java.base/java.io.ObjectInputStream$PeekInputStream.readFully(ObjectInputStream.java:2933)
	at java.base/java.io.ObjectInputStream$BlockDataInputStream.readShort(ObjectInputStream.java:3428)
	at java.base/java.io.ObjectInputStream.readStreamHeader(ObjectInputStream.java:985)
	at java.base/java.io.ObjectInputStream.<init>(ObjectInputStream.java:416)
	at hudson.remoting.ObjectInputStreamEx.<init>(ObjectInputStreamEx.java:50)
	at hudson.remoting.Command.readFrom(Command.java:142)
	at hudson.remoting.Command.readFrom(Command.java:128)
	at hudson.remoting.AbstractSynchronousByteArrayCommandTransport.read(AbstractSynchronousByteArrayCommandTransport.java:35)
	at hudson.remoting.SynchronousCommandTransport$ReaderThread.run(SynchronousCommandTransport.java:61)
Caused: java.io.IOException: Unexpected termination of the channel
	at hudson.remoting.SynchronousCommandTransport$ReaderThread.run(SynchronousCommandTransport.java:75)
Caused: java.io.IOException: Backing channel 'bat-adlp-11' is disconnected.
	at hudson.remoting.RemoteInvocationHandler.channelOrFail(RemoteInvocationHandler.java:215)
	at hudson.remoting.RemoteInvocationHandler.invoke(RemoteInvocationHandler.java:285)
	at jdk.proxy2/jdk.proxy2.$Proxy277.isAlive(Unknown Source)
	at hudson.Launcher$RemoteLauncher$ProcImpl.isAlive(Launcher.java:1212)
	at hudson.Launcher$RemoteLauncher$ProcImpl.join(Launcher.java:1204)
	at hudson.tasks.CommandInterpreter.join(CommandInterpreter.java:195)
	at hudson.tasks.CommandInterpreter.perform(CommandInterpreter.java:145)
	at hudson.tasks.CommandInterpreter.perform(CommandInterpreter.java:92)
	at hudson.tasks.BuildStepMonitor$1.perform(BuildStepMonitor.java:20)
	at hudson.model.AbstractBuild$AbstractBuildExecution.perform(AbstractBuild.java:818)
	at hudson.model.Build$BuildExecution.build(Build.java:199)
	at hudson.model.Build$BuildExecution.doRun(Build.java:164)
	at hudson.model.AbstractBuild$AbstractBuildExecution.run(AbstractBuild.java:526)
	at hudson.model.Run.execute(Run.java:1894)
	at hudson.model.FreeStyleBuild.run(FreeStyleBuild.java:44)
	at hudson.model.ResourceController.execute(ResourceController.java:101)
	at hudson.model.Executor.run(Executor.java:446)
FATAL: Unable to delete script file /tmp/jenkins17109655014377007190.sh
java.io.EOFException
	at java.base/java.io.ObjectInputStream$PeekInputStream.readFully(ObjectInputStream.java:2933)
	at java.base/java.io.ObjectInputStream$BlockDataInputStream.readShort(ObjectInputStream.java:3428)
	at java.base/java.io.ObjectInputStream.readStreamHeader(ObjectInputStream.java:985)
	at java.base/java.io.ObjectInputStream.<init>(ObjectInputStream.java:416)
	at hudson.remoting.ObjectInputStreamEx.<init>(ObjectInputStreamEx.java:50)
	at hudson.remoting.Command.readFrom(Command.java:142)
	at hudson.remoting.Command.readFrom(Command.java:128)
	at hudson.remoting.AbstractSynchronousByteArrayCommandTransport.read(AbstractSynchronousByteArrayCommandTransport.java:35)
	at hudson.remoting.SynchronousCommandTransport$ReaderThread.run(SynchronousCommandTransport.java:61)
Caused: java.io.IOException: Unexpected termination of the channel
	at hudson.remoting.SynchronousCommandTransport$ReaderThread.run(SynchronousCommandTransport.java:75)
Caused: hudson.remoting.ChannelClosedException: Channel "hudson.remoting.Channel@31202b3c:bat-adlp-11": Remote call on bat-adlp-11 failed. The channel is closing down or has closed down
	at hudson.remoting.Channel.call(Channel.java:1035)
	at hudson.FilePath.act(FilePath.java:1229)
	at hudson.FilePath.act(FilePath.java:1218)
	at hudson.FilePath.delete(FilePath.java:1765)
	at hudson.tasks.CommandInterpreter.perform(CommandInterpreter.java:163)
	at hudson.tasks.CommandInterpreter.perform(CommandInterpreter.java:92)
	at hudson.tasks.BuildStepMonitor$1.perform(BuildStepMonitor.java:20)
	at hudson.model.AbstractBuild$AbstractBuildExecution.perform(AbstractBuild.java:818)
	at hudson.model.Build$BuildExecution.build(Build.java:199)
	at hudson.model.Build$BuildExecution.doRun(Build.java:164)
	at hudson.model.AbstractBuild$AbstractBuildExecution.run(AbstractBuild.java:526)
	at hudson.model.Run.execute(Run.java:1894)
	at hudson.model.FreeStyleBuild.run(FreeStyleBuild.java:44)
	at hudson.model.ResourceController.execute(ResourceController.java:101)
	at hudson.model.Executor.run(Executor.java:446)
Build step 'Execute shell' marked build as failure
ERROR: Unable to tear down: no workspace for CI_IGT_test #13534946
hudson.AbortException: no workspace for CI_IGT_test #13534946
	at hudson.tasks.BuildStepCompatibilityLayer.perform(BuildStepCompatibilityLayer.java:77)
	at PluginClassLoader for publish-over-ssh//jenkins.plugins.publish_over_ssh.BapSshAlwaysRunPublisherPlugin.perform(BapSshAlwaysRunPublisherPlugin.java:58)
	at PluginClassLoader for publish-over-ssh//jenkins.plugins.publish_over_ssh.BapSshPostBuildWrapper$1.tearDown(BapSshPostBuildWrapper.java:67)
	at hudson.model.AbstractBuild$AbstractBuildExecution.tearDownBuildEnvironments(AbstractBuild.java:566)
	at hudson.model.AbstractBuild$AbstractBuildExecution.run(AbstractBuild.java:530)
	at hudson.model.Run.execute(Run.java:1894)
	at hudson.model.FreeStyleBuild.run(FreeStyleBuild.java:44)
	at hudson.model.ResourceController.execute(ResourceController.java:101)
	at hudson.model.Executor.run(Executor.java:446)
Finished: FAILURE
Completed CI_IGT_test CI_DRM_15469/bat-adlp-11/0 : FAILURE
CI_IGT_test runtime 400 seconds
Exit code: 2
Rebooting bat-adlp-11