FAILED DMESG-FAIL DMESG-WARN WARN PASS SKIP TIMEOUT NOT RUN SYSTEM HANG CRASH Hardware
shard-snb shard-hsw shard-apl shard-kbl
airlied_2 airlied_3 airlied_4 airlied_5 airlied_6 airlied_2 airlied_3 airlied_4 airlied_5 airlied_6 airlied_2 airlied_3 airlied_4 airlied_5 airlied_6 airlied_2 airlied_3 airlied_4 airlied_5 airlied_6
igt@debugfs_test@read_all_entries_display_off
 
 
 
 
 
 
 
 
 
 
 
 
 
 
 
 
 
 airlied_4 / shard-kbl6
[  355.887250] [drm:drm_lspcon_get_mode] *ERROR* LSPCON read(0x80, 0x41) failed
[  355.887480] [drm:lspcon_wait_mode [i915]] *ERROR* Error reading LSPCON mode
 
 
igt@drm_import_export@prime
 
 
 
 
 
 
 
 
 
 
 
 
 
 
 
 
 
 airlied_4 / shard-kbl5
[   98.724209] e1000e 0000:00:1f.6 eno1: Detected Hardware Unit Hang:
                 TDH                  <0>
                 TDT                  <2>
                 next_to_use          <2>
                 next_to_clean        <0>
               buffer_info[next_to_clean]:
                 time_stamp           <fffcd700>
                 next_to_watch        <0>
                 jiffies              <fffcedc1>
                 next_to_watch.status <0>
               MAC Status             <40000083>
               PHY Status             <796d>
               PHY 1000BASE-T Status  <3800>
               PHY Extended Status    <3000>
               PCI Status             <10>
[  100.708210] e1000e 0000:00:1f.6 eno1: Detected Hardware Unit Hang:
                 TDH                  <0>
...
 
 
igt@drv_hangman@error-state-capture-bsd1
 
 
 
 
 airlied_6 / shard-kbl7
[  122.900608] ------------[ cut here ]------------
[  122.900627] WARNING: CPU: 0 PID: 0 at net/sched/sch_generic.c:320 dev_watch...
[  122.900636] Modules linked in: vgem snd_hda_codec_hdmi snd_hda_codec_realte...
[  122.900799] CPU: 0 PID: 0 Comm: swapper/0 Tainted: G     U  W       4.14.0-...
[  122.900812] Hardware name:                  /NUC7i5BNB, BIOS BNKBL357.86A.0...
[  122.900826] task: ffffffff81e14500 task.stack: ffffffff81e00000
[  122.900852] RIP: 0010:dev_watchdog+0x21e/0x230
[  122.900866] RSP: 0018:ffff88047ec03e48 EFLAGS: 00010296
[  122.900887] RAX: 000000000000003a RBX: 0000000000000000 RCX: 0000000000000103
[  122.900900] RDX: 0000000000000103 RSI: 00000000000000f6 RDI: 00000000ffffffff
[  122.900919] RBP: ffff88046086c3e0 R08: ffffffff81e14de8 R09: 0000000000000000
[  122.900933] R10: 000000002f1e6089 R11: 0000000000000000 R12: ffff88046086c000
[  122.900965] R13: 0000000000000000 R14: 0000000000000001 R15: ffff8804662eb588
[  122.900981] FS:  0000000000000000(0000) GS:ffff88047ec00000(0000) knlGS:000...
[  122.901001] CS:  0010 DS: 0000 ES: 0000 CR0: 0000000080050033
[  122.901017] CR2: 00007fced9d2f080 CR3: 0000000003e0f005 CR4: 00000000003606f0
[  122.901031] Call Trace:
...
igt@drv_hangman@error-state-capture-render
 
 
 
 
 
 
 
 
 
 
 
 
 
 
 
 airlied_2 / shard-kbl7
[   64.758315] e1000e 0000:00:1f.6 eno1: Detected Hardware Unit Hang:
                 TDH                  <0>
                 TDT                  <17>
                 next_to_use          <17>
                 next_to_clean        <0>
               buffer_info[next_to_clean]:
                 time_stamp           <fffc5f06>
                 next_to_watch        <0>
                 jiffies              <fffc6900>
                 next_to_watch.status <0>
               MAC Status             <40000083>
               PHY Status             <14a8>
               PHY 1000BASE-T Status  <699e>
               PHY Extended Status    <8804>
               PCI Status             <10>
[   66.743429] e1000e 0000:00:1f.6 eno1: Detected Hardware Unit Hang:
                 TDH                  <0>
...
 airlied_3 / shard-kbl7
[   65.743206] e1000e 0000:00:1f.6 eno1: Detected Hardware Unit Hang:
                 TDH                  <0>
                 TDT                  <1a>
                 next_to_use          <1a>
                 next_to_clean        <0>
               buffer_info[next_to_clean]:
                 time_stamp           <fffc62fc>
                 next_to_watch        <0>
                 jiffies              <fffc6d00>
                 next_to_watch.status <0>
               MAC Status             <40000083>
               PHY Status             <f7b8>
               PHY 1000BASE-T Status  <6923>
               PHY Extended Status    <8804>
               PCI Status             <10>
[   67.726449] e1000e 0000:00:1f.6 eno1: Detected Hardware Unit Hang:
                 TDH                  <0>
...
 
 
 
igt@drv_module_reload@basic-no-display
 
 
 
 
 airlied_6 / shard-snb5
[  757.956819] ------------[ cut here ]------------
[  757.956829] WARNING: CPU: 2 PID: 5545 at drivers/gpu/drm/drm_mode_config.c:...
[  757.956839] Modules linked in: vgem snd_hda_codec_hdmi snd_hda_codec_realte...
[  757.956887] CPU: 2 PID: 5545 Comm: drv_module_relo Tainted: G     U        ...
[  757.956896] Hardware name: Dell Inc. XPS 8300  /0Y2MRG, BIOS A06 10/17/2011
[  757.956904] task: ffff8802261e8040 task.stack: ffffc90000e4c000
[  757.956911] RIP: 0010:drm_mode_config_cleanup+0x233/0x250
[  757.956917] RSP: 0018:ffffc90000e4fdf8 EFLAGS: 00010283
[  757.956924] RAX: ffff88022034d2e0 RBX: ffff880211500890 RCX: 0000000000000000
[  757.956931] RDX: ffff8802115008b8 RSI: 0000000000000000 RDI: ffff880211500890
[  757.956938] RBP: ffff880211500000 R08: 0000000000000000 R09: 0000000000000000
[  757.956946] R10: 0000000000000000 R11: ffffffff81134e95 R12: ffff8802115006a8
[  757.956953] R13: ffffffffa0543d90 R14: ffff880225863848 R15: ffffffffa0543e08
[  757.956960] FS:  00007f75ebee68c0(0000) GS:ffff88022fa80000(0000) knlGS:000...
[  757.956969] CS:  0010 DS: 0000 ES: 0000 CR0: 0000000080050033
[  757.956975] CR2: 00005569760d0be0 CR3: 0000000226200001 CR4: 00000000000606e0
[  757.956983] Call Trace:
...
 
 
 
 
 
 
 
 
 
 
 
 
 
 
 
igt@drv_module_reload@basic-reload
 
 airlied_3 / shard-snb5
[ 1486.270925] ------------[ cut here ]------------
[ 1486.270937] WARNING: CPU: 5 PID: 5154 at drivers/gpu/drm/drm_mode_config.c:...
[ 1486.270947] Modules linked in: vgem snd_hda_codec_hdmi snd_hda_codec_realte...
[ 1486.270996] CPU: 5 PID: 5154 Comm: drv_module_relo Tainted: G     U        ...
[ 1486.271006] Hardware name: Dell Inc. XPS 8300  /0Y2MRG, BIOS A06 10/17/2011
[ 1486.271013] task: ffff880222018040 task.stack: ffffc90000cf4000
[ 1486.271020] RIP: 0010:drm_mode_config_cleanup+0x250/0x270
[ 1486.271026] RSP: 0018:ffffc90000cf7d80 EFLAGS: 00010283
[ 1486.271033] RAX: ffff88022636d2e0 RBX: ffff88021c380958 RCX: 0000000000000000
[ 1486.271040] RDX: ffff88021c380980 RSI: 0000000000000000 RDI: ffff88021c380958
[ 1486.271047] RBP: ffffc90000cf7da8 R08: ffffc90000cf7f40 R09: 0000000000000000
[ 1486.271055] R10: ffffc90000cf7d00 R11: 0000000000000000 R12: ffff88021c380000
[ 1486.271062] R13: ffff88021c380748 R14: ffffffffa02bcd90 R15: ffff88022594b848
[ 1486.271069] FS:  00007f4598d178c0(0000) GS:ffff88022fb40000(0000) knlGS:000...
[ 1486.271078] CS:  0010 DS: 0000 ES: 0000 CR0: 0000000080050033
[ 1486.271084] CR2: 0000562281edca10 CR3: 00000001c4d75006 CR4: 00000000000606e0
[ 1486.271091] Call Trace:
...
 
 
 
 
 airlied_3 / shard-hsw3
[ 1712.784546] ------------[ cut here ]------------
[ 1712.784559] WARNING: CPU: 1 PID: 9895 at drivers/gpu/drm/drm_mode_config.c:...
[ 1712.784571] Modules linked in: vgem i915(-) snd_hda_codec_hdmi x86_pkg_temp...
[ 1712.784625] CPU: 1 PID: 9895 Comm: drv_module_relo Tainted: G     U  W     ...
[ 1712.784636] Hardware name: MSI MS-7924/Z97M-G43(MS-7924), BIOS V1.12 02/15/...
[ 1712.784646] task: ffff8803febfd340 task.stack: ffffc9000118c000
[ 1712.784655] RIP: 0010:drm_mode_config_cleanup+0x250/0x270
[ 1712.784662] RSP: 0018:ffffc9000118fd80 EFLAGS: 00010287
[ 1712.784670] RAX: ffff88040af8a130 RBX: ffff8804015c0958 RCX: 0000000000000000
[ 1712.784679] RDX: ffff8804015c0980 RSI: 0000000000000000 RDI: ffff8804015c0958
[ 1712.784688] RBP: ffffc9000118fda8 R08: ffffc9000118ff40 R09: 0000000000000000
[ 1712.784696] R10: ffffc9000118fd00 R11: 0000000000000000 R12: ffff8804015c0000
[ 1712.784705] R13: ffff8804015c0748 R14: ffffffffa0479d90 R15: ffff88040c848068
[ 1712.784714] FS:  00007fec57c378c0(0000) GS:ffff88041fa40000(0000) knlGS:000...
[ 1712.784724] CS:  0010 DS: 0000 ES: 0000 CR0: 0000000080050033
[ 1712.784732] CR2: 000055ff973c2cf0 CR3: 0000000403825005 CR4: 00000000001606e0
[ 1712.784740] Call Trace:
...
 
 
 
 
 
 
 
 
 
 
 
 
 
igt@drv_module_reload@basic-reload-inject
 
 
 
 
 
 airlied_2 / shard-hsw6
[  169.979853] ------------[ cut here ]------------
[  169.979863] WARNING: CPU: 0 PID: 2047 at drivers/gpu/drm/drm_mode_config.c:...
[  169.979867] Modules linked in: snd_hda_codec_hdmi i915(-) x86_pkg_temp_ther...
[  169.979943] CPU: 0 PID: 2047 Comm: drv_module_relo Tainted: G     U        ...
[  169.979947] Hardware name: MSI MS-7924/Z97M-G43(MS-7924), BIOS V1.12 02/15/...
[  169.979950] task: ffff880401425340 task.stack: ffffc90000bfc000
[  169.979955] RIP: 0010:drm_mode_config_cleanup+0x250/0x270
[  169.979959] RSP: 0018:ffffc90000bffd80 EFLAGS: 00010283
[  169.979966] RAX: ffff880406855980 RBX: ffff8803f9190958 RCX: 0000000000000001
[  169.979969] RDX: ffff8803f9190980 RSI: 0000000000000000 RDI: ffff8803f9190958
[  169.979973] RBP: ffffc90000bffda8 R08: 0000000000000000 R09: 0000000000000000
[  169.979976] R10: ffffc90000bffd00 R11: 0000000000000000 R12: ffff8803f9190000
[  169.979980] R13: ffff8803f9190748 R14: ffffffffa0305d90 R15: ffff88040c848068
[  169.979984] FS:  00007ff1875958c0(0000) GS:ffff88041fa00000(0000) knlGS:000...
[  169.979987] CS:  0010 DS: 0000 ES: 0000 CR0: 0000000080050033
[  169.979991] CR2: 000055e37e967a58 CR3: 00000003fa43c003 CR4: 00000000001606f0
[  169.979995] Call Trace:
...
 airlied_3 / shard-hsw3
[  155.781985] ------------[ cut here ]------------
[  155.781993] WARNING: CPU: 3 PID: 2067 at drivers/gpu/drm/drm_mode_config.c:...
[  155.781997] Modules linked in: snd_hda_codec_hdmi i915(-) x86_pkg_temp_ther...
[  155.782067] CPU: 3 PID: 2067 Comm: drv_module_relo Tainted: G     U        ...
[  155.782071] Hardware name: MSI MS-7924/Z97M-G43(MS-7924), BIOS V1.12 02/15/...
[  155.782074] task: ffff880402e7d340 task.stack: ffffc90000c6c000
[  155.782079] RIP: 0010:drm_mode_config_cleanup+0x250/0x270
[  155.782082] RSP: 0018:ffffc90000c6fd80 EFLAGS: 00010287
[  155.782088] RAX: ffff8804077166c0 RBX: ffff880404cc0958 RCX: 0000000000000001
[  155.782092] RDX: ffff880404cc0980 RSI: 0000000000000000 RDI: ffff880404cc0958
[  155.782095] RBP: ffffc90000c6fda8 R08: 0000000000000000 R09: 0000000000000000
[  155.782098] R10: ffffc90000c6fd00 R11: 0000000000000000 R12: ffff880404cc0000
[  155.782101] R13: ffff880404cc0748 R14: ffffffffa02f6d90 R15: ffff88040c848068
[  155.782105] FS:  00007ff47df7e8c0(0000) GS:ffff88041fac0000(0000) knlGS:000...
[  155.782108] CS:  0010 DS: 0000 ES: 0000 CR0: 0000000080050033
[  155.782111] CR2: 000055ff973c2cf0 CR3: 00000003fccd0006 CR4: 00000000001606e0
[  155.782115] Call Trace:
...
 
 
 
 
 
 
 
 
 airlied_2 / shard-kbl2
[  180.360854] ------------[ cut here ]------------
[  180.360860] WARNING: CPU: 0 PID: 1949 at drivers/gpu/drm/drm_mode_config.c:...
[  180.360863] Modules linked in: snd_hda_codec_hdmi snd_hda_codec_realtek snd...
[  180.360926] CPU: 0 PID: 1949 Comm: drv_module_relo Tainted: G     U        ...
[  180.360929] Hardware name:                  /NUC7i5BNB, BIOS BNKBL357.86A.0...
[  180.360931] task: ffff88026ac4d440 task.stack: ffffc900018b0000
[  180.360935] RIP: 0010:drm_mode_config_cleanup+0x250/0x270
[  180.360937] RSP: 0018:ffffc900018b3d80 EFLAGS: 00010283
[  180.360942] RAX: ffff88026f481de0 RBX: ffff8802693c0958 RCX: 0000000000000001
[  180.360945] RDX: ffff8802693c0980 RSI: 0000000000000000 RDI: ffff8802693c0958
[  180.360947] RBP: ffffc900018b3da8 R08: 0000000000000000 R09: 0000000000000000
[  180.360950] R10: ffffc900018b3d00 R11: 0000000000000000 R12: ffff8802693c0000
[  180.360952] R13: ffff8802693c0748 R14: ffffffffa02cfd90 R15: ffff8802745d9c58
[  180.360955] FS:  00007f8aee7bf8c0(0000) GS:ffff88027ec00000(0000) knlGS:000...
[  180.360958] CS:  0010 DS: 0000 ES: 0000 CR0: 0000000080050033
[  180.360960] CR2: 00007f2a80c31000 CR3: 0000000268f0e004 CR4: 00000000003606f0
[  180.360963] Call Trace:
...
 airlied_3 / shard-kbl5
[  184.196528] Setting dangerous option inject_load_failure - tainting kernel
[  185.271831] Setting dangerous option inject_load_failure - tainting kernel
[  185.519262] Setting dangerous option inject_load_failure - tainting kernel
[  186.880837] Setting dangerous option inject_load_failure - tainting kernel
[  187.219851] [drm:lspcon_init [i915]] *ERROR* Failed to probe lspcon
[  187.219903] [drm:intel_ddi_init [i915]] *ERROR* LSPCON init failed on port B
[  188.075572] Setting dangerous option reset - tainting kernel
 airlied_4 / shard-kbl1
[  350.057480] Setting dangerous option inject_load_failure - tainting kernel
[  351.222393] Setting dangerous option inject_load_failure - tainting kernel
[  351.479517] Setting dangerous option inject_load_failure - tainting kernel
[  351.764680] Setting dangerous option inject_load_failure - tainting kernel
[  352.679256] [drm:drm_lspcon_get_mode] *ERROR* LSPCON read(0x80, 0x41) failed
[  352.679391] [drm:lspcon_wait_mode [i915]] *ERROR* Error reading LSPCON mode
[  353.051617] Setting dangerous option reset - tainting kernel
 airlied_5 / shard-kbl1
[  312.477241] Setting dangerous option inject_load_failure - tainting kernel
[  313.648257] Setting dangerous option inject_load_failure - tainting kernel
[  313.968294] Setting dangerous option inject_load_failure - tainting kernel
[  314.257872] Setting dangerous option inject_load_failure - tainting kernel
[  315.675774] [drm:lspcon_init [i915]] *ERROR* Failed to probe lspcon
[  315.675819] [drm:intel_ddi_init [i915]] *ERROR* LSPCON init failed on port B
[  316.389718] Setting dangerous option reset - tainting kernel
 
igt@drv_selftest@mock_evict
 
 
 
 
 airlied_6 / shard-snb6
igt@drv_selftest@mock_evict
 
 
 
 
 airlied_6 / shard-hsw7
igt@drv_selftest@mock_evict
 
 
 
 
 airlied_6 / shard-apl3
igt@drv_selftest@mock_evict
 
 
 
 
 airlied_6 / shard-kbl2
igt@drv_selftest@mock_evict
igt@drv_suspend@debugfs-reader-hibernate
 airlied_2 / shard-snb4
(drv_suspend:2990) igt-core-WARNING: [cmd] rtcwake: write error[cmd] 
(drv_suspend:2990) igt-aux-CRITICAL: Test assertion failure function suspend_v...
(drv_suspend:2990) igt-aux-CRITICAL: Failed assertion: ret == 0
(drv_suspend:2990) igt-aux-CRITICAL: rtcwake failed with 1
Check dmesg for further details.
Subtest debugfs-reader-hibernate failed.
**** DEBUG ****
(drv_suspend:2990) igt-core-DEBUG: Test requirement passed: !igt_run_in_simula...
(drv_suspend:2990) igt-aux-DEBUG: Test requirement passed: (power_dir = open("...
(drv_suspend:2990) igt-aux-DEBUG: Test requirement passed: get_supported_suspe...
(drv_suspend:2990) igt-aux-DEBUG: Test requirement passed: test == SUSPEND_TES...
(drv_suspend:2990) igt-aux-DEBUG: Test requirement passed: ret == 0
(drv_suspend:2990) igt-core-INFO: [cmd] rtcwake: wakeup from "disk" using /dev...
(drv_suspend:2990) igt-core-WARNING: [cmd] rtcwake: write error[cmd] 
(drv_suspend:2990) igt-aux-CRITICAL: Test assertion failure function suspend_v...
(drv_suspend:2990) igt-aux-CRITICAL: Failed assertion: ret == 0
(drv_suspend:2990) igt-aux-CRITICAL: rtcwake failed with 1
...
 airlied_3 / shard-snb3
(drv_suspend:2965) igt-core-WARNING: [cmd] rtcwake: write error
(drv_suspend:2965) igt-aux-CRITICAL: Test assertion failure function suspend_v...
(drv_suspend:2965) igt-aux-CRITICAL: Failed assertion: ret == 0
(drv_suspend:2965) igt-aux-CRITICAL: rtcwake failed with 1
Check dmesg for further details.
Subtest debugfs-reader-hibernate failed.
**** DEBUG ****
(drv_suspend:2965) igt-core-DEBUG: Test requirement passed: !igt_run_in_simula...
(drv_suspend:2965) igt-aux-DEBUG: Test requirement passed: (power_dir = open("...
(drv_suspend:2965) igt-aux-DEBUG: Test requirement passed: get_supported_suspe...
(drv_suspend:2965) igt-aux-DEBUG: Test requirement passed: test == SUSPEND_TES...
(drv_suspend:2965) igt-aux-DEBUG: Test requirement passed: ret == 0
(drv_suspend:2965) igt-core-INFO: [cmd] rtcwake: wakeup from "disk" using /dev...
(drv_suspend:2965) igt-core-WARNING: [cmd] rtcwake: write error
(drv_suspend:2965) igt-aux-CRITICAL: Test assertion failure function suspend_v...
(drv_suspend:2965) igt-aux-CRITICAL: Failed assertion: ret == 0
(drv_suspend:2965) igt-aux-CRITICAL: rtcwake failed with 1
...
 airlied_4 / shard-snb5
(drv_suspend:5429) igt-core-WARNING: [cmd] rtcwake: write error
(drv_suspend:5429) igt-aux-CRITICAL: Test assertion failure function suspend_v...
(drv_suspend:5429) igt-aux-CRITICAL: Failed assertion: ret == 0
(drv_suspend:5429) igt-aux-CRITICAL: rtcwake failed with 1
Check dmesg for further details.
Subtest debugfs-reader-hibernate failed.
**** DEBUG ****
(drv_suspend:5429) igt-core-DEBUG: Test requirement passed: !igt_run_in_simula...
(drv_suspend:5429) igt-aux-DEBUG: Test requirement passed: (power_dir = open("...
(drv_suspend:5429) igt-aux-DEBUG: Test requirement passed: get_supported_suspe...
(drv_suspend:5429) igt-aux-DEBUG: Test requirement passed: test == SUSPEND_TES...
(drv_suspend:5429) igt-aux-DEBUG: Test requirement passed: ret == 0
(drv_suspend:5429) igt-core-INFO: [cmd] rtcwake: wakeup from "disk" using /dev...
(drv_suspend:5429) igt-core-WARNING: [cmd] rtcwake: write error
(drv_suspend:5429) igt-aux-CRITICAL: Test assertion failure function suspend_v...
(drv_suspend:5429) igt-aux-CRITICAL: Failed assertion: ret == 0
(drv_suspend:5429) igt-aux-CRITICAL: rtcwake failed with 1
...
 airlied_5 / shard-snb2
(drv_suspend:7065) igt-core-WARNING: [cmd] rtcwake: write error
(drv_suspend:7065) igt-aux-CRITICAL: Test assertion failure function suspend_v...
(drv_suspend:7065) igt-aux-CRITICAL: Failed assertion: ret == 0
(drv_suspend:7065) igt-aux-CRITICAL: rtcwake failed with 1
Check dmesg for further details.
Subtest debugfs-reader-hibernate failed.
**** DEBUG ****
(drv_suspend:7065) igt-core-DEBUG: Test requirement passed: !igt_run_in_simula...
(drv_suspend:7065) igt-aux-DEBUG: Test requirement passed: (power_dir = open("...
(drv_suspend:7065) igt-aux-DEBUG: Test requirement passed: get_supported_suspe...
(drv_suspend:7065) igt-aux-DEBUG: Test requirement passed: test == SUSPEND_TES...
(drv_suspend:7065) igt-aux-DEBUG: Test requirement passed: ret == 0
(drv_suspend:7065) igt-core-INFO: [cmd] rtcwake: wakeup from "disk" using /dev...
(drv_suspend:7065) igt-core-WARNING: [cmd] rtcwake: write error
(drv_suspend:7065) igt-aux-CRITICAL: Test assertion failure function suspend_v...
(drv_suspend:7065) igt-aux-CRITICAL: Failed assertion: ret == 0
(drv_suspend:7065) igt-aux-CRITICAL: rtcwake failed with 1
...
 airlied_6 / shard-snb6
(drv_suspend:7535) igt-core-WARNING: [cmd] rtcwake: write error
(drv_suspend:7535) igt-aux-WARNING: rtcwake failed with 1
Check dmesg for further details.
(drv_suspend:7535) igt-aux-CRITICAL: Test assertion failure function suspend_v...
(drv_suspend:7535) igt-aux-CRITICAL: Failed assertion: ret == 0
(drv_suspend:7535) igt-aux-CRITICAL: error: 1 != 0
Subtest debugfs-reader-hibernate failed.
**** DEBUG ****
(drv_suspend:7535) igt-core-DEBUG: Test requirement passed: !igt_run_in_simula...
(drv_suspend:7535) igt-aux-DEBUG: Test requirement passed: (power_dir = open("...
(drv_suspend:7535) igt-aux-DEBUG: Test requirement passed: get_supported_suspe...
(drv_suspend:7535) igt-aux-DEBUG: Test requirement passed: test == SUSPEND_TES...
(drv_suspend:7535) igt-aux-DEBUG: Test requirement passed: ret == 0
(drv_suspend:7535) igt-core-INFO: [cmd] rtcwake: wakeup from "disk" using /dev...
(drv_suspend:7535) igt-core-WARNING: [cmd] rtcwake: write error
(drv_suspend:7535) igt-aux-WARNING: rtcwake failed with 1
Check dmesg for further details.
...
 airlied_2 / shard-hsw4
(drv_suspend:4410) igt-core-WARNING: [cmd] rtcwake: write error
(drv_suspend:4410) igt-aux-CRITICAL: Test assertion failure function suspend_v...
(drv_suspend:4410) igt-aux-CRITICAL: Failed assertion: ret == 0
(drv_suspend:4410) igt-aux-CRITICAL: rtcwake failed with 1
Check dmesg for further details.
Subtest debugfs-reader-hibernate failed.
**** DEBUG ****
(drv_suspend:4410) igt-core-DEBUG: Test requirement passed: !igt_run_in_simula...
(drv_suspend:4410) igt-aux-DEBUG: Test requirement passed: (power_dir = open("...
(drv_suspend:4410) igt-aux-DEBUG: Test requirement passed: get_supported_suspe...
(drv_suspend:4410) igt-aux-DEBUG: Test requirement passed: test == SUSPEND_TES...
(drv_suspend:4410) igt-aux-DEBUG: Test requirement passed: ret == 0
(drv_suspend:4410) igt-core-INFO: [cmd] rtcwake: wakeup from "disk" using /dev...
(drv_suspend:4410) igt-core-WARNING: [cmd] rtcwake: write error
(drv_suspend:4410) igt-aux-CRITICAL: Test assertion failure function suspend_v...
(drv_suspend:4410) igt-aux-CRITICAL: Failed assertion: ret == 0
(drv_suspend:4410) igt-aux-CRITICAL: rtcwake failed with 1
...
 airlied_3 / shard-hsw5
(drv_suspend:4413) igt-core-WARNING: [cmd] rtcwake: write error[cmd] 
(drv_suspend:4413) igt-aux-CRITICAL: Test assertion failure function suspend_v...
(drv_suspend:4413) igt-aux-CRITICAL: Failed assertion: ret == 0
(drv_suspend:4413) igt-aux-CRITICAL: rtcwake failed with 1
Check dmesg for further details.
Subtest debugfs-reader-hibernate failed.
**** DEBUG ****
(drv_suspend:4413) igt-core-DEBUG: Test requirement passed: !igt_run_in_simula...
(drv_suspend:4413) igt-aux-DEBUG: Test requirement passed: (power_dir = open("...
(drv_suspend:4413) igt-aux-DEBUG: Test requirement passed: get_supported_suspe...
(drv_suspend:4413) igt-aux-DEBUG: Test requirement passed: test == SUSPEND_TES...
(drv_suspend:4413) igt-aux-DEBUG: Test requirement passed: ret == 0
(drv_suspend:4413) igt-core-INFO: [cmd] rtcwake: wakeup from "disk" using /dev...
(drv_suspend:4413) igt-core-WARNING: [cmd] rtcwake: write error[cmd] 
(drv_suspend:4413) igt-aux-CRITICAL: Test assertion failure function suspend_v...
(drv_suspend:4413) igt-aux-CRITICAL: Failed assertion: ret == 0
(drv_suspend:4413) igt-aux-CRITICAL: rtcwake failed with 1
...
 airlied_4 / shard-hsw5
(drv_suspend:6648) igt-core-WARNING: [cmd] rtcwake: write error
(drv_suspend:6648) igt-aux-CRITICAL: Test assertion failure function suspend_v...
(drv_suspend:6648) igt-aux-CRITICAL: Failed assertion: ret == 0
(drv_suspend:6648) igt-aux-CRITICAL: rtcwake failed with 1
Check dmesg for further details.
Subtest debugfs-reader-hibernate failed.
**** DEBUG ****
(drv_suspend:6648) igt-core-DEBUG: Test requirement passed: !igt_run_in_simula...
(drv_suspend:6648) igt-aux-DEBUG: Test requirement passed: (power_dir = open("...
(drv_suspend:6648) igt-aux-DEBUG: Test requirement passed: get_supported_suspe...
(drv_suspend:6648) igt-aux-DEBUG: Test requirement passed: test == SUSPEND_TES...
(drv_suspend:6648) igt-aux-DEBUG: Test requirement passed: ret == 0
(drv_suspend:6648) igt-core-INFO: [cmd] rtcwake: wakeup from "disk" using /dev...
(drv_suspend:6648) igt-core-WARNING: [cmd] rtcwake: write error
(drv_suspend:6648) igt-aux-CRITICAL: Test assertion failure function suspend_v...
(drv_suspend:6648) igt-aux-CRITICAL: Failed assertion: ret == 0
(drv_suspend:6648) igt-aux-CRITICAL: rtcwake failed with 1
...
 airlied_5 / shard-hsw5
(drv_suspend:6200) igt-core-WARNING: [cmd] rtcwake: write error[cmd] 
(drv_suspend:6200) igt-aux-CRITICAL: Test assertion failure function suspend_v...
(drv_suspend:6200) igt-aux-CRITICAL: Failed assertion: ret == 0
(drv_suspend:6200) igt-aux-CRITICAL: rtcwake failed with 1
Check dmesg for further details.
Subtest debugfs-reader-hibernate failed.
**** DEBUG ****
(drv_suspend:6200) igt-core-DEBUG: Test requirement passed: !igt_run_in_simula...
(drv_suspend:6200) igt-aux-DEBUG: Test requirement passed: (power_dir = open("...
(drv_suspend:6200) igt-aux-DEBUG: Test requirement passed: get_supported_suspe...
(drv_suspend:6200) igt-aux-DEBUG: Test requirement passed: test == SUSPEND_TES...
(drv_suspend:6200) igt-aux-DEBUG: Test requirement passed: ret == 0
(drv_suspend:6200) igt-core-INFO: [cmd] rtcwake: wakeup from "disk" using /dev...
(drv_suspend:6200) igt-core-WARNING: [cmd] rtcwake: write error[cmd] 
(drv_suspend:6200) igt-aux-CRITICAL: Test assertion failure function suspend_v...
(drv_suspend:6200) igt-aux-CRITICAL: Failed assertion: ret == 0
(drv_suspend:6200) igt-aux-CRITICAL: rtcwake failed with 1
...
 airlied_6 / shard-hsw5
(drv_suspend:11517) igt-core-WARNING: [cmd] rtcwake: write error
(drv_suspend:11517) igt-aux-WARNING: rtcwake failed with 1
Check dmesg for further details.
(drv_suspend:11517) igt-aux-CRITICAL: Test assertion failure function suspend_...
(drv_suspend:11517) igt-aux-CRITICAL: Failed assertion: ret == 0
(drv_suspend:11517) igt-aux-CRITICAL: error: 1 != 0
Subtest debugfs-reader-hibernate failed.
**** DEBUG ****
(drv_suspend:11517) igt-core-DEBUG: Test requirement passed: !igt_run_in_simul...
(drv_suspend:11517) igt-aux-DEBUG: Test requirement passed: (power_dir = open(...
(drv_suspend:11517) igt-aux-DEBUG: Test requirement passed: get_supported_susp...
(drv_suspend:11517) igt-aux-DEBUG: Test requirement passed: test == SUSPEND_TE...
(drv_suspend:11517) igt-aux-DEBUG: Test requirement passed: ret == 0
(drv_suspend:11517) igt-core-INFO: [cmd] rtcwake: wakeup from "disk" using /de...
(drv_suspend:11517) igt-core-WARNING: [cmd] rtcwake: write error
(drv_suspend:11517) igt-aux-WARNING: rtcwake failed with 1
Check dmesg for further details.
...
 airlied_2 / shard-apl4
(drv_suspend:4310) igt-core-WARNING: [cmd] rtcwake: write error
(drv_suspend:4310) igt-aux-CRITICAL: Test assertion failure function suspend_v...
(drv_suspend:4310) igt-aux-CRITICAL: Failed assertion: ret == 0
(drv_suspend:4310) igt-aux-CRITICAL: rtcwake failed with 1
Check dmesg for further details.
Subtest debugfs-reader-hibernate failed.
**** DEBUG ****
(drv_suspend:4310) igt-core-DEBUG: Test requirement passed: !igt_run_in_simula...
(drv_suspend:4310) igt-aux-DEBUG: Test requirement passed: (power_dir = open("...
(drv_suspend:4310) igt-aux-DEBUG: Test requirement passed: get_supported_suspe...
(drv_suspend:4310) igt-aux-DEBUG: Test requirement passed: test == SUSPEND_TES...
(drv_suspend:4310) igt-aux-DEBUG: Test requirement passed: ret == 0
(drv_suspend:4310) igt-core-INFO: [cmd] rtcwake: wakeup from "disk" using /dev...
(drv_suspend:4310) igt-core-WARNING: [cmd] rtcwake: write error
(drv_suspend:4310) igt-aux-CRITICAL: Test assertion failure function suspend_v...
(drv_suspend:4310) igt-aux-CRITICAL: Failed assertion: ret == 0
(drv_suspend:4310) igt-aux-CRITICAL: rtcwake failed with 1
...
 airlied_3 / shard-apl4
(drv_suspend:3853) igt-core-WARNING: [cmd] rtcwake: write error
(drv_suspend:3853) igt-aux-CRITICAL: Test assertion failure function suspend_v...
(drv_suspend:3853) igt-aux-CRITICAL: Failed assertion: ret == 0
(drv_suspend:3853) igt-aux-CRITICAL: rtcwake failed with 1
Check dmesg for further details.
Subtest debugfs-reader-hibernate failed.
**** DEBUG ****
(drv_suspend:3853) igt-core-DEBUG: Test requirement passed: !igt_run_in_simula...
(drv_suspend:3853) igt-aux-DEBUG: Test requirement passed: (power_dir = open("...
(drv_suspend:3853) igt-aux-DEBUG: Test requirement passed: get_supported_suspe...
(drv_suspend:3853) igt-aux-DEBUG: Test requirement passed: test == SUSPEND_TES...
(drv_suspend:3853) igt-aux-DEBUG: Test requirement passed: ret == 0
(drv_suspend:3853) igt-core-INFO: [cmd] rtcwake: wakeup from "disk" using /dev...
(drv_suspend:3853) igt-core-WARNING: [cmd] rtcwake: write error
(drv_suspend:3853) igt-aux-CRITICAL: Test assertion failure function suspend_v...
(drv_suspend:3853) igt-aux-CRITICAL: Failed assertion: ret == 0
(drv_suspend:3853) igt-aux-CRITICAL: rtcwake failed with 1
...
 airlied_4 / shard-apl5
(drv_suspend:8157) igt-core-WARNING: [cmd] rtcwake: [cmd] write error
(drv_suspend:8157) igt-aux-CRITICAL: Test assertion failure function suspend_v...
(drv_suspend:8157) igt-aux-CRITICAL: Failed assertion: ret == 0
(drv_suspend:8157) igt-aux-CRITICAL: rtcwake failed with 1
Check dmesg for further details.
Subtest debugfs-reader-hibernate failed.
**** DEBUG ****
(drv_suspend:8157) igt-core-DEBUG: Test requirement passed: !igt_run_in_simula...
(drv_suspend:8157) igt-aux-DEBUG: Test requirement passed: (power_dir = open("...
(drv_suspend:8157) igt-aux-DEBUG: Test requirement passed: get_supported_suspe...
(drv_suspend:8157) igt-aux-DEBUG: Test requirement passed: test == SUSPEND_TES...
(drv_suspend:8157) igt-aux-DEBUG: Test requirement passed: ret == 0
(drv_suspend:8157) igt-core-INFO: [cmd] rtcwake: wakeup from "disk" using /dev...
(drv_suspend:8157) igt-core-WARNING: [cmd] rtcwake: [cmd] write error
(drv_suspend:8157) igt-aux-CRITICAL: Test assertion failure function suspend_v...
(drv_suspend:8157) igt-aux-CRITICAL: Failed assertion: ret == 0
(drv_suspend:8157) igt-aux-CRITICAL: rtcwake failed with 1
...
 airlied_5 / shard-apl6
(drv_suspend:6088) igt-core-WARNING: [cmd] rtcwake: write error
(drv_suspend:6088) igt-aux-CRITICAL: Test assertion failure function suspend_v...
(drv_suspend:6088) igt-aux-CRITICAL: Failed assertion: ret == 0
(drv_suspend:6088) igt-aux-CRITICAL: rtcwake failed with 1
Check dmesg for further details.
Subtest debugfs-reader-hibernate failed.
**** DEBUG ****
(drv_suspend:6088) igt-core-DEBUG: Test requirement passed: !igt_run_in_simula...
(drv_suspend:6088) igt-aux-DEBUG: Test requirement passed: (power_dir = open("...
(drv_suspend:6088) igt-aux-DEBUG: Test requirement passed: get_supported_suspe...
(drv_suspend:6088) igt-aux-DEBUG: Test requirement passed: test == SUSPEND_TES...
(drv_suspend:6088) igt-aux-DEBUG: Test requirement passed: ret == 0
(drv_suspend:6088) igt-core-INFO: [cmd] rtcwake: wakeup from "disk" using /dev...
(drv_suspend:6088) igt-core-WARNING: [cmd] rtcwake: write error
(drv_suspend:6088) igt-aux-CRITICAL: Test assertion failure function suspend_v...
(drv_suspend:6088) igt-aux-CRITICAL: Failed assertion: ret == 0
(drv_suspend:6088) igt-aux-CRITICAL: rtcwake failed with 1
...
 airlied_6 / shard-apl2
(drv_suspend:10765) igt-core-WARNING: [cmd] rtcwake: write error
(drv_suspend:10765) igt-aux-WARNING: rtcwake failed with 1
Check dmesg for further details.
(drv_suspend:10765) igt-aux-CRITICAL: Test assertion failure function suspend_...
(drv_suspend:10765) igt-aux-CRITICAL: Failed assertion: ret == 0
(drv_suspend:10765) igt-aux-CRITICAL: error: 1 != 0
Subtest debugfs-reader-hibernate failed.
**** DEBUG ****
(drv_suspend:10765) igt-core-DEBUG: Test requirement passed: !igt_run_in_simul...
(drv_suspend:10765) igt-aux-DEBUG: Test requirement passed: (power_dir = open(...
(drv_suspend:10765) igt-aux-DEBUG: Test requirement passed: get_supported_susp...
(drv_suspend:10765) igt-aux-DEBUG: Test requirement passed: test == SUSPEND_TE...
(drv_suspend:10765) igt-aux-DEBUG: Test requirement passed: ret == 0
(drv_suspend:10765) igt-core-INFO: [cmd] rtcwake: wakeup from "disk" using /de...
(drv_suspend:10765) igt-core-WARNING: [cmd] rtcwake: write error
(drv_suspend:10765) igt-aux-WARNING: rtcwake failed with 1
Check dmesg for further details.
...
 airlied_2 / shard-kbl7
(drv_suspend:2539) igt-core-WARNING: [cmd] rtcwake: write error
(drv_suspend:2539) igt-aux-CRITICAL: Test assertion failure function suspend_v...
(drv_suspend:2539) igt-aux-CRITICAL: Failed assertion: ret == 0
(drv_suspend:2539) igt-aux-CRITICAL: rtcwake failed with 1
Check dmesg for further details.
Subtest debugfs-reader-hibernate failed.
**** DEBUG ****
(drv_suspend:2539) igt-core-DEBUG: Test requirement passed: !igt_run_in_simula...
(drv_suspend:2539) igt-aux-DEBUG: Test requirement passed: (power_dir = open("...
(drv_suspend:2539) igt-aux-DEBUG: Test requirement passed: get_supported_suspe...
(drv_suspend:2539) igt-aux-DEBUG: Test requirement passed: test == SUSPEND_TES...
(drv_suspend:2539) igt-aux-DEBUG: Test requirement passed: ret == 0
(drv_suspend:2539) igt-core-INFO: [cmd] rtcwake: wakeup from "disk" using /dev...
(drv_suspend:2539) igt-core-WARNING: [cmd] rtcwake: write error
(drv_suspend:2539) igt-aux-CRITICAL: Test assertion failure function suspend_v...
(drv_suspend:2539) igt-aux-CRITICAL: Failed assertion: ret == 0
(drv_suspend:2539) igt-aux-CRITICAL: rtcwake failed with 1
...
 airlied_3 / shard-kbl7
(drv_suspend:2559) igt-core-WARNING: [cmd] rtcwake: write error
(drv_suspend:2559) igt-aux-CRITICAL: Test assertion failure function suspend_v...
(drv_suspend:2559) igt-aux-CRITICAL: Failed assertion: ret == 0
(drv_suspend:2559) igt-aux-CRITICAL: rtcwake failed with 1
Check dmesg for further details.
Subtest debugfs-reader-hibernate failed.
**** DEBUG ****
(drv_suspend:2559) igt-core-DEBUG: Test requirement passed: !igt_run_in_simula...
(drv_suspend:2559) igt-aux-DEBUG: Test requirement passed: (power_dir = open("...
(drv_suspend:2559) igt-aux-DEBUG: Test requirement passed: get_supported_suspe...
(drv_suspend:2559) igt-aux-DEBUG: Test requirement passed: test == SUSPEND_TES...
(drv_suspend:2559) igt-aux-DEBUG: Test requirement passed: ret == 0
(drv_suspend:2559) igt-core-INFO: [cmd] rtcwake: wakeup from "disk" using /dev...
(drv_suspend:2559) igt-core-WARNING: [cmd] rtcwake: write error
(drv_suspend:2559) igt-aux-CRITICAL: Test assertion failure function suspend_v...
(drv_suspend:2559) igt-aux-CRITICAL: Failed assertion: ret == 0
(drv_suspend:2559) igt-aux-CRITICAL: rtcwake failed with 1
...
 airlied_4 / shard-kbl4
(drv_suspend:1880) igt-core-WARNING: [cmd] rtcwake: write error
(drv_suspend:1880) igt-aux-CRITICAL: Test assertion failure function suspend_v...
(drv_suspend:1880) igt-aux-CRITICAL: Failed assertion: ret == 0
(drv_suspend:1880) igt-aux-CRITICAL: rtcwake failed with 1
Check dmesg for further details.
Subtest debugfs-reader-hibernate failed.
**** DEBUG ****
(drv_suspend:1880) igt-core-DEBUG: Test requirement passed: !igt_run_in_simula...
(drv_suspend:1880) igt-aux-DEBUG: Test requirement passed: (power_dir = open("...
(drv_suspend:1880) igt-aux-DEBUG: Test requirement passed: get_supported_suspe...
(drv_suspend:1880) igt-aux-DEBUG: Test requirement passed: test == SUSPEND_TES...
(drv_suspend:1880) igt-aux-DEBUG: Test requirement passed: ret == 0
(drv_suspend:1880) igt-core-INFO: [cmd] rtcwake: wakeup from "disk" using /dev...
(drv_suspend:1880) igt-core-WARNING: [cmd] rtcwake: write error
(drv_suspend:1880) igt-aux-CRITICAL: Test assertion failure function suspend_v...
(drv_suspend:1880) igt-aux-CRITICAL: Failed assertion: ret == 0
(drv_suspend:1880) igt-aux-CRITICAL: rtcwake failed with 1
...
 airlied_5 / shard-kbl7
(drv_suspend:2043) igt-core-WARNING: [cmd] rtcwake: write error
(drv_suspend:2043) igt-aux-CRITICAL: Test assertion failure function suspend_v...
(drv_suspend:2043) igt-aux-CRITICAL: Failed assertion: ret == 0
(drv_suspend:2043) igt-aux-CRITICAL: rtcwake failed with 1
Check dmesg for further details.
Subtest debugfs-reader-hibernate failed.
**** DEBUG ****
(drv_suspend:2043) igt-core-DEBUG: Test requirement passed: !igt_run_in_simula...
(drv_suspend:2043) igt-aux-DEBUG: Test requirement passed: (power_dir = open("...
(drv_suspend:2043) igt-aux-DEBUG: Test requirement passed: get_supported_suspe...
(drv_suspend:2043) igt-aux-DEBUG: Test requirement passed: test == SUSPEND_TES...
(drv_suspend:2043) igt-aux-DEBUG: Test requirement passed: ret == 0
(drv_suspend:2043) igt-core-INFO: [cmd] rtcwake: wakeup from "disk" using /dev...
(drv_suspend:2043) igt-core-WARNING: [cmd] rtcwake: write error
(drv_suspend:2043) igt-aux-CRITICAL: Test assertion failure function suspend_v...
(drv_suspend:2043) igt-aux-CRITICAL: Failed assertion: ret == 0
(drv_suspend:2043) igt-aux-CRITICAL: rtcwake failed with 1
...
 airlied_6 / shard-kbl2
(drv_suspend:2600) igt-core-WARNING: [cmd] rtcwake: write error
(drv_suspend:2600) igt-aux-WARNING: rtcwake failed with 1
Check dmesg for further details.
(drv_suspend:2600) igt-aux-CRITICAL: Test assertion failure function suspend_v...
(drv_suspend:2600) igt-aux-CRITICAL: Failed assertion: ret == 0
(drv_suspend:2600) igt-aux-CRITICAL: error: 1 != 0
Subtest debugfs-reader-hibernate failed.
**** DEBUG ****
(drv_suspend:2600) igt-core-DEBUG: Test requirement passed: !igt_run_in_simula...
(drv_suspend:2600) igt-aux-DEBUG: Test requirement passed: (power_dir = open("...
(drv_suspend:2600) igt-aux-DEBUG: Test requirement passed: get_supported_suspe...
(drv_suspend:2600) igt-aux-DEBUG: Test requirement passed: test == SUSPEND_TES...
(drv_suspend:2600) igt-aux-DEBUG: Test requirement passed: ret == 0
(drv_suspend:2600) igt-core-INFO: [cmd] rtcwake: wakeup from "disk" using /dev...
(drv_suspend:2600) igt-core-WARNING: [cmd] rtcwake: write error
(drv_suspend:2600) igt-aux-WARNING: rtcwake failed with 1
Check dmesg for further details.
...
igt@drv_suspend@fence-restore-tiled2untiled-hibernate
 airlied_2 / shard-snb3
(drv_suspend:2707) igt-core-WARNING: [cmd] rtcwake: write error[cmd] 
(drv_suspend:2707) igt-aux-CRITICAL: Test assertion failure function suspend_v...
(drv_suspend:2707) igt-aux-CRITICAL: Failed assertion: ret == 0
(drv_suspend:2707) igt-aux-CRITICAL: rtcwake failed with 1
Check dmesg for further details.
Subtest fence-restore-tiled2untiled-hibernate failed.
**** DEBUG ****
(drv_suspend:2707) igt-core-DEBUG: Test requirement passed: !igt_run_in_simula...
(drv_suspend:2707) igt-aux-DEBUG: Test requirement passed: (power_dir = open("...
(drv_suspend:2707) igt-aux-DEBUG: Test requirement passed: get_supported_suspe...
(drv_suspend:2707) igt-aux-DEBUG: Test requirement passed: test == SUSPEND_TES...
(drv_suspend:2707) igt-aux-DEBUG: Test requirement passed: ret == 0
(drv_suspend:2707) igt-core-INFO: [cmd] rtcwake: wakeup from "disk" using /dev...
(drv_suspend:2707) igt-core-WARNING: [cmd] rtcwake: write error[cmd] 
(drv_suspend:2707) igt-aux-CRITICAL: Test assertion failure function suspend_v...
(drv_suspend:2707) igt-aux-CRITICAL: Failed assertion: ret == 0
(drv_suspend:2707) igt-aux-CRITICAL: rtcwake failed with 1
...
 airlied_3 / shard-snb1
(drv_suspend:2679) igt-core-WARNING: [cmd] rtcwake: write error
(drv_suspend:2679) igt-aux-CRITICAL: Test assertion failure function suspend_v...
(drv_suspend:2679) igt-aux-CRITICAL: Failed assertion: ret == 0
(drv_suspend:2679) igt-aux-CRITICAL: rtcwake failed with 1
Check dmesg for further details.
Subtest fence-restore-tiled2untiled-hibernate failed.
**** DEBUG ****
(drv_suspend:2679) igt-core-DEBUG: Test requirement passed: !igt_run_in_simula...
(drv_suspend:2679) igt-aux-DEBUG: Test requirement passed: (power_dir = open("...
(drv_suspend:2679) igt-aux-DEBUG: Test requirement passed: get_supported_suspe...
(drv_suspend:2679) igt-aux-DEBUG: Test requirement passed: test == SUSPEND_TES...
(drv_suspend:2679) igt-aux-DEBUG: Test requirement passed: ret == 0
(drv_suspend:2679) igt-core-INFO: [cmd] rtcwake: wakeup from "disk" using /dev...
(drv_suspend:2679) igt-core-WARNING: [cmd] rtcwake: write error
(drv_suspend:2679) igt-aux-CRITICAL: Test assertion failure function suspend_v...
(drv_suspend:2679) igt-aux-CRITICAL: Failed assertion: ret == 0
(drv_suspend:2679) igt-aux-CRITICAL: rtcwake failed with 1
...
 airlied_4 / shard-snb1
(drv_suspend:7369) igt-core-WARNING: [cmd] rtcwake: write error
(drv_suspend:7369) igt-aux-CRITICAL: Test assertion failure function suspend_v...
(drv_suspend:7369) igt-aux-CRITICAL: Failed assertion: ret == 0
(drv_suspend:7369) igt-aux-CRITICAL: rtcwake failed with 1
Check dmesg for further details.
Subtest fence-restore-tiled2untiled-hibernate failed.
**** DEBUG ****
(drv_suspend:7369) igt-core-DEBUG: Test requirement passed: !igt_run_in_simula...
(drv_suspend:7369) igt-aux-DEBUG: Test requirement passed: (power_dir = open("...
(drv_suspend:7369) igt-aux-DEBUG: Test requirement passed: get_supported_suspe...
(drv_suspend:7369) igt-aux-DEBUG: Test requirement passed: test == SUSPEND_TES...
(drv_suspend:7369) igt-aux-DEBUG: Test requirement passed: ret == 0
(drv_suspend:7369) igt-core-INFO: [cmd] rtcwake: wakeup from "disk" using /dev...
(drv_suspend:7369) igt-core-WARNING: [cmd] rtcwake: write error
(drv_suspend:7369) igt-aux-CRITICAL: Test assertion failure function suspend_v...
(drv_suspend:7369) igt-aux-CRITICAL: Failed assertion: ret == 0
(drv_suspend:7369) igt-aux-CRITICAL: rtcwake failed with 1
...
 airlied_5 / shard-snb5
(drv_suspend:9278) igt-core-WARNING: [cmd] rtcwake: write error
(drv_suspend:9278) igt-aux-CRITICAL: Test assertion failure function suspend_v...
(drv_suspend:9278) igt-aux-CRITICAL: Failed assertion: ret == 0
(drv_suspend:9278) igt-aux-CRITICAL: rtcwake failed with 1
Check dmesg for further details.
Subtest fence-restore-tiled2untiled-hibernate failed.
**** DEBUG ****
(drv_suspend:9278) igt-core-DEBUG: Test requirement passed: !igt_run_in_simula...
(drv_suspend:9278) igt-aux-DEBUG: Test requirement passed: (power_dir = open("...
(drv_suspend:9278) igt-aux-DEBUG: Test requirement passed: get_supported_suspe...
(drv_suspend:9278) igt-aux-DEBUG: Test requirement passed: test == SUSPEND_TES...
(drv_suspend:9278) igt-aux-DEBUG: Test requirement passed: ret == 0
(drv_suspend:9278) igt-core-INFO: [cmd] rtcwake: wakeup from "disk" using /dev...
(drv_suspend:9278) igt-core-WARNING: [cmd] rtcwake: write error
(drv_suspend:9278) igt-aux-CRITICAL: Test assertion failure function suspend_v...
(drv_suspend:9278) igt-aux-CRITICAL: Failed assertion: ret == 0
(drv_suspend:9278) igt-aux-CRITICAL: rtcwake failed with 1
...
 airlied_6 / shard-snb7
(drv_suspend:10629) igt-core-WARNING: [cmd] rtcwake: [cmd] write error
(drv_suspend:10629) igt-aux-WARNING: rtcwake failed with 1
Check dmesg for further details.
(drv_suspend:10629) igt-aux-CRITICAL: Test assertion failure function suspend_...
(drv_suspend:10629) igt-aux-CRITICAL: Failed assertion: ret == 0
(drv_suspend:10629) igt-aux-CRITICAL: error: 1 != 0
Subtest fence-restore-tiled2untiled-hibernate failed.
**** DEBUG ****
(drv_suspend:10629) igt-core-DEBUG: Test requirement passed: !igt_run_in_simul...
(drv_suspend:10629) igt-aux-DEBUG: Test requirement passed: (power_dir = open(...
(drv_suspend:10629) igt-aux-DEBUG: Test requirement passed: get_supported_susp...
(drv_suspend:10629) igt-aux-DEBUG: Test requirement passed: test == SUSPEND_TE...
(drv_suspend:10629) igt-aux-DEBUG: Test requirement passed: ret == 0
(drv_suspend:10629) igt-core-INFO: [cmd] rtcwake: wakeup from "disk" using /de...
(drv_suspend:10629) igt-core-WARNING: [cmd] rtcwake: [cmd] write error
(drv_suspend:10629) igt-aux-WARNING: rtcwake failed with 1
Check dmesg for further details.
...
 airlied_2 / shard-hsw1
(drv_suspend:2762) igt-core-WARNING: [cmd] rtcwake: write error
(drv_suspend:2762) igt-aux-CRITICAL: Test assertion failure function suspend_v...
(drv_suspend:2762) igt-aux-CRITICAL: Failed assertion: ret == 0
(drv_suspend:2762) igt-aux-CRITICAL: rtcwake failed with 1
Check dmesg for further details.
Subtest fence-restore-tiled2untiled-hibernate failed.
**** DEBUG ****
(drv_suspend:2762) igt-core-DEBUG: Test requirement passed: !igt_run_in_simula...
(drv_suspend:2762) igt-aux-DEBUG: Test requirement passed: (power_dir = open("...
(drv_suspend:2762) igt-aux-DEBUG: Test requirement passed: get_supported_suspe...
(drv_suspend:2762) igt-aux-DEBUG: Test requirement passed: test == SUSPEND_TES...
(drv_suspend:2762) igt-aux-DEBUG: Test requirement passed: ret == 0
(drv_suspend:2762) igt-core-INFO: [cmd] rtcwake: wakeup from "disk" using /dev...
(drv_suspend:2762) igt-core-WARNING: [cmd] rtcwake: write error
(drv_suspend:2762) igt-aux-CRITICAL: Test assertion failure function suspend_v...
(drv_suspend:2762) igt-aux-CRITICAL: Failed assertion: ret == 0
(drv_suspend:2762) igt-aux-CRITICAL: rtcwake failed with 1
...
 airlied_3 / shard-hsw5
(drv_suspend:2757) igt-core-WARNING: [cmd] rtcwake: write error
(drv_suspend:2757) igt-aux-CRITICAL: Test assertion failure function suspend_v...
(drv_suspend:2757) igt-aux-CRITICAL: Failed assertion: ret == 0
(drv_suspend:2757) igt-aux-CRITICAL: rtcwake failed with 1
Check dmesg for further details.
Subtest fence-restore-tiled2untiled-hibernate failed.
**** DEBUG ****
(drv_suspend:2757) igt-core-DEBUG: Test requirement passed: !igt_run_in_simula...
(drv_suspend:2757) igt-aux-DEBUG: Test requirement passed: (power_dir = open("...
(drv_suspend:2757) igt-aux-DEBUG: Test requirement passed: get_supported_suspe...
(drv_suspend:2757) igt-aux-DEBUG: Test requirement passed: test == SUSPEND_TES...
(drv_suspend:2757) igt-aux-DEBUG: Test requirement passed: ret == 0
(drv_suspend:2757) igt-core-INFO: [cmd] rtcwake: wakeup from "disk" using /dev...
(drv_suspend:2757) igt-core-WARNING: [cmd] rtcwake: write error
(drv_suspend:2757) igt-aux-CRITICAL: Test assertion failure function suspend_v...
(drv_suspend:2757) igt-aux-CRITICAL: Failed assertion: ret == 0
(drv_suspend:2757) igt-aux-CRITICAL: rtcwake failed with 1
...
 airlied_4 / shard-hsw4
(drv_suspend:11515) igt-core-WARNING: [cmd] rtcwake: write error[cmd] 
(drv_suspend:11515) igt-aux-CRITICAL: Test assertion failure function suspend_...
(drv_suspend:11515) igt-aux-CRITICAL: Failed assertion: ret == 0
(drv_suspend:11515) igt-aux-CRITICAL: rtcwake failed with 1
Check dmesg for further details.
Subtest fence-restore-tiled2untiled-hibernate failed.
**** DEBUG ****
(drv_suspend:11515) igt-core-DEBUG: Test requirement passed: !igt_run_in_simul...
(drv_suspend:11515) igt-aux-DEBUG: Test requirement passed: (power_dir = open(...
(drv_suspend:11515) igt-aux-DEBUG: Test requirement passed: get_supported_susp...
(drv_suspend:11515) igt-aux-DEBUG: Test requirement passed: test == SUSPEND_TE...
(drv_suspend:11515) igt-aux-DEBUG: Test requirement passed: ret == 0
(drv_suspend:11515) igt-core-INFO: [cmd] rtcwake: wakeup from "disk" using /de...
(drv_suspend:11515) igt-core-WARNING: [cmd] rtcwake: write error[cmd] 
(drv_suspend:11515) igt-aux-CRITICAL: Test assertion failure function suspend_...
(drv_suspend:11515) igt-aux-CRITICAL: Failed assertion: ret == 0
(drv_suspend:11515) igt-aux-CRITICAL: rtcwake failed with 1
...
 airlied_5 / shard-hsw6
(drv_suspend:11270) igt-core-WARNING: [cmd] rtcwake: write error[cmd] 
(drv_suspend:11270) igt-aux-CRITICAL: Test assertion failure function suspend_...
(drv_suspend:11270) igt-aux-CRITICAL: Failed assertion: ret == 0
(drv_suspend:11270) igt-aux-CRITICAL: rtcwake failed with 1
Check dmesg for further details.
Subtest fence-restore-tiled2untiled-hibernate failed.
**** DEBUG ****
(drv_suspend:11270) igt-core-DEBUG: Test requirement passed: !igt_run_in_simul...
(drv_suspend:11270) igt-aux-DEBUG: Test requirement passed: (power_dir = open(...
(drv_suspend:11270) igt-aux-DEBUG: Test requirement passed: get_supported_susp...
(drv_suspend:11270) igt-aux-DEBUG: Test requirement passed: test == SUSPEND_TE...
(drv_suspend:11270) igt-aux-DEBUG: Test requirement passed: ret == 0
(drv_suspend:11270) igt-core-INFO: [cmd] rtcwake: wakeup from "disk" using /de...
(drv_suspend:11270) igt-core-WARNING: [cmd] rtcwake: write error[cmd] 
(drv_suspend:11270) igt-aux-CRITICAL: Test assertion failure function suspend_...
(drv_suspend:11270) igt-aux-CRITICAL: Failed assertion: ret == 0
(drv_suspend:11270) igt-aux-CRITICAL: rtcwake failed with 1
...
 airlied_6 / shard-hsw5
(drv_suspend:9460) igt-core-WARNING: [cmd] rtcwake: write error[cmd] 
(drv_suspend:9460) igt-aux-WARNING: rtcwake failed with 1
Check dmesg for further details.
(drv_suspend:9460) igt-aux-CRITICAL: Test assertion failure function suspend_v...
(drv_suspend:9460) igt-aux-CRITICAL: Failed assertion: ret == 0
(drv_suspend:9460) igt-aux-CRITICAL: error: 1 != 0
Subtest fence-restore-tiled2untiled-hibernate failed.
**** DEBUG ****
(drv_suspend:9460) igt-core-DEBUG: Test requirement passed: !igt_run_in_simula...
(drv_suspend:9460) igt-aux-DEBUG: Test requirement passed: (power_dir = open("...
(drv_suspend:9460) igt-aux-DEBUG: Test requirement passed: get_supported_suspe...
(drv_suspend:9460) igt-aux-DEBUG: Test requirement passed: test == SUSPEND_TES...
(drv_suspend:9460) igt-aux-DEBUG: Test requirement passed: ret == 0
(drv_suspend:9460) igt-core-INFO: [cmd] rtcwake: wakeup from "disk" using /dev...
(drv_suspend:9460) igt-core-WARNING: [cmd] rtcwake: write error[cmd] 
(drv_suspend:9460) igt-aux-WARNING: rtcwake failed with 1
Check dmesg for further details.
...
 airlied_2 / shard-apl4
(drv_suspend:2662) igt-core-WARNING: [cmd] rtcwake: write error
(drv_suspend:2662) igt-aux-CRITICAL: Test assertion failure function suspend_v...
(drv_suspend:2662) igt-aux-CRITICAL: Failed assertion: ret == 0
(drv_suspend:2662) igt-aux-CRITICAL: rtcwake failed with 1
Check dmesg for further details.
Subtest fence-restore-tiled2untiled-hibernate failed.
**** DEBUG ****
(drv_suspend:2662) igt-core-DEBUG: Test requirement passed: !igt_run_in_simula...
(drv_suspend:2662) igt-aux-DEBUG: Test requirement passed: (power_dir = open("...
(drv_suspend:2662) igt-aux-DEBUG: Test requirement passed: get_supported_suspe...
(drv_suspend:2662) igt-aux-DEBUG: Test requirement passed: test == SUSPEND_TES...
(drv_suspend:2662) igt-aux-DEBUG: Test requirement passed: ret == 0
(drv_suspend:2662) igt-core-INFO: [cmd] rtcwake: wakeup from "disk" using /dev...
(drv_suspend:2662) igt-core-WARNING: [cmd] rtcwake: write error
(drv_suspend:2662) igt-aux-CRITICAL: Test assertion failure function suspend_v...
(drv_suspend:2662) igt-aux-CRITICAL: Failed assertion: ret == 0
(drv_suspend:2662) igt-aux-CRITICAL: rtcwake failed with 1
...
 airlied_3 / shard-apl7
(drv_suspend:2725) igt-core-WARNING: [cmd] rtcwake: [cmd] write error
(drv_suspend:2725) igt-aux-CRITICAL: Test assertion failure function suspend_v...
(drv_suspend:2725) igt-aux-CRITICAL: Failed assertion: ret == 0
(drv_suspend:2725) igt-aux-CRITICAL: rtcwake failed with 1
Check dmesg for further details.
Subtest fence-restore-tiled2untiled-hibernate failed.
**** DEBUG ****
(drv_suspend:2725) igt-core-DEBUG: Test requirement passed: !igt_run_in_simula...
(drv_suspend:2725) igt-aux-DEBUG: Test requirement passed: (power_dir = open("...
(drv_suspend:2725) igt-aux-DEBUG: Test requirement passed: get_supported_suspe...
(drv_suspend:2725) igt-aux-DEBUG: Test requirement passed: test == SUSPEND_TES...
(drv_suspend:2725) igt-aux-DEBUG: Test requirement passed: ret == 0
(drv_suspend:2725) igt-core-INFO: [cmd] rtcwake: wakeup from "disk" using /dev...
(drv_suspend:2725) igt-core-WARNING: [cmd] rtcwake: [cmd] write error
(drv_suspend:2725) igt-aux-CRITICAL: Test assertion failure function suspend_v...
(drv_suspend:2725) igt-aux-CRITICAL: Failed assertion: ret == 0
(drv_suspend:2725) igt-aux-CRITICAL: rtcwake failed with 1
...
 airlied_4 / shard-apl6
(drv_suspend:6751) igt-core-WARNING: [cmd] rtcwake: write error
(drv_suspend:6751) igt-aux-CRITICAL: Test assertion failure function suspend_v...
(drv_suspend:6751) igt-aux-CRITICAL: Failed assertion: ret == 0
(drv_suspend:6751) igt-aux-CRITICAL: rtcwake failed with 1
Check dmesg for further details.
Subtest fence-restore-tiled2untiled-hibernate failed.
**** DEBUG ****
(drv_suspend:6751) igt-core-DEBUG: Test requirement passed: !igt_run_in_simula...
(drv_suspend:6751) igt-aux-DEBUG: Test requirement passed: (power_dir = open("...
(drv_suspend:6751) igt-aux-DEBUG: Test requirement passed: get_supported_suspe...
(drv_suspend:6751) igt-aux-DEBUG: Test requirement passed: test == SUSPEND_TES...
(drv_suspend:6751) igt-aux-DEBUG: Test requirement passed: ret == 0
(drv_suspend:6751) igt-core-INFO: [cmd] rtcwake: wakeup from "disk" using /dev...
(drv_suspend:6751) igt-core-WARNING: [cmd] rtcwake: write error
(drv_suspend:6751) igt-aux-CRITICAL: Test assertion failure function suspend_v...
(drv_suspend:6751) igt-aux-CRITICAL: Failed assertion: ret == 0
(drv_suspend:6751) igt-aux-CRITICAL: rtcwake failed with 1
...
 airlied_5 / shard-apl6
(drv_suspend:8433) igt-core-WARNING: [cmd] rtcwake: write error
(drv_suspend:8433) igt-aux-CRITICAL: Test assertion failure function suspend_v...
(drv_suspend:8433) igt-aux-CRITICAL: Failed assertion: ret == 0
(drv_suspend:8433) igt-aux-CRITICAL: rtcwake failed with 1
Check dmesg for further details.
Subtest fence-restore-tiled2untiled-hibernate failed.
**** DEBUG ****
(drv_suspend:8433) igt-core-DEBUG: Test requirement passed: !igt_run_in_simula...
(drv_suspend:8433) igt-aux-DEBUG: Test requirement passed: (power_dir = open("...
(drv_suspend:8433) igt-aux-DEBUG: Test requirement passed: get_supported_suspe...
(drv_suspend:8433) igt-aux-DEBUG: Test requirement passed: test == SUSPEND_TES...
(drv_suspend:8433) igt-aux-DEBUG: Test requirement passed: ret == 0
(drv_suspend:8433) igt-core-INFO: [cmd] rtcwake: wakeup from "disk" using /dev...
(drv_suspend:8433) igt-core-WARNING: [cmd] rtcwake: write error
(drv_suspend:8433) igt-aux-CRITICAL: Test assertion failure function suspend_v...
(drv_suspend:8433) igt-aux-CRITICAL: Failed assertion: ret == 0
(drv_suspend:8433) igt-aux-CRITICAL: rtcwake failed with 1
...
 airlied_6 / shard-apl3
(drv_suspend:4417) igt-core-WARNING: [cmd] rtcwake: write error
(drv_suspend:4417) igt-aux-WARNING: rtcwake failed with 1
Check dmesg for further details.
(drv_suspend:4417) igt-aux-CRITICAL: Test assertion failure function suspend_v...
(drv_suspend:4417) igt-aux-CRITICAL: Failed assertion: ret == 0
(drv_suspend:4417) igt-aux-CRITICAL: error: 1 != 0
Subtest fence-restore-tiled2untiled-hibernate failed.
**** DEBUG ****
(drv_suspend:4417) igt-core-DEBUG: Test requirement passed: !igt_run_in_simula...
(drv_suspend:4417) igt-aux-DEBUG: Test requirement passed: (power_dir = open("...
(drv_suspend:4417) igt-aux-DEBUG: Test requirement passed: get_supported_suspe...
(drv_suspend:4417) igt-aux-DEBUG: Test requirement passed: test == SUSPEND_TES...
(drv_suspend:4417) igt-aux-DEBUG: Test requirement passed: ret == 0
(drv_suspend:4417) igt-core-INFO: [cmd] rtcwake: wakeup from "disk" using /dev...
(drv_suspend:4417) igt-core-WARNING: [cmd] rtcwake: write error
(drv_suspend:4417) igt-aux-WARNING: rtcwake failed with 1
Check dmesg for further details.
...
 airlied_2 / shard-kbl7
(drv_suspend:2736) igt-core-WARNING: [cmd] rtcwake: write error
(drv_suspend:2736) igt-aux-CRITICAL: Test assertion failure function suspend_v...
(drv_suspend:2736) igt-aux-CRITICAL: Failed assertion: ret == 0
(drv_suspend:2736) igt-aux-CRITICAL: rtcwake failed with 1
Check dmesg for further details.
Subtest fence-restore-tiled2untiled-hibernate failed.
**** DEBUG ****
(drv_suspend:2736) igt-core-DEBUG: Test requirement passed: !igt_run_in_simula...
(drv_suspend:2736) igt-aux-DEBUG: Test requirement passed: (power_dir = open("...
(drv_suspend:2736) igt-aux-DEBUG: Test requirement passed: get_supported_suspe...
(drv_suspend:2736) igt-aux-DEBUG: Test requirement passed: test == SUSPEND_TES...
(drv_suspend:2736) igt-aux-DEBUG: Test requirement passed: ret == 0
(drv_suspend:2736) igt-core-INFO: [cmd] rtcwake: wakeup from "disk" using /dev...
(drv_suspend:2736) igt-core-WARNING: [cmd] rtcwake: write error
(drv_suspend:2736) igt-aux-CRITICAL: Test assertion failure function suspend_v...
(drv_suspend:2736) igt-aux-CRITICAL: Failed assertion: ret == 0
(drv_suspend:2736) igt-aux-CRITICAL: rtcwake failed with 1
...
 airlied_3 / shard-kbl4
(drv_suspend:2670) igt-core-WARNING: [cmd] rtcwake: write error
(drv_suspend:2670) igt-aux-CRITICAL: Test assertion failure function suspend_v...
(drv_suspend:2670) igt-aux-CRITICAL: Failed assertion: ret == 0
(drv_suspend:2670) igt-aux-CRITICAL: rtcwake failed with 1
Check dmesg for further details.
Subtest fence-restore-tiled2untiled-hibernate failed.
**** DEBUG ****
(drv_suspend:2670) igt-core-DEBUG: Test requirement passed: !igt_run_in_simula...
(drv_suspend:2670) igt-aux-DEBUG: Test requirement passed: (power_dir = open("...
(drv_suspend:2670) igt-aux-DEBUG: Test requirement passed: get_supported_suspe...
(drv_suspend:2670) igt-aux-DEBUG: Test requirement passed: test == SUSPEND_TES...
(drv_suspend:2670) igt-aux-DEBUG: Test requirement passed: ret == 0
(drv_suspend:2670) igt-core-INFO: [cmd] rtcwake: wakeup from "disk" using /dev...
(drv_suspend:2670) igt-core-WARNING: [cmd] rtcwake: write error
(drv_suspend:2670) igt-aux-CRITICAL: Test assertion failure function suspend_v...
(drv_suspend:2670) igt-aux-CRITICAL: Failed assertion: ret == 0
(drv_suspend:2670) igt-aux-CRITICAL: rtcwake failed with 1
...
 airlied_4 / shard-kbl5
(drv_suspend:1325) igt-core-WARNING: [cmd] rtcwake: write error
(drv_suspend:1325) igt-aux-CRITICAL: Test assertion failure function suspend_v...
(drv_suspend:1325) igt-aux-CRITICAL: Failed assertion: ret == 0
(drv_suspend:1325) igt-aux-CRITICAL: rtcwake failed with 1
Check dmesg for further details.
Subtest fence-restore-tiled2untiled-hibernate failed.
**** DEBUG ****
(drv_suspend:1325) igt-core-DEBUG: Test requirement passed: !igt_run_in_simula...
(drv_suspend:1325) igt-aux-DEBUG: Test requirement passed: (power_dir = open("...
(drv_suspend:1325) igt-aux-DEBUG: Test requirement passed: get_supported_suspe...
(drv_suspend:1325) igt-aux-DEBUG: Test requirement passed: test == SUSPEND_TES...
(drv_suspend:1325) igt-aux-DEBUG: Test requirement passed: ret == 0
(drv_suspend:1325) igt-core-INFO: [cmd] rtcwake: wakeup from "disk" using /dev...
(drv_suspend:1325) igt-core-WARNING: [cmd] rtcwake: write error
(drv_suspend:1325) igt-aux-CRITICAL: Test assertion failure function suspend_v...
(drv_suspend:1325) igt-aux-CRITICAL: Failed assertion: ret == 0
(drv_suspend:1325) igt-aux-CRITICAL: rtcwake failed with 1
...
 airlied_5 / shard-kbl3
(drv_suspend:3100) igt-core-WARNING: [cmd] rtcwake: write error
(drv_suspend:3100) igt-aux-CRITICAL: Test assertion failure function suspend_v...
(drv_suspend:3100) igt-aux-CRITICAL: Failed assertion: ret == 0
(drv_suspend:3100) igt-aux-CRITICAL: rtcwake failed with 1
Check dmesg for further details.
Subtest fence-restore-tiled2untiled-hibernate failed.
**** DEBUG ****
(drv_suspend:3100) igt-core-DEBUG: Test requirement passed: !igt_run_in_simula...
(drv_suspend:3100) igt-aux-DEBUG: Test requirement passed: (power_dir = open("...
(drv_suspend:3100) igt-aux-DEBUG: Test requirement passed: get_supported_suspe...
(drv_suspend:3100) igt-aux-DEBUG: Test requirement passed: test == SUSPEND_TES...
(drv_suspend:3100) igt-aux-DEBUG: Test requirement passed: ret == 0
(drv_suspend:3100) igt-core-INFO: [cmd] rtcwake: wakeup from "disk" using /dev...
(drv_suspend:3100) igt-core-WARNING: [cmd] rtcwake: write error
(drv_suspend:3100) igt-aux-CRITICAL: Test assertion failure function suspend_v...
(drv_suspend:3100) igt-aux-CRITICAL: Failed assertion: ret == 0
(drv_suspend:3100) igt-aux-CRITICAL: rtcwake failed with 1
...
 airlied_6 / shard-kbl2
(drv_suspend:1463) igt-core-WARNING: [cmd] rtcwake: write error
(drv_suspend:1463) igt-aux-WARNING: rtcwake failed with 1
Check dmesg for further details.
(drv_suspend:1463) igt-aux-CRITICAL: Test assertion failure function suspend_v...
(drv_suspend:1463) igt-aux-CRITICAL: Failed assertion: ret == 0
(drv_suspend:1463) igt-aux-CRITICAL: error: 1 != 0
Subtest fence-restore-tiled2untiled-hibernate failed.
**** DEBUG ****
(drv_suspend:1463) igt-core-DEBUG: Test requirement passed: !igt_run_in_simula...
(drv_suspend:1463) igt-aux-DEBUG: Test requirement passed: (power_dir = open("...
(drv_suspend:1463) igt-aux-DEBUG: Test requirement passed: get_supported_suspe...
(drv_suspend:1463) igt-aux-DEBUG: Test requirement passed: test == SUSPEND_TES...
(drv_suspend:1463) igt-aux-DEBUG: Test requirement passed: ret == 0
(drv_suspend:1463) igt-core-INFO: [cmd] rtcwake: wakeup from "disk" using /dev...
(drv_suspend:1463) igt-core-WARNING: [cmd] rtcwake: write error
(drv_suspend:1463) igt-aux-WARNING: rtcwake failed with 1
Check dmesg for further details.
...
igt@drv_suspend@fence-restore-untiled-hibernate
 airlied_2 / shard-snb2
(drv_suspend:1594) igt-core-WARNING: [cmd] rtcwake: write error
(drv_suspend:1594) igt-aux-CRITICAL: Test assertion failure function suspend_v...
(drv_suspend:1594) igt-aux-CRITICAL: Failed assertion: ret == 0
(drv_suspend:1594) igt-aux-CRITICAL: rtcwake failed with 1
Check dmesg for further details.
Subtest fence-restore-untiled-hibernate failed.
**** DEBUG ****
(drv_suspend:1594) igt-core-DEBUG: Test requirement passed: !igt_run_in_simula...
(drv_suspend:1594) igt-aux-DEBUG: Test requirement passed: (power_dir = open("...
(drv_suspend:1594) igt-aux-DEBUG: Test requirement passed: get_supported_suspe...
(drv_suspend:1594) igt-aux-DEBUG: Test requirement passed: test == SUSPEND_TES...
(drv_suspend:1594) igt-aux-DEBUG: Test requirement passed: ret == 0
(drv_suspend:1594) igt-core-INFO: [cmd] rtcwake: wakeup from "disk" using /dev...
(drv_suspend:1594) igt-core-WARNING: [cmd] rtcwake: write error
(drv_suspend:1594) igt-aux-CRITICAL: Test assertion failure function suspend_v...
(drv_suspend:1594) igt-aux-CRITICAL: Failed assertion: ret == 0
(drv_suspend:1594) igt-aux-CRITICAL: rtcwake failed with 1
...
 airlied_3 / shard-snb2
(drv_suspend:1564) igt-core-WARNING: [cmd] rtcwake: write error
(drv_suspend:1564) igt-aux-CRITICAL: Test assertion failure function suspend_v...
(drv_suspend:1564) igt-aux-CRITICAL: Failed assertion: ret == 0
(drv_suspend:1564) igt-aux-CRITICAL: rtcwake failed with 1
Check dmesg for further details.
Subtest fence-restore-untiled-hibernate failed.
**** DEBUG ****
(drv_suspend:1564) igt-core-DEBUG: Test requirement passed: !igt_run_in_simula...
(drv_suspend:1564) igt-aux-DEBUG: Test requirement passed: (power_dir = open("...
(drv_suspend:1564) igt-aux-DEBUG: Test requirement passed: get_supported_suspe...
(drv_suspend:1564) igt-aux-DEBUG: Test requirement passed: test == SUSPEND_TES...
(drv_suspend:1564) igt-aux-DEBUG: Test requirement passed: ret == 0
(drv_suspend:1564) igt-core-INFO: [cmd] rtcwake: wakeup from "disk" using /dev...
(drv_suspend:1564) igt-core-WARNING: [cmd] rtcwake: write error
(drv_suspend:1564) igt-aux-CRITICAL: Test assertion failure function suspend_v...
(drv_suspend:1564) igt-aux-CRITICAL: Failed assertion: ret == 0
(drv_suspend:1564) igt-aux-CRITICAL: rtcwake failed with 1
...
 airlied_4 / shard-snb2
(drv_suspend:6617) igt-core-WARNING: [cmd] rtcwake: write error
(drv_suspend:6617) igt-aux-CRITICAL: Test assertion failure function suspend_v...
(drv_suspend:6617) igt-aux-CRITICAL: Failed assertion: ret == 0
(drv_suspend:6617) igt-aux-CRITICAL: rtcwake failed with 1
Check dmesg for further details.
Subtest fence-restore-untiled-hibernate failed.
**** DEBUG ****
(drv_suspend:6617) igt-core-DEBUG: Test requirement passed: !igt_run_in_simula...
(drv_suspend:6617) igt-aux-DEBUG: Test requirement passed: (power_dir = open("...
(drv_suspend:6617) igt-aux-DEBUG: Test requirement passed: get_supported_suspe...
(drv_suspend:6617) igt-aux-DEBUG: Test requirement passed: test == SUSPEND_TES...
(drv_suspend:6617) igt-aux-DEBUG: Test requirement passed: ret == 0
(drv_suspend:6617) igt-core-INFO: [cmd] rtcwake: wakeup from "disk" using /dev...
(drv_suspend:6617) igt-core-WARNING: [cmd] rtcwake: write error
(drv_suspend:6617) igt-aux-CRITICAL: Test assertion failure function suspend_v...
(drv_suspend:6617) igt-aux-CRITICAL: Failed assertion: ret == 0
(drv_suspend:6617) igt-aux-CRITICAL: rtcwake failed with 1
...
 airlied_5 / shard-snb4
(drv_suspend:3054) igt-core-WARNING: [cmd] rtcwake: write error
(drv_suspend:3054) igt-aux-CRITICAL: Test assertion failure function suspend_v...
(drv_suspend:3054) igt-aux-CRITICAL: Failed assertion: ret == 0
(drv_suspend:3054) igt-aux-CRITICAL: rtcwake failed with 1
Check dmesg for further details.
Subtest fence-restore-untiled-hibernate failed.
**** DEBUG ****
(drv_suspend:3054) igt-core-DEBUG: Test requirement passed: !igt_run_in_simula...
(drv_suspend:3054) igt-aux-DEBUG: Test requirement passed: (power_dir = open("...
(drv_suspend:3054) igt-aux-DEBUG: Test requirement passed: get_supported_suspe...
(drv_suspend:3054) igt-aux-DEBUG: Test requirement passed: test == SUSPEND_TES...
(drv_suspend:3054) igt-aux-DEBUG: Test requirement passed: ret == 0
(drv_suspend:3054) igt-core-INFO: [cmd] rtcwake: wakeup from "disk" using /dev...
(drv_suspend:3054) igt-core-WARNING: [cmd] rtcwake: write error
(drv_suspend:3054) igt-aux-CRITICAL: Test assertion failure function suspend_v...
(drv_suspend:3054) igt-aux-CRITICAL: Failed assertion: ret == 0
(drv_suspend:3054) igt-aux-CRITICAL: rtcwake failed with 1
...
 airlied_6 / shard-snb1
(drv_suspend:5011) igt-core-WARNING: [cmd] rtcwake: [cmd] write error
(drv_suspend:5011) igt-aux-WARNING: rtcwake failed with 1
Check dmesg for further details.
(drv_suspend:5011) igt-aux-CRITICAL: Test assertion failure function suspend_v...
(drv_suspend:5011) igt-aux-CRITICAL: Failed assertion: ret == 0
(drv_suspend:5011) igt-aux-CRITICAL: error: 1 != 0
Subtest fence-restore-untiled-hibernate failed.
**** DEBUG ****
(drv_suspend:5011) igt-core-DEBUG: Test requirement passed: !igt_run_in_simula...
(drv_suspend:5011) igt-aux-DEBUG: Test requirement passed: (power_dir = open("...
(drv_suspend:5011) igt-aux-DEBUG: Test requirement passed: get_supported_suspe...
(drv_suspend:5011) igt-aux-DEBUG: Test requirement passed: test == SUSPEND_TES...
(drv_suspend:5011) igt-aux-DEBUG: Test requirement passed: ret == 0
(drv_suspend:5011) igt-core-INFO: [cmd] rtcwake: wakeup from "disk" using /dev...
(drv_suspend:5011) igt-core-WARNING: [cmd] rtcwake: [cmd] write error
(drv_suspend:5011) igt-aux-WARNING: rtcwake failed with 1
Check dmesg for further details.
...
 airlied_2 / shard-hsw2
(drv_suspend:1567) igt-core-WARNING: [cmd] rtcwake: write error
(drv_suspend:1567) igt-aux-CRITICAL: Test assertion failure function suspend_v...
(drv_suspend:1567) igt-aux-CRITICAL: Failed assertion: ret == 0
(drv_suspend:1567) igt-aux-CRITICAL: rtcwake failed with 1
Check dmesg for further details.
Subtest fence-restore-untiled-hibernate failed.
**** DEBUG ****
(drv_suspend:1567) igt-core-DEBUG: Test requirement passed: !igt_run_in_simula...
(drv_suspend:1567) igt-aux-DEBUG: Test requirement passed: (power_dir = open("...
(drv_suspend:1567) igt-aux-DEBUG: Test requirement passed: get_supported_suspe...
(drv_suspend:1567) igt-aux-DEBUG: Test requirement passed: test == SUSPEND_TES...
(drv_suspend:1567) igt-aux-DEBUG: Test requirement passed: ret == 0
(drv_suspend:1567) igt-core-INFO: [cmd] rtcwake: wakeup from "disk" using /dev...
(drv_suspend:1567) igt-core-WARNING: [cmd] rtcwake: write error
(drv_suspend:1567) igt-aux-CRITICAL: Test assertion failure function suspend_v...
(drv_suspend:1567) igt-aux-CRITICAL: Failed assertion: ret == 0
(drv_suspend:1567) igt-aux-CRITICAL: rtcwake failed with 1
...
 airlied_3 / shard-hsw1
(drv_suspend:1545) igt-core-WARNING: [cmd] rtcwake: write error[cmd] 
(drv_suspend:1545) igt-aux-CRITICAL: Test assertion failure function suspend_v...
(drv_suspend:1545) igt-aux-CRITICAL: Failed assertion: ret == 0
(drv_suspend:1545) igt-aux-CRITICAL: rtcwake failed with 1
Check dmesg for further details.
Subtest fence-restore-untiled-hibernate failed.
**** DEBUG ****
(drv_suspend:1545) igt-core-DEBUG: Test requirement passed: !igt_run_in_simula...
(drv_suspend:1545) igt-aux-DEBUG: Test requirement passed: (power_dir = open("...
(drv_suspend:1545) igt-aux-DEBUG: Test requirement passed: get_supported_suspe...
(drv_suspend:1545) igt-aux-DEBUG: Test requirement passed: test == SUSPEND_TES...
(drv_suspend:1545) igt-aux-DEBUG: Test requirement passed: ret == 0
(drv_suspend:1545) igt-core-INFO: [cmd] rtcwake: wakeup from "disk" using /dev...
(drv_suspend:1545) igt-core-WARNING: [cmd] rtcwake: write error[cmd] 
(drv_suspend:1545) igt-aux-CRITICAL: Test assertion failure function suspend_v...
(drv_suspend:1545) igt-aux-CRITICAL: Failed assertion: ret == 0
(drv_suspend:1545) igt-aux-CRITICAL: rtcwake failed with 1
...
 airlied_4 / shard-hsw4
(drv_suspend:6112) igt-core-WARNING: [cmd] rtcwake: write error
(drv_suspend:6112) igt-aux-CRITICAL: Test assertion failure function suspend_v...
(drv_suspend:6112) igt-aux-CRITICAL: Failed assertion: ret == 0
(drv_suspend:6112) igt-aux-CRITICAL: rtcwake failed with 1
Check dmesg for further details.
Subtest fence-restore-untiled-hibernate failed.
**** DEBUG ****
(drv_suspend:6112) igt-core-DEBUG: Test requirement passed: !igt_run_in_simula...
(drv_suspend:6112) igt-aux-DEBUG: Test requirement passed: (power_dir = open("...
(drv_suspend:6112) igt-aux-DEBUG: Test requirement passed: get_supported_suspe...
(drv_suspend:6112) igt-aux-DEBUG: Test requirement passed: test == SUSPEND_TES...
(drv_suspend:6112) igt-aux-DEBUG: Test requirement passed: ret == 0
(drv_suspend:6112) igt-core-INFO: [cmd] rtcwake: wakeup from "disk" using /dev...
(drv_suspend:6112) igt-core-WARNING: [cmd] rtcwake: write error
(drv_suspend:6112) igt-aux-CRITICAL: Test assertion failure function suspend_v...
(drv_suspend:6112) igt-aux-CRITICAL: Failed assertion: ret == 0
(drv_suspend:6112) igt-aux-CRITICAL: rtcwake failed with 1
...
 airlied_5 / shard-hsw6
(drv_suspend:4544) igt-core-WARNING: [cmd] rtcwake: write error[cmd] 
(drv_suspend:4544) igt-aux-CRITICAL: Test assertion failure function suspend_v...
(drv_suspend:4544) igt-aux-CRITICAL: Failed assertion: ret == 0
(drv_suspend:4544) igt-aux-CRITICAL: rtcwake failed with 1
Check dmesg for further details.
Subtest fence-restore-untiled-hibernate failed.
**** DEBUG ****
(drv_suspend:4544) igt-core-DEBUG: Test requirement passed: !igt_run_in_simula...
(drv_suspend:4544) igt-aux-DEBUG: Test requirement passed: (power_dir = open("...
(drv_suspend:4544) igt-aux-DEBUG: Test requirement passed: get_supported_suspe...
(drv_suspend:4544) igt-aux-DEBUG: Test requirement passed: test == SUSPEND_TES...
(drv_suspend:4544) igt-aux-DEBUG: Test requirement passed: ret == 0
(drv_suspend:4544) igt-core-INFO: [cmd] rtcwake: wakeup from "disk" using /dev...
(drv_suspend:4544) igt-core-WARNING: [cmd] rtcwake: write error[cmd] 
(drv_suspend:4544) igt-aux-CRITICAL: Test assertion failure function suspend_v...
(drv_suspend:4544) igt-aux-CRITICAL: Failed assertion: ret == 0
(drv_suspend:4544) igt-aux-CRITICAL: rtcwake failed with 1
...
 airlied_6 / shard-hsw6
(drv_suspend:3721) igt-core-WARNING: [cmd] rtcwake: write error
(drv_suspend:3721) igt-aux-WARNING: rtcwake failed with 1
Check dmesg for further details.
(drv_suspend:3721) igt-aux-CRITICAL: Test assertion failure function suspend_v...
(drv_suspend:3721) igt-aux-CRITICAL: Failed assertion: ret == 0
(drv_suspend:3721) igt-aux-CRITICAL: error: 1 != 0
Subtest fence-restore-untiled-hibernate failed.
**** DEBUG ****
(drv_suspend:3721) igt-core-DEBUG: Test requirement passed: !igt_run_in_simula...
(drv_suspend:3721) igt-aux-DEBUG: Test requirement passed: (power_dir = open("...
(drv_suspend:3721) igt-aux-DEBUG: Test requirement passed: get_supported_suspe...
(drv_suspend:3721) igt-aux-DEBUG: Test requirement passed: test == SUSPEND_TES...
(drv_suspend:3721) igt-aux-DEBUG: Test requirement passed: ret == 0
(drv_suspend:3721) igt-core-INFO: [cmd] rtcwake: wakeup from "disk" using /dev...
(drv_suspend:3721) igt-core-WARNING: [cmd] rtcwake: write error
(drv_suspend:3721) igt-aux-WARNING: rtcwake failed with 1
Check dmesg for further details.
...
 airlied_2 / shard-apl2
(drv_suspend:1492) igt-core-WARNING: [cmd] rtcwake: write error
(drv_suspend:1492) igt-aux-CRITICAL: Test assertion failure function suspend_v...
(drv_suspend:1492) igt-aux-CRITICAL: Failed assertion: ret == 0
(drv_suspend:1492) igt-aux-CRITICAL: rtcwake failed with 1
Check dmesg for further details.
Subtest fence-restore-untiled-hibernate failed.
**** DEBUG ****
(drv_suspend:1492) igt-core-DEBUG: Test requirement passed: !igt_run_in_simula...
(drv_suspend:1492) igt-aux-DEBUG: Test requirement passed: (power_dir = open("...
(drv_suspend:1492) igt-aux-DEBUG: Test requirement passed: get_supported_suspe...
(drv_suspend:1492) igt-aux-DEBUG: Test requirement passed: test == SUSPEND_TES...
(drv_suspend:1492) igt-aux-DEBUG: Test requirement passed: ret == 0
(drv_suspend:1492) igt-core-INFO: [cmd] rtcwake: wakeup from "disk" using /dev...
(drv_suspend:1492) igt-core-WARNING: [cmd] rtcwake: write error
(drv_suspend:1492) igt-aux-CRITICAL: Test assertion failure function suspend_v...
(drv_suspend:1492) igt-aux-CRITICAL: Failed assertion: ret == 0
(drv_suspend:1492) igt-aux-CRITICAL: rtcwake failed with 1
...
 airlied_3 / shard-apl1
(drv_suspend:1488) igt-core-WARNING: [cmd] rtcwake: write error
(drv_suspend:1488) igt-aux-CRITICAL: Test assertion failure function suspend_v...
(drv_suspend:1488) igt-aux-CRITICAL: Failed assertion: ret == 0
(drv_suspend:1488) igt-aux-CRITICAL: rtcwake failed with 1
Check dmesg for further details.
Subtest fence-restore-untiled-hibernate failed.
**** DEBUG ****
(drv_suspend:1488) igt-core-DEBUG: Test requirement passed: !igt_run_in_simula...
(drv_suspend:1488) igt-aux-DEBUG: Test requirement passed: (power_dir = open("...
(drv_suspend:1488) igt-aux-DEBUG: Test requirement passed: get_supported_suspe...
(drv_suspend:1488) igt-aux-DEBUG: Test requirement passed: test == SUSPEND_TES...
(drv_suspend:1488) igt-aux-DEBUG: Test requirement passed: ret == 0
(drv_suspend:1488) igt-core-INFO: [cmd] rtcwake: wakeup from "disk" using /dev...
(drv_suspend:1488) igt-core-WARNING: [cmd] rtcwake: write error
(drv_suspend:1488) igt-aux-CRITICAL: Test assertion failure function suspend_v...
(drv_suspend:1488) igt-aux-CRITICAL: Failed assertion: ret == 0
(drv_suspend:1488) igt-aux-CRITICAL: rtcwake failed with 1
...
 airlied_4 / shard-apl7
(drv_suspend:5072) igt-core-WARNING: [cmd] rtcwake: write error
(drv_suspend:5072) igt-aux-CRITICAL: Test assertion failure function suspend_v...
(drv_suspend:5072) igt-aux-CRITICAL: Failed assertion: ret == 0
(drv_suspend:5072) igt-aux-CRITICAL: rtcwake failed with 1
Check dmesg for further details.
Subtest fence-restore-untiled-hibernate failed.
**** DEBUG ****
(drv_suspend:5072) igt-core-DEBUG: Test requirement passed: !igt_run_in_simula...
(drv_suspend:5072) igt-aux-DEBUG: Test requirement passed: (power_dir = open("...
(drv_suspend:5072) igt-aux-DEBUG: Test requirement passed: get_supported_suspe...
(drv_suspend:5072) igt-aux-DEBUG: Test requirement passed: test == SUSPEND_TES...
(drv_suspend:5072) igt-aux-DEBUG: Test requirement passed: ret == 0
(drv_suspend:5072) igt-core-INFO: [cmd] rtcwake: wakeup from "disk" using /dev...
(drv_suspend:5072) igt-core-WARNING: [cmd] rtcwake: write error
(drv_suspend:5072) igt-aux-CRITICAL: Test assertion failure function suspend_v...
(drv_suspend:5072) igt-aux-CRITICAL: Failed assertion: ret == 0
(drv_suspend:5072) igt-aux-CRITICAL: rtcwake failed with 1
...
 airlied_5 / shard-apl6
(drv_suspend:3964) igt-core-WARNING: [cmd] rtcwake: write error
(drv_suspend:3964) igt-aux-CRITICAL: Test assertion failure function suspend_v...
(drv_suspend:3964) igt-aux-CRITICAL: Failed assertion: ret == 0
(drv_suspend:3964) igt-aux-CRITICAL: rtcwake failed with 1
Check dmesg for further details.
Subtest fence-restore-untiled-hibernate failed.
**** DEBUG ****
(drv_suspend:3964) igt-core-DEBUG: Test requirement passed: !igt_run_in_simula...
(drv_suspend:3964) igt-aux-DEBUG: Test requirement passed: (power_dir = open("...
(drv_suspend:3964) igt-aux-DEBUG: Test requirement passed: get_supported_suspe...
(drv_suspend:3964) igt-aux-DEBUG: Test requirement passed: test == SUSPEND_TES...
(drv_suspend:3964) igt-aux-DEBUG: Test requirement passed: ret == 0
(drv_suspend:3964) igt-core-INFO: [cmd] rtcwake: wakeup from "disk" using /dev...
(drv_suspend:3964) igt-core-WARNING: [cmd] rtcwake: write error
(drv_suspend:3964) igt-aux-CRITICAL: Test assertion failure function suspend_v...
(drv_suspend:3964) igt-aux-CRITICAL: Failed assertion: ret == 0
(drv_suspend:3964) igt-aux-CRITICAL: rtcwake failed with 1
...
 airlied_6 / shard-apl7
(drv_suspend:3625) igt-core-WARNING: [cmd] rtcwake: [cmd] write error
(drv_suspend:3625) igt-aux-WARNING: rtcwake failed with 1
Check dmesg for further details.
(drv_suspend:3625) igt-aux-CRITICAL: Test assertion failure function suspend_v...
(drv_suspend:3625) igt-aux-CRITICAL: Failed assertion: ret == 0
(drv_suspend:3625) igt-aux-CRITICAL: error: 1 != 0
Subtest fence-restore-untiled-hibernate failed.
**** DEBUG ****
(drv_suspend:3625) igt-core-DEBUG: Test requirement passed: !igt_run_in_simula...
(drv_suspend:3625) igt-aux-DEBUG: Test requirement passed: (power_dir = open("...
(drv_suspend:3625) igt-aux-DEBUG: Test requirement passed: get_supported_suspe...
(drv_suspend:3625) igt-aux-DEBUG: Test requirement passed: test == SUSPEND_TES...
(drv_suspend:3625) igt-aux-DEBUG: Test requirement passed: ret == 0
(drv_suspend:3625) igt-core-INFO: [cmd] rtcwake: wakeup from "disk" using /dev...
(drv_suspend:3625) igt-core-WARNING: [cmd] rtcwake: [cmd] write error
(drv_suspend:3625) igt-aux-WARNING: rtcwake failed with 1
Check dmesg for further details.
...
 airlied_2 / shard-kbl5
(drv_suspend:1496) igt-core-WARNING: [cmd] rtcwake: write error
(drv_suspend:1496) igt-aux-CRITICAL: Test assertion failure function suspend_v...
(drv_suspend:1496) igt-aux-CRITICAL: Failed assertion: ret == 0
(drv_suspend:1496) igt-aux-CRITICAL: rtcwake failed with 1
Check dmesg for further details.
Subtest fence-restore-untiled-hibernate failed.
**** DEBUG ****
(drv_suspend:1496) igt-core-DEBUG: Test requirement passed: !igt_run_in_simula...
(drv_suspend:1496) igt-aux-DEBUG: Test requirement passed: (power_dir = open("...
(drv_suspend:1496) igt-aux-DEBUG: Test requirement passed: get_supported_suspe...
(drv_suspend:1496) igt-aux-DEBUG: Test requirement passed: test == SUSPEND_TES...
(drv_suspend:1496) igt-aux-DEBUG: Test requirement passed: ret == 0
(drv_suspend:1496) igt-core-INFO: [cmd] rtcwake: wakeup from "disk" using /dev...
(drv_suspend:1496) igt-core-WARNING: [cmd] rtcwake: write error
(drv_suspend:1496) igt-aux-CRITICAL: Test assertion failure function suspend_v...
(drv_suspend:1496) igt-aux-CRITICAL: Failed assertion: ret == 0
(drv_suspend:1496) igt-aux-CRITICAL: rtcwake failed with 1
...
 airlied_3 / shard-kbl7
(drv_suspend:1545) igt-core-WARNING: [cmd] rtcwake: write error
(drv_suspend:1545) igt-aux-CRITICAL: Test assertion failure function suspend_v...
(drv_suspend:1545) igt-aux-CRITICAL: Failed assertion: ret == 0
(drv_suspend:1545) igt-aux-CRITICAL: rtcwake failed with 1
Check dmesg for further details.
Subtest fence-restore-untiled-hibernate failed.
**** DEBUG ****
(drv_suspend:1545) igt-core-DEBUG: Test requirement passed: !igt_run_in_simula...
(drv_suspend:1545) igt-aux-DEBUG: Test requirement passed: (power_dir = open("...
(drv_suspend:1545) igt-aux-DEBUG: Test requirement passed: get_supported_suspe...
(drv_suspend:1545) igt-aux-DEBUG: Test requirement passed: test == SUSPEND_TES...
(drv_suspend:1545) igt-aux-DEBUG: Test requirement passed: ret == 0
(drv_suspend:1545) igt-core-INFO: [cmd] rtcwake: wakeup from "disk" using /dev...
(drv_suspend:1545) igt-core-WARNING: [cmd] rtcwake: write error
(drv_suspend:1545) igt-aux-CRITICAL: Test assertion failure function suspend_v...
(drv_suspend:1545) igt-aux-CRITICAL: Failed assertion: ret == 0
(drv_suspend:1545) igt-aux-CRITICAL: rtcwake failed with 1
...
 airlied_4 / shard-kbl4
(drv_suspend:4172) igt-core-WARNING: [cmd] rtcwake: write error
(drv_suspend:4172) igt-aux-CRITICAL: Test assertion failure function suspend_v...
(drv_suspend:4172) igt-aux-CRITICAL: Failed assertion: ret == 0
(drv_suspend:4172) igt-aux-CRITICAL: rtcwake failed with 1
Check dmesg for further details.
Subtest fence-restore-untiled-hibernate failed.
**** DEBUG ****
(drv_suspend:4172) igt-core-DEBUG: Test requirement passed: !igt_run_in_simula...
(drv_suspend:4172) igt-aux-DEBUG: Test requirement passed: (power_dir = open("...
(drv_suspend:4172) igt-aux-DEBUG: Test requirement passed: get_supported_suspe...
(drv_suspend:4172) igt-aux-DEBUG: Test requirement passed: test == SUSPEND_TES...
(drv_suspend:4172) igt-aux-DEBUG: Test requirement passed: ret == 0
(drv_suspend:4172) igt-core-INFO: [cmd] rtcwake: wakeup from "disk" using /dev...
(drv_suspend:4172) igt-core-WARNING: [cmd] rtcwake: write error
(drv_suspend:4172) igt-aux-CRITICAL: Test assertion failure function suspend_v...
(drv_suspend:4172) igt-aux-CRITICAL: Failed assertion: ret == 0
(drv_suspend:4172) igt-aux-CRITICAL: rtcwake failed with 1
...
 airlied_5 / shard-kbl4
(drv_suspend:3066) igt-core-WARNING: [cmd] rtcwake: write error
(drv_suspend:3066) igt-aux-CRITICAL: Test assertion failure function suspend_v...
(drv_suspend:3066) igt-aux-CRITICAL: Failed assertion: ret == 0
(drv_suspend:3066) igt-aux-CRITICAL: rtcwake failed with 1
Check dmesg for further details.
Subtest fence-restore-untiled-hibernate failed.
**** DEBUG ****
(drv_suspend:3066) igt-core-DEBUG: Test requirement passed: !igt_run_in_simula...
(drv_suspend:3066) igt-aux-DEBUG: Test requirement passed: (power_dir = open("...
(drv_suspend:3066) igt-aux-DEBUG: Test requirement passed: get_supported_suspe...
(drv_suspend:3066) igt-aux-DEBUG: Test requirement passed: test == SUSPEND_TES...
(drv_suspend:3066) igt-aux-DEBUG: Test requirement passed: ret == 0
(drv_suspend:3066) igt-core-INFO: [cmd] rtcwake: wakeup from "disk" using /dev...
(drv_suspend:3066) igt-core-WARNING: [cmd] rtcwake: write error
(drv_suspend:3066) igt-aux-CRITICAL: Test assertion failure function suspend_v...
(drv_suspend:3066) igt-aux-CRITICAL: Failed assertion: ret == 0
(drv_suspend:3066) igt-aux-CRITICAL: rtcwake failed with 1
...
 airlied_6 / shard-kbl6
(drv_suspend:1622) igt-core-WARNING: [cmd] rtcwake: write error
(drv_suspend:1622) igt-aux-WARNING: rtcwake failed with 1
Check dmesg for further details.
(drv_suspend:1622) igt-aux-CRITICAL: Test assertion failure function suspend_v...
(drv_suspend:1622) igt-aux-CRITICAL: Failed assertion: ret == 0
(drv_suspend:1622) igt-aux-CRITICAL: error: 1 != 0
Subtest fence-restore-untiled-hibernate failed.
**** DEBUG ****
(drv_suspend:1622) igt-core-DEBUG: Test requirement passed: !igt_run_in_simula...
(drv_suspend:1622) igt-aux-DEBUG: Test requirement passed: (power_dir = open("...
(drv_suspend:1622) igt-aux-DEBUG: Test requirement passed: get_supported_suspe...
(drv_suspend:1622) igt-aux-DEBUG: Test requirement passed: test == SUSPEND_TES...
(drv_suspend:1622) igt-aux-DEBUG: Test requirement passed: ret == 0
(drv_suspend:1622) igt-core-INFO: [cmd] rtcwake: wakeup from "disk" using /dev...
(drv_suspend:1622) igt-core-WARNING: [cmd] rtcwake: write error
(drv_suspend:1622) igt-aux-WARNING: rtcwake failed with 1
Check dmesg for further details.
...
igt@drv_suspend@forcewake-hibernate
 airlied_2 / shard-snb1
(drv_suspend:6550) igt-core-WARNING: [cmd] rtcwake: [cmd] write error
(drv_suspend:6550) igt-aux-CRITICAL: Test assertion failure function suspend_v...
(drv_suspend:6550) igt-aux-CRITICAL: Failed assertion: ret == 0
(drv_suspend:6550) igt-aux-CRITICAL: Last errno: 2, No such file or directory
(drv_suspend:6550) igt-aux-CRITICAL: rtcwake failed with 1
Check dmesg for further details.
Subtest forcewake-hibernate failed.
**** DEBUG ****
(drv_suspend:6550) igt-debugfs-DEBUG: Opening debugfs directory '/sys/kernel/d...
(drv_suspend:6550) igt-core-DEBUG: Test requirement passed: !igt_run_in_simula...
(drv_suspend:6550) igt-aux-DEBUG: Test requirement passed: (power_dir = open("...
(drv_suspend:6550) igt-aux-DEBUG: Test requirement passed: get_supported_suspe...
(drv_suspend:6550) igt-aux-DEBUG: Test requirement passed: test == SUSPEND_TES...
(drv_suspend:6550) igt-aux-DEBUG: Test requirement passed: ret == 0
(drv_suspend:6550) igt-core-INFO: [cmd] rtcwake: wakeup from "disk" using /dev...
(drv_suspend:6550) igt-core-WARNING: [cmd] rtcwake: [cmd] write error
(drv_suspend:6550) igt-aux-CRITICAL: Test assertion failure function suspend_v...
...
 airlied_3 / shard-snb5
(drv_suspend:5414) igt-core-WARNING: [cmd] rtcwake: write error[cmd] 
(drv_suspend:5414) igt-aux-CRITICAL: Test assertion failure function suspend_v...
(drv_suspend:5414) igt-aux-CRITICAL: Failed assertion: ret == 0
(drv_suspend:5414) igt-aux-CRITICAL: Last errno: 2, No such file or directory
(drv_suspend:5414) igt-aux-CRITICAL: rtcwake failed with 1
Check dmesg for further details.
Subtest forcewake-hibernate failed.
**** DEBUG ****
(drv_suspend:5414) igt-debugfs-DEBUG: Opening debugfs directory '/sys/kernel/d...
(drv_suspend:5414) igt-core-DEBUG: Test requirement passed: !igt_run_in_simula...
(drv_suspend:5414) igt-aux-DEBUG: Test requirement passed: (power_dir = open("...
(drv_suspend:5414) igt-aux-DEBUG: Test requirement passed: get_supported_suspe...
(drv_suspend:5414) igt-aux-DEBUG: Test requirement passed: test == SUSPEND_TES...
(drv_suspend:5414) igt-aux-DEBUG: Test requirement passed: ret == 0
(drv_suspend:5414) igt-core-INFO: [cmd] rtcwake: wakeup from "disk" using /dev...
(drv_suspend:5414) igt-core-WARNING: [cmd] rtcwake: write error[cmd] 
(drv_suspend:5414) igt-aux-CRITICAL: Test assertion failure function suspend_v...
...
 airlied_4 / shard-snb6
(drv_suspend:2564) igt-core-WARNING: [cmd] rtcwake: write error
(drv_suspend:2564) igt-aux-CRITICAL: Test assertion failure function suspend_v...
(drv_suspend:2564) igt-aux-CRITICAL: Failed assertion: ret == 0
(drv_suspend:2564) igt-aux-CRITICAL: Last errno: 2, No such file or directory
(drv_suspend:2564) igt-aux-CRITICAL: rtcwake failed with 1
Check dmesg for further details.
Subtest forcewake-hibernate failed.
**** DEBUG ****
(drv_suspend:2564) igt-debugfs-DEBUG: Opening debugfs directory '/sys/kernel/d...
(drv_suspend:2564) igt-core-DEBUG: Test requirement passed: !igt_run_in_simula...
(drv_suspend:2564) igt-aux-DEBUG: Test requirement passed: (power_dir = open("...
(drv_suspend:2564) igt-aux-DEBUG: Test requirement passed: get_supported_suspe...
(drv_suspend:2564) igt-aux-DEBUG: Test requirement passed: test == SUSPEND_TES...
(drv_suspend:2564) igt-aux-DEBUG: Test requirement passed: ret == 0
(drv_suspend:2564) igt-core-INFO: [cmd] rtcwake: wakeup from "disk" using /dev...
(drv_suspend:2564) igt-core-WARNING: [cmd] rtcwake: write error
(drv_suspend:2564) igt-aux-CRITICAL: Test assertion failure function suspend_v...
...
 airlied_5 / shard-snb4
(drv_suspend:4739) igt-core-WARNING: [cmd] rtcwake: write error
(drv_suspend:4739) igt-aux-CRITICAL: Test assertion failure function suspend_v...
(drv_suspend:4739) igt-aux-CRITICAL: Failed assertion: ret == 0
(drv_suspend:4739) igt-aux-CRITICAL: Last errno: 2, No such file or directory
(drv_suspend:4739) igt-aux-CRITICAL: rtcwake failed with 1
Check dmesg for further details.
Subtest forcewake-hibernate failed.
**** DEBUG ****
(drv_suspend:4739) igt-debugfs-DEBUG: Opening debugfs directory '/sys/kernel/d...
(drv_suspend:4739) igt-core-DEBUG: Test requirement passed: !igt_run_in_simula...
(drv_suspend:4739) igt-aux-DEBUG: Test requirement passed: (power_dir = open("...
(drv_suspend:4739) igt-aux-DEBUG: Test requirement passed: get_supported_suspe...
(drv_suspend:4739) igt-aux-DEBUG: Test requirement passed: test == SUSPEND_TES...
(drv_suspend:4739) igt-aux-DEBUG: Test requirement passed: ret == 0
(drv_suspend:4739) igt-core-INFO: [cmd] rtcwake: wakeup from "disk" using /dev...
(drv_suspend:4739) igt-core-WARNING: [cmd] rtcwake: write error
(drv_suspend:4739) igt-aux-CRITICAL: Test assertion failure function suspend_v...
...
 airlied_6 / shard-snb4
(drv_suspend:3433) igt-core-WARNING: [cmd] rtcwake: write error
(drv_suspend:3433) igt-aux-WARNING: rtcwake failed with 1
Check dmesg for further details.
(drv_suspend:3433) igt-aux-CRITICAL: Test assertion failure function suspend_v...
(drv_suspend:3433) igt-aux-CRITICAL: Failed assertion: ret == 0
(drv_suspend:3433) igt-aux-CRITICAL: error: 1 != 0
Subtest forcewake-hibernate failed.
**** DEBUG ****
(drv_suspend:3433) igt-debugfs-DEBUG: Opening debugfs directory '/sys/kernel/d...
(drv_suspend:3433) igt-core-DEBUG: Test requirement passed: !igt_run_in_simula...
(drv_suspend:3433) igt-aux-DEBUG: Test requirement passed: (power_dir = open("...
(drv_suspend:3433) igt-aux-DEBUG: Test requirement passed: get_supported_suspe...
(drv_suspend:3433) igt-aux-DEBUG: Test requirement passed: test == SUSPEND_TES...
(drv_suspend:3433) igt-aux-DEBUG: Test requirement passed: ret == 0
(drv_suspend:3433) igt-core-INFO: [cmd] rtcwake: wakeup from "disk" using /dev...
(drv_suspend:3433) igt-core-WARNING: [cmd] rtcwake: write error
(drv_suspend:3433) igt-aux-WARNING: rtcwake failed with 1
...
 airlied_2 / shard-hsw4
(drv_suspend:8249) igt-core-WARNING: [cmd] rtcwake: write error[cmd] 
(drv_suspend:8249) igt-aux-CRITICAL: Test assertion failure function suspend_v...
(drv_suspend:8249) igt-aux-CRITICAL: Failed assertion: ret == 0
(drv_suspend:8249) igt-aux-CRITICAL: Last errno: 2, No such file or directory
(drv_suspend:8249) igt-aux-CRITICAL: rtcwake failed with 1
Check dmesg for further details.
Subtest forcewake-hibernate failed.
**** DEBUG ****
(drv_suspend:8249) igt-debugfs-DEBUG: Opening debugfs directory '/sys/kernel/d...
(drv_suspend:8249) igt-core-DEBUG: Test requirement passed: !igt_run_in_simula...
(drv_suspend:8249) igt-aux-DEBUG: Test requirement passed: (power_dir = open("...
(drv_suspend:8249) igt-aux-DEBUG: Test requirement passed: get_supported_suspe...
(drv_suspend:8249) igt-aux-DEBUG: Test requirement passed: test == SUSPEND_TES...
(drv_suspend:8249) igt-aux-DEBUG: Test requirement passed: ret == 0
(drv_suspend:8249) igt-core-INFO: [cmd] rtcwake: wakeup from "disk" using /dev...
(drv_suspend:8249) igt-core-WARNING: [cmd] rtcwake: write error[cmd] 
(drv_suspend:8249) igt-aux-CRITICAL: Test assertion failure function suspend_v...
...
 airlied_3 / shard-hsw3
(drv_suspend:10221) igt-core-WARNING: [cmd] rtcwake: write error
(drv_suspend:10221) igt-aux-CRITICAL: Test assertion failure function suspend_...
(drv_suspend:10221) igt-aux-CRITICAL: Failed assertion: ret == 0
(drv_suspend:10221) igt-aux-CRITICAL: Last errno: 2, No such file or directory
(drv_suspend:10221) igt-aux-CRITICAL: rtcwake failed with 1
Check dmesg for further details.
Subtest forcewake-hibernate failed.
**** DEBUG ****
(drv_suspend:10221) igt-debugfs-DEBUG: Opening debugfs directory '/sys/kernel/...
(drv_suspend:10221) igt-core-DEBUG: Test requirement passed: !igt_run_in_simul...
(drv_suspend:10221) igt-aux-DEBUG: Test requirement passed: (power_dir = open(...
(drv_suspend:10221) igt-aux-DEBUG: Test requirement passed: get_supported_susp...
(drv_suspend:10221) igt-aux-DEBUG: Test requirement passed: test == SUSPEND_TE...
(drv_suspend:10221) igt-aux-DEBUG: Test requirement passed: ret == 0
(drv_suspend:10221) igt-core-INFO: [cmd] rtcwake: wakeup from "disk" using /de...
(drv_suspend:10221) igt-core-WARNING: [cmd] rtcwake: write error
(drv_suspend:10221) igt-aux-CRITICAL: Test assertion failure function suspend_...
...
 airlied_4 / shard-hsw4
(drv_suspend:2555) igt-core-WARNING: [cmd] rtcwake: write error
(drv_suspend:2555) igt-aux-CRITICAL: Test assertion failure function suspend_v...
(drv_suspend:2555) igt-aux-CRITICAL: Failed assertion: ret == 0
(drv_suspend:2555) igt-aux-CRITICAL: Last errno: 2, No such file or directory
(drv_suspend:2555) igt-aux-CRITICAL: rtcwake failed with 1
Check dmesg for further details.
Subtest forcewake-hibernate failed.
**** DEBUG ****
(drv_suspend:2555) igt-debugfs-DEBUG: Opening debugfs directory '/sys/kernel/d...
(drv_suspend:2555) igt-core-DEBUG: Test requirement passed: !igt_run_in_simula...
(drv_suspend:2555) igt-aux-DEBUG: Test requirement passed: (power_dir = open("...
(drv_suspend:2555) igt-aux-DEBUG: Test requirement passed: get_supported_suspe...
(drv_suspend:2555) igt-aux-DEBUG: Test requirement passed: test == SUSPEND_TES...
(drv_suspend:2555) igt-aux-DEBUG: Test requirement passed: ret == 0
(drv_suspend:2555) igt-core-INFO: [cmd] rtcwake: wakeup from "disk" using /dev...
(drv_suspend:2555) igt-core-WARNING: [cmd] rtcwake: write error
(drv_suspend:2555) igt-aux-CRITICAL: Test assertion failure function suspend_v...
...
 airlied_5 / shard-hsw2
(drv_suspend:7485) igt-core-WARNING: [cmd] rtcwake: write error
(drv_suspend:7485) igt-aux-CRITICAL: Test assertion failure function suspend_v...
(drv_suspend:7485) igt-aux-CRITICAL: Failed assertion: ret == 0
(drv_suspend:7485) igt-aux-CRITICAL: Last errno: 2, No such file or directory
(drv_suspend:7485) igt-aux-CRITICAL: rtcwake failed with 1
Check dmesg for further details.
Subtest forcewake-hibernate failed.
**** DEBUG ****
(drv_suspend:7485) igt-debugfs-DEBUG: Opening debugfs directory '/sys/kernel/d...
(drv_suspend:7485) igt-core-DEBUG: Test requirement passed: !igt_run_in_simula...
(drv_suspend:7485) igt-aux-DEBUG: Test requirement passed: (power_dir = open("...
(drv_suspend:7485) igt-aux-DEBUG: Test requirement passed: get_supported_suspe...
(drv_suspend:7485) igt-aux-DEBUG: Test requirement passed: test == SUSPEND_TES...
(drv_suspend:7485) igt-aux-DEBUG: Test requirement passed: ret == 0
(drv_suspend:7485) igt-core-INFO: [cmd] rtcwake: wakeup from "disk" using /dev...
(drv_suspend:7485) igt-core-WARNING: [cmd] rtcwake: write error
(drv_suspend:7485) igt-aux-CRITICAL: Test assertion failure function suspend_v...
...
 airlied_6 / shard-hsw2
(drv_suspend:3478) igt-core-WARNING: [cmd] rtcwake: write error
(drv_suspend:3478) igt-aux-WARNING: rtcwake failed with 1
Check dmesg for further details.
(drv_suspend:3478) igt-aux-CRITICAL: Test assertion failure function suspend_v...
(drv_suspend:3478) igt-aux-CRITICAL: Failed assertion: ret == 0
(drv_suspend:3478) igt-aux-CRITICAL: error: 1 != 0
Subtest forcewake-hibernate failed.
**** DEBUG ****
(drv_suspend:3478) igt-debugfs-DEBUG: Opening debugfs directory '/sys/kernel/d...
(drv_suspend:3478) igt-core-DEBUG: Test requirement passed: !igt_run_in_simula...
(drv_suspend:3478) igt-aux-DEBUG: Test requirement passed: (power_dir = open("...
(drv_suspend:3478) igt-aux-DEBUG: Test requirement passed: get_supported_suspe...
(drv_suspend:3478) igt-aux-DEBUG: Test requirement passed: test == SUSPEND_TES...
(drv_suspend:3478) igt-aux-DEBUG: Test requirement passed: ret == 0
(drv_suspend:3478) igt-core-INFO: [cmd] rtcwake: wakeup from "disk" using /dev...
(drv_suspend:3478) igt-core-WARNING: [cmd] rtcwake: write error
(drv_suspend:3478) igt-aux-WARNING: rtcwake failed with 1
...
 airlied_2 / shard-apl6
(drv_suspend:7573) igt-core-WARNING: [cmd] rtcwake: [cmd] write error
(drv_suspend:7573) igt-aux-CRITICAL: Test assertion failure function suspend_v...
(drv_suspend:7573) igt-aux-CRITICAL: Failed assertion: ret == 0
(drv_suspend:7573) igt-aux-CRITICAL: Last errno: 2, No such file or directory
(drv_suspend:7573) igt-aux-CRITICAL: rtcwake failed with 1
Check dmesg for further details.
Subtest forcewake-hibernate failed.
**** DEBUG ****
(drv_suspend:7573) igt-debugfs-DEBUG: Opening debugfs directory '/sys/kernel/d...
(drv_suspend:7573) igt-core-DEBUG: Test requirement passed: !igt_run_in_simula...
(drv_suspend:7573) igt-aux-DEBUG: Test requirement passed: (power_dir = open("...
(drv_suspend:7573) igt-aux-DEBUG: Test requirement passed: get_supported_suspe...
(drv_suspend:7573) igt-aux-DEBUG: Test requirement passed: test == SUSPEND_TES...
(drv_suspend:7573) igt-aux-DEBUG: Test requirement passed: ret == 0
(drv_suspend:7573) igt-core-INFO: [cmd] rtcwake: wakeup from "disk" using /dev...
(drv_suspend:7573) igt-core-WARNING: [cmd] rtcwake: [cmd] write error
(drv_suspend:7573) igt-aux-CRITICAL: Test assertion failure function suspend_v...
...
 airlied_3 / shard-apl8
(drv_suspend:6632) igt-core-WARNING: [cmd] rtcwake: write error
(drv_suspend:6632) igt-aux-CRITICAL: Test assertion failure function suspend_v...
(drv_suspend:6632) igt-aux-CRITICAL: Failed assertion: ret == 0
(drv_suspend:6632) igt-aux-CRITICAL: Last errno: 2, No such file or directory
(drv_suspend:6632) igt-aux-CRITICAL: rtcwake failed with 1
Check dmesg for further details.
Subtest forcewake-hibernate failed.
**** DEBUG ****
(drv_suspend:6632) igt-debugfs-DEBUG: Opening debugfs directory '/sys/kernel/d...
(drv_suspend:6632) igt-core-DEBUG: Test requirement passed: !igt_run_in_simula...
(drv_suspend:6632) igt-aux-DEBUG: Test requirement passed: (power_dir = open("...
(drv_suspend:6632) igt-aux-DEBUG: Test requirement passed: get_supported_suspe...
(drv_suspend:6632) igt-aux-DEBUG: Test requirement passed: test == SUSPEND_TES...
(drv_suspend:6632) igt-aux-DEBUG: Test requirement passed: ret == 0
(drv_suspend:6632) igt-core-INFO: [cmd] rtcwake: wakeup from "disk" using /dev...
(drv_suspend:6632) igt-core-WARNING: [cmd] rtcwake: write error
(drv_suspend:6632) igt-aux-CRITICAL: Test assertion failure function suspend_v...
...
 airlied_4 / shard-apl1
(drv_suspend:2659) igt-core-WARNING: [cmd] rtcwake: write error
(drv_suspend:2659) igt-aux-CRITICAL: Test assertion failure function suspend_v...
(drv_suspend:2659) igt-aux-CRITICAL: Failed assertion: ret == 0
(drv_suspend:2659) igt-aux-CRITICAL: Last errno: 2, No such file or directory
(drv_suspend:2659) igt-aux-CRITICAL: rtcwake failed with 1
Check dmesg for further details.
Subtest forcewake-hibernate failed.
**** DEBUG ****
(drv_suspend:2659) igt-debugfs-DEBUG: Opening debugfs directory '/sys/kernel/d...
(drv_suspend:2659) igt-core-DEBUG: Test requirement passed: !igt_run_in_simula...
(drv_suspend:2659) igt-aux-DEBUG: Test requirement passed: (power_dir = open("...
(drv_suspend:2659) igt-aux-DEBUG: Test requirement passed: get_supported_suspe...
(drv_suspend:2659) igt-aux-DEBUG: Test requirement passed: test == SUSPEND_TES...
(drv_suspend:2659) igt-aux-DEBUG: Test requirement passed: ret == 0
(drv_suspend:2659) igt-core-INFO: [cmd] rtcwake: wakeup from "disk" using /dev...
(drv_suspend:2659) igt-core-WARNING: [cmd] rtcwake: write error
(drv_suspend:2659) igt-aux-CRITICAL: Test assertion failure function suspend_v...
...
 airlied_5 / shard-apl1
(drv_suspend:5509) igt-core-WARNING: [cmd] rtcwake: write error
(drv_suspend:5509) igt-aux-CRITICAL: Test assertion failure function suspend_v...
(drv_suspend:5509) igt-aux-CRITICAL: Failed assertion: ret == 0
(drv_suspend:5509) igt-aux-CRITICAL: Last errno: 2, No such file or directory
(drv_suspend:5509) igt-aux-CRITICAL: rtcwake failed with 1
Check dmesg for further details.
Subtest forcewake-hibernate failed.
**** DEBUG ****
(drv_suspend:5509) igt-debugfs-DEBUG: Opening debugfs directory '/sys/kernel/d...
(drv_suspend:5509) igt-core-DEBUG: Test requirement passed: !igt_run_in_simula...
(drv_suspend:5509) igt-aux-DEBUG: Test requirement passed: (power_dir = open("...
(drv_suspend:5509) igt-aux-DEBUG: Test requirement passed: get_supported_suspe...
(drv_suspend:5509) igt-aux-DEBUG: Test requirement passed: test == SUSPEND_TES...
(drv_suspend:5509) igt-aux-DEBUG: Test requirement passed: ret == 0
(drv_suspend:5509) igt-core-INFO: [cmd] rtcwake: wakeup from "disk" using /dev...
(drv_suspend:5509) igt-core-WARNING: [cmd] rtcwake: write error
(drv_suspend:5509) igt-aux-CRITICAL: Test assertion failure function suspend_v...
...
 airlied_6 / shard-apl2
(drv_suspend:6418) igt-core-WARNING: [cmd] rtcwake: write error
(drv_suspend:6418) igt-aux-WARNING: rtcwake failed with 1
Check dmesg for further details.
(drv_suspend:6418) igt-aux-CRITICAL: Test assertion failure function suspend_v...
(drv_suspend:6418) igt-aux-CRITICAL: Failed assertion: ret == 0
(drv_suspend:6418) igt-aux-CRITICAL: error: 1 != 0
Subtest forcewake-hibernate failed.
**** DEBUG ****
(drv_suspend:6418) igt-debugfs-DEBUG: Opening debugfs directory '/sys/kernel/d...
(drv_suspend:6418) igt-core-DEBUG: Test requirement passed: !igt_run_in_simula...
(drv_suspend:6418) igt-aux-DEBUG: Test requirement passed: (power_dir = open("...
(drv_suspend:6418) igt-aux-DEBUG: Test requirement passed: get_supported_suspe...
(drv_suspend:6418) igt-aux-DEBUG: Test requirement passed: test == SUSPEND_TES...
(drv_suspend:6418) igt-aux-DEBUG: Test requirement passed: ret == 0
(drv_suspend:6418) igt-core-INFO: [cmd] rtcwake: wakeup from "disk" using /dev...
(drv_suspend:6418) igt-core-WARNING: [cmd] rtcwake: write error
(drv_suspend:6418) igt-aux-WARNING: rtcwake failed with 1
...
 airlied_2 / shard-kbl6
(drv_suspend:2016) igt-core-WARNING: [cmd] rtcwake: [cmd] write error
(drv_suspend:2016) igt-aux-CRITICAL: Test assertion failure function suspend_v...
(drv_suspend:2016) igt-aux-CRITICAL: Failed assertion: ret == 0
(drv_suspend:2016) igt-aux-CRITICAL: Last errno: 2, No such file or directory
(drv_suspend:2016) igt-aux-CRITICAL: rtcwake failed with 1
Check dmesg for further details.
Subtest forcewake-hibernate failed.
**** DEBUG ****
(drv_suspend:2016) igt-debugfs-DEBUG: Opening debugfs directory '/sys/kernel/d...
(drv_suspend:2016) igt-core-DEBUG: Test requirement passed: !igt_run_in_simula...
(drv_suspend:2016) igt-aux-DEBUG: Test requirement passed: (power_dir = open("...
(drv_suspend:2016) igt-aux-DEBUG: Test requirement passed: get_supported_suspe...
(drv_suspend:2016) igt-aux-DEBUG: Test requirement passed: test == SUSPEND_TES...
(drv_suspend:2016) igt-aux-DEBUG: Test requirement passed: ret == 0
(drv_suspend:2016) igt-core-INFO: [cmd] rtcwake: wakeup from "disk" using /dev...
(drv_suspend:2016) igt-core-WARNING: [cmd] rtcwake: [cmd] write error
(drv_suspend:2016) igt-aux-CRITICAL: Test assertion failure function suspend_v...
...
 airlied_3 / shard-kbl2
(drv_suspend:2031) igt-core-WARNING: [cmd] rtcwake: [cmd] write error
(drv_suspend:2031) igt-aux-CRITICAL: Test assertion failure function suspend_v...
(drv_suspend:2031) igt-aux-CRITICAL: Failed assertion: ret == 0
(drv_suspend:2031) igt-aux-CRITICAL: Last errno: 2, No such file or directory
(drv_suspend:2031) igt-aux-CRITICAL: rtcwake failed with 1
Check dmesg for further details.
Subtest forcewake-hibernate failed.
**** DEBUG ****
(drv_suspend:2031) igt-debugfs-DEBUG: Opening debugfs directory '/sys/kernel/d...
(drv_suspend:2031) igt-core-DEBUG: Test requirement passed: !igt_run_in_simula...
(drv_suspend:2031) igt-aux-DEBUG: Test requirement passed: (power_dir = open("...
(drv_suspend:2031) igt-aux-DEBUG: Test requirement passed: get_supported_suspe...
(drv_suspend:2031) igt-aux-DEBUG: Test requirement passed: test == SUSPEND_TES...
(drv_suspend:2031) igt-aux-DEBUG: Test requirement passed: ret == 0
(drv_suspend:2031) igt-core-INFO: [cmd] rtcwake: wakeup from "disk" using /dev...
(drv_suspend:2031) igt-core-WARNING: [cmd] rtcwake: [cmd] write error
(drv_suspend:2031) igt-aux-CRITICAL: Test assertion failure function suspend_v...
...
 airlied_4 / shard-kbl6
(drv_suspend:1610) igt-core-WARNING: [cmd] rtcwake: [cmd] write error
(drv_suspend:1610) igt-aux-CRITICAL: Test assertion failure function suspend_v...
(drv_suspend:1610) igt-aux-CRITICAL: Failed assertion: ret == 0
(drv_suspend:1610) igt-aux-CRITICAL: Last errno: 2, No such file or directory
(drv_suspend:1610) igt-aux-CRITICAL: rtcwake failed with 1
Check dmesg for further details.
Subtest forcewake-hibernate failed.
**** DEBUG ****
(drv_suspend:1610) igt-debugfs-DEBUG: Opening debugfs directory '/sys/kernel/d...
(drv_suspend:1610) igt-core-DEBUG: Test requirement passed: !igt_run_in_simula...
(drv_suspend:1610) igt-aux-DEBUG: Test requirement passed: (power_dir = open("...
(drv_suspend:1610) igt-aux-DEBUG: Test requirement passed: get_supported_suspe...
(drv_suspend:1610) igt-aux-DEBUG: Test requirement passed: test == SUSPEND_TES...
(drv_suspend:1610) igt-aux-DEBUG: Test requirement passed: ret == 0
(drv_suspend:1610) igt-core-INFO: [cmd] rtcwake: wakeup from "disk" using /dev...
(drv_suspend:1610) igt-core-WARNING: [cmd] rtcwake: [cmd] write error
(drv_suspend:1610) igt-aux-CRITICAL: Test assertion failure function suspend_v...
...
 airlied_5 / shard-kbl2
(drv_suspend:1427) igt-core-WARNING: [cmd] rtcwake: write error
(drv_suspend:1427) igt-aux-CRITICAL: Test assertion failure function suspend_v...
(drv_suspend:1427) igt-aux-CRITICAL: Failed assertion: ret == 0
(drv_suspend:1427) igt-aux-CRITICAL: Last errno: 2, No such file or directory
(drv_suspend:1427) igt-aux-CRITICAL: rtcwake failed with 1
Check dmesg for further details.
Subtest forcewake-hibernate failed.
**** DEBUG ****
(drv_suspend:1427) igt-debugfs-DEBUG: Opening debugfs directory '/sys/kernel/d...
(drv_suspend:1427) igt-core-DEBUG: Test requirement passed: !igt_run_in_simula...
(drv_suspend:1427) igt-aux-DEBUG: Test requirement passed: (power_dir = open("...
(drv_suspend:1427) igt-aux-DEBUG: Test requirement passed: get_supported_suspe...
(drv_suspend:1427) igt-aux-DEBUG: Test requirement passed: test == SUSPEND_TES...
(drv_suspend:1427) igt-aux-DEBUG: Test requirement passed: ret == 0
(drv_suspend:1427) igt-core-INFO: [cmd] rtcwake: wakeup from "disk" using /dev...
(drv_suspend:1427) igt-core-WARNING: [cmd] rtcwake: write error
(drv_suspend:1427) igt-aux-CRITICAL: Test assertion failure function suspend_v...
...
 airlied_6 / shard-kbl5
(drv_suspend:1501) igt-core-WARNING: [cmd] rtcwake: write error
(drv_suspend:1501) igt-aux-WARNING: rtcwake failed with 1
Check dmesg for further details.
(drv_suspend:1501) igt-aux-CRITICAL: Test assertion failure function suspend_v...
(drv_suspend:1501) igt-aux-CRITICAL: Failed assertion: ret == 0
(drv_suspend:1501) igt-aux-CRITICAL: error: 1 != 0
Subtest forcewake-hibernate failed.
**** DEBUG ****
(drv_suspend:1501) igt-debugfs-DEBUG: Opening debugfs directory '/sys/kernel/d...
(drv_suspend:1501) igt-core-DEBUG: Test requirement passed: !igt_run_in_simula...
(drv_suspend:1501) igt-aux-DEBUG: Test requirement passed: (power_dir = open("...
(drv_suspend:1501) igt-aux-DEBUG: Test requirement passed: get_supported_suspe...
(drv_suspend:1501) igt-aux-DEBUG: Test requirement passed: test == SUSPEND_TES...
(drv_suspend:1501) igt-aux-DEBUG: Test requirement passed: ret == 0
(drv_suspend:1501) igt-core-INFO: [cmd] rtcwake: wakeup from "disk" using /dev...
(drv_suspend:1501) igt-core-WARNING: [cmd] rtcwake: write error
(drv_suspend:1501) igt-aux-WARNING: rtcwake failed with 1
...
igt@drv_suspend@sysfs-reader-hibernate
 airlied_2 / shard-snb6
(drv_suspend:7402) igt-core-WARNING: [cmd] rtcwake: write error
(drv_suspend:7402) igt-aux-CRITICAL: Test assertion failure function suspend_v...
(drv_suspend:7402) igt-aux-CRITICAL: Failed assertion: ret == 0
(drv_suspend:7402) igt-aux-CRITICAL: rtcwake failed with 1
Check dmesg for further details.
Subtest sysfs-reader-hibernate failed.
**** DEBUG ****
(drv_suspend:7402) igt-core-DEBUG: Test requirement passed: !igt_run_in_simula...
(drv_suspend:7402) igt-aux-DEBUG: Test requirement passed: (power_dir = open("...
(drv_suspend:7402) igt-aux-DEBUG: Test requirement passed: get_supported_suspe...
(drv_suspend:7402) igt-aux-DEBUG: Test requirement passed: test == SUSPEND_TES...
(drv_suspend:7402) igt-aux-DEBUG: Test requirement passed: ret == 0
(drv_suspend:7402) igt-core-INFO: [cmd] rtcwake: wakeup from "disk" using /dev...
(drv_suspend:7402) igt-core-WARNING: [cmd] rtcwake: write error
(drv_suspend:7402) igt-aux-CRITICAL: Test assertion failure function suspend_v...
(drv_suspend:7402) igt-aux-CRITICAL: Failed assertion: ret == 0
(drv_suspend:7402) igt-aux-CRITICAL: rtcwake failed with 1
...
 airlied_3 / shard-snb3
(drv_suspend:8099) igt-core-WARNING: [cmd] rtcwake: write error
(drv_suspend:8099) igt-aux-CRITICAL: Test assertion failure function suspend_v...
(drv_suspend:8099) igt-aux-CRITICAL: Failed assertion: ret == 0
(drv_suspend:8099) igt-aux-CRITICAL: rtcwake failed with 1
Check dmesg for further details.
Subtest sysfs-reader-hibernate failed.
**** DEBUG ****
(drv_suspend:8099) igt-core-DEBUG: Test requirement passed: !igt_run_in_simula...
(drv_suspend:8099) igt-aux-DEBUG: Test requirement passed: (power_dir = open("...
(drv_suspend:8099) igt-aux-DEBUG: Test requirement passed: get_supported_suspe...
(drv_suspend:8099) igt-aux-DEBUG: Test requirement passed: test == SUSPEND_TES...
(drv_suspend:8099) igt-aux-DEBUG: Test requirement passed: ret == 0
(drv_suspend:8099) igt-core-INFO: [cmd] rtcwake: wakeup from "disk" using /dev...
(drv_suspend:8099) igt-core-WARNING: [cmd] rtcwake: write error
(drv_suspend:8099) igt-aux-CRITICAL: Test assertion failure function suspend_v...
(drv_suspend:8099) igt-aux-CRITICAL: Failed assertion: ret == 0
(drv_suspend:8099) igt-aux-CRITICAL: rtcwake failed with 1
...
 airlied_4 / shard-snb4
(drv_suspend:1576) igt-core-WARNING: [cmd] rtcwake: write error
(drv_suspend:1576) igt-aux-CRITICAL: Test assertion failure function suspend_v...
(drv_suspend:1576) igt-aux-CRITICAL: Failed assertion: ret == 0
(drv_suspend:1576) igt-aux-CRITICAL: rtcwake failed with 1
Check dmesg for further details.
Subtest sysfs-reader-hibernate failed.
**** DEBUG ****
(drv_suspend:1576) igt-core-DEBUG: Test requirement passed: !igt_run_in_simula...
(drv_suspend:1576) igt-aux-DEBUG: Test requirement passed: (power_dir = open("...
(drv_suspend:1576) igt-aux-DEBUG: Test requirement passed: get_supported_suspe...
(drv_suspend:1576) igt-aux-DEBUG: Test requirement passed: test == SUSPEND_TES...
(drv_suspend:1576) igt-aux-DEBUG: Test requirement passed: ret == 0
(drv_suspend:1576) igt-core-INFO: [cmd] rtcwake: wakeup from "disk" using /dev...
(drv_suspend:1576) igt-core-WARNING: [cmd] rtcwake: write error
(drv_suspend:1576) igt-aux-CRITICAL: Test assertion failure function suspend_v...
(drv_suspend:1576) igt-aux-CRITICAL: Failed assertion: ret == 0
(drv_suspend:1576) igt-aux-CRITICAL: rtcwake failed with 1
...
 airlied_5 / shard-snb3
(drv_suspend:1717) igt-core-WARNING: [cmd] rtcwake: write error
(drv_suspend:1717) igt-aux-CRITICAL: Test assertion failure function suspend_v...
(drv_suspend:1717) igt-aux-CRITICAL: Failed assertion: ret == 0
(drv_suspend:1717) igt-aux-CRITICAL: rtcwake failed with 1
Check dmesg for further details.
Subtest sysfs-reader-hibernate failed.
**** DEBUG ****
(drv_suspend:1717) igt-core-DEBUG: Test requirement passed: !igt_run_in_simula...
(drv_suspend:1717) igt-aux-DEBUG: Test requirement passed: (power_dir = open("...
(drv_suspend:1717) igt-aux-DEBUG: Test requirement passed: get_supported_suspe...
(drv_suspend:1717) igt-aux-DEBUG: Test requirement passed: test == SUSPEND_TES...
(drv_suspend:1717) igt-aux-DEBUG: Test requirement passed: ret == 0
(drv_suspend:1717) igt-core-INFO: [cmd] rtcwake: wakeup from "disk" using /dev...
(drv_suspend:1717) igt-core-WARNING: [cmd] rtcwake: write error
(drv_suspend:1717) igt-aux-CRITICAL: Test assertion failure function suspend_v...
(drv_suspend:1717) igt-aux-CRITICAL: Failed assertion: ret == 0
(drv_suspend:1717) igt-aux-CRITICAL: rtcwake failed with 1
...
 airlied_6 / shard-snb6
(drv_suspend:4573) igt-core-WARNING: [cmd] rtcwake: write error
(drv_suspend:4573) igt-aux-WARNING: rtcwake failed with 1
Check dmesg for further details.
(drv_suspend:4573) igt-aux-CRITICAL: Test assertion failure function suspend_v...
(drv_suspend:4573) igt-aux-CRITICAL: Failed assertion: ret == 0
(drv_suspend:4573) igt-aux-CRITICAL: error: 1 != 0
Subtest sysfs-reader-hibernate failed.
**** DEBUG ****
(drv_suspend:4573) igt-core-DEBUG: Test requirement passed: !igt_run_in_simula...
(drv_suspend:4573) igt-aux-DEBUG: Test requirement passed: (power_dir = open("...
(drv_suspend:4573) igt-aux-DEBUG: Test requirement passed: get_supported_suspe...
(drv_suspend:4573) igt-aux-DEBUG: Test requirement passed: test == SUSPEND_TES...
(drv_suspend:4573) igt-aux-DEBUG: Test requirement passed: ret == 0
(drv_suspend:4573) igt-core-INFO: [cmd] rtcwake: wakeup from "disk" using /dev...
(drv_suspend:4573) igt-core-WARNING: [cmd] rtcwake: write error
(drv_suspend:4573) igt-aux-WARNING: rtcwake failed with 1
Check dmesg for further details.
...
 airlied_2 / shard-hsw2
(drv_suspend:8940) igt-core-WARNING: [cmd] rtcwake: write error
(drv_suspend:8940) igt-aux-CRITICAL: Test assertion failure function suspend_v...
(drv_suspend:8940) igt-aux-CRITICAL: Failed assertion: ret == 0
(drv_suspend:8940) igt-aux-CRITICAL: rtcwake failed with 1
Check dmesg for further details.
Subtest sysfs-reader-hibernate failed.
**** DEBUG ****
(drv_suspend:8940) igt-core-DEBUG: Test requirement passed: !igt_run_in_simula...
(drv_suspend:8940) igt-aux-DEBUG: Test requirement passed: (power_dir = open("...
(drv_suspend:8940) igt-aux-DEBUG: Test requirement passed: get_supported_suspe...
(drv_suspend:8940) igt-aux-DEBUG: Test requirement passed: test == SUSPEND_TES...
(drv_suspend:8940) igt-aux-DEBUG: Test requirement passed: ret == 0
(drv_suspend:8940) igt-core-INFO: [cmd] rtcwake: wakeup from "disk" using /dev...
(drv_suspend:8940) igt-core-WARNING: [cmd] rtcwake: write error
(drv_suspend:8940) igt-aux-CRITICAL: Test assertion failure function suspend_v...
(drv_suspend:8940) igt-aux-CRITICAL: Failed assertion: ret == 0
(drv_suspend:8940) igt-aux-CRITICAL: rtcwake failed with 1
...
 airlied_3 / shard-hsw4
(drv_suspend:10817) igt-core-WARNING: [cmd] rtcwake: write error
(drv_suspend:10817) igt-aux-CRITICAL: Test assertion failure function suspend_...
(drv_suspend:10817) igt-aux-CRITICAL: Failed assertion: ret == 0
(drv_suspend:10817) igt-aux-CRITICAL: rtcwake failed with 1
Check dmesg for further details.
Subtest sysfs-reader-hibernate failed.
**** DEBUG ****
(drv_suspend:10817) igt-core-DEBUG: Test requirement passed: !igt_run_in_simul...
(drv_suspend:10817) igt-aux-DEBUG: Test requirement passed: (power_dir = open(...
(drv_suspend:10817) igt-aux-DEBUG: Test requirement passed: get_supported_susp...
(drv_suspend:10817) igt-aux-DEBUG: Test requirement passed: test == SUSPEND_TE...
(drv_suspend:10817) igt-aux-DEBUG: Test requirement passed: ret == 0
(drv_suspend:10817) igt-core-INFO: [cmd] rtcwake: wakeup from "disk" using /de...
(drv_suspend:10817) igt-core-WARNING: [cmd] rtcwake: write error
(drv_suspend:10817) igt-aux-CRITICAL: Test assertion failure function suspend_...
(drv_suspend:10817) igt-aux-CRITICAL: Failed assertion: ret == 0
(drv_suspend:10817) igt-aux-CRITICAL: rtcwake failed with 1
...
 airlied_4 / shard-hsw3
(drv_suspend:1564) igt-core-WARNING: [cmd] rtcwake: write error[cmd] 
(drv_suspend:1564) igt-aux-CRITICAL: Test assertion failure function suspend_v...
(drv_suspend:1564) igt-aux-CRITICAL: Failed assertion: ret == 0
(drv_suspend:1564) igt-aux-CRITICAL: rtcwake failed with 1
Check dmesg for further details.
Subtest sysfs-reader-hibernate failed.
**** DEBUG ****
(drv_suspend:1564) igt-core-DEBUG: Test requirement passed: !igt_run_in_simula...
(drv_suspend:1564) igt-aux-DEBUG: Test requirement passed: (power_dir = open("...
(drv_suspend:1564) igt-aux-DEBUG: Test requirement passed: get_supported_suspe...
(drv_suspend:1564) igt-aux-DEBUG: Test requirement passed: test == SUSPEND_TES...
(drv_suspend:1564) igt-aux-DEBUG: Test requirement passed: ret == 0
(drv_suspend:1564) igt-core-INFO: [cmd] rtcwake: wakeup from "disk" using /dev...
(drv_suspend:1564) igt-core-WARNING: [cmd] rtcwake: write error[cmd] 
(drv_suspend:1564) igt-aux-CRITICAL: Test assertion failure function suspend_v...
(drv_suspend:1564) igt-aux-CRITICAL: Failed assertion: ret == 0
(drv_suspend:1564) igt-aux-CRITICAL: rtcwake failed with 1
...
 airlied_5 / shard-hsw6
(drv_suspend:1710) igt-core-WARNING: [cmd] rtcwake: write error
(drv_suspend:1710) igt-aux-CRITICAL: Test assertion failure function suspend_v...
(drv_suspend:1710) igt-aux-CRITICAL: Failed assertion: ret == 0
(drv_suspend:1710) igt-aux-CRITICAL: rtcwake failed with 1
Check dmesg for further details.
Subtest sysfs-reader-hibernate failed.
**** DEBUG ****
(drv_suspend:1710) igt-core-DEBUG: Test requirement passed: !igt_run_in_simula...
(drv_suspend:1710) igt-aux-DEBUG: Test requirement passed: (power_dir = open("...
(drv_suspend:1710) igt-aux-DEBUG: Test requirement passed: get_supported_suspe...
(drv_suspend:1710) igt-aux-DEBUG: Test requirement passed: test == SUSPEND_TES...
(drv_suspend:1710) igt-aux-DEBUG: Test requirement passed: ret == 0
(drv_suspend:1710) igt-core-INFO: [cmd] rtcwake: wakeup from "disk" using /dev...
(drv_suspend:1710) igt-core-WARNING: [cmd] rtcwake: write error
(drv_suspend:1710) igt-aux-CRITICAL: Test assertion failure function suspend_v...
(drv_suspend:1710) igt-aux-CRITICAL: Failed assertion: ret == 0
(drv_suspend:1710) igt-aux-CRITICAL: rtcwake failed with 1
...
 airlied_6 / shard-hsw5
(drv_suspend:4590) igt-core-WARNING: [cmd] rtcwake: write error
(drv_suspend:4590) igt-aux-WARNING: rtcwake failed with 1
Check dmesg for further details.
(drv_suspend:4590) igt-aux-CRITICAL: Test assertion failure function suspend_v...
(drv_suspend:4590) igt-aux-CRITICAL: Failed assertion: ret == 0
(drv_suspend:4590) igt-aux-CRITICAL: error: 1 != 0
Subtest sysfs-reader-hibernate failed.
**** DEBUG ****
(drv_suspend:4590) igt-core-DEBUG: Test requirement passed: !igt_run_in_simula...
(drv_suspend:4590) igt-aux-DEBUG: Test requirement passed: (power_dir = open("...
(drv_suspend:4590) igt-aux-DEBUG: Test requirement passed: get_supported_suspe...
(drv_suspend:4590) igt-aux-DEBUG: Test requirement passed: test == SUSPEND_TES...
(drv_suspend:4590) igt-aux-DEBUG: Test requirement passed: ret == 0
(drv_suspend:4590) igt-core-INFO: [cmd] rtcwake: wakeup from "disk" using /dev...
(drv_suspend:4590) igt-core-WARNING: [cmd] rtcwake: write error
(drv_suspend:4590) igt-aux-WARNING: rtcwake failed with 1
Check dmesg for further details.
...
 airlied_2 / shard-apl3
(drv_suspend:4417) igt-core-WARNING: [cmd] rtcwake: write error
(drv_suspend:4417) igt-aux-CRITICAL: Test assertion failure function suspend_v...
(drv_suspend:4417) igt-aux-CRITICAL: Failed assertion: ret == 0
(drv_suspend:4417) igt-aux-CRITICAL: rtcwake failed with 1
Check dmesg for further details.
Subtest sysfs-reader-hibernate failed.
**** DEBUG ****
(drv_suspend:4417) igt-core-DEBUG: Test requirement passed: !igt_run_in_simula...
(drv_suspend:4417) igt-aux-DEBUG: Test requirement passed: (power_dir = open("...
(drv_suspend:4417) igt-aux-DEBUG: Test requirement passed: get_supported_suspe...
(drv_suspend:4417) igt-aux-DEBUG: Test requirement passed: test == SUSPEND_TES...
(drv_suspend:4417) igt-aux-DEBUG: Test requirement passed: ret == 0
(drv_suspend:4417) igt-core-INFO: [cmd] rtcwake: wakeup from "disk" using /dev...
(drv_suspend:4417) igt-core-WARNING: [cmd] rtcwake: write error
(drv_suspend:4417) igt-aux-CRITICAL: Test assertion failure function suspend_v...
(drv_suspend:4417) igt-aux-CRITICAL: Failed assertion: ret == 0
(drv_suspend:4417) igt-aux-CRITICAL: rtcwake failed with 1
...
 airlied_3 / shard-apl1
(drv_suspend:4641) igt-core-WARNING: [cmd] rtcwake: write error
(drv_suspend:4641) igt-aux-CRITICAL: Test assertion failure function suspend_v...
(drv_suspend:4641) igt-aux-CRITICAL: Failed assertion: ret == 0
(drv_suspend:4641) igt-aux-CRITICAL: rtcwake failed with 1
Check dmesg for further details.
Subtest sysfs-reader-hibernate failed.
**** DEBUG ****
(drv_suspend:4641) igt-core-DEBUG: Test requirement passed: !igt_run_in_simula...
(drv_suspend:4641) igt-aux-DEBUG: Test requirement passed: (power_dir = open("...
(drv_suspend:4641) igt-aux-DEBUG: Test requirement passed: get_supported_suspe...
(drv_suspend:4641) igt-aux-DEBUG: Test requirement passed: test == SUSPEND_TES...
(drv_suspend:4641) igt-aux-DEBUG: Test requirement passed: ret == 0
(drv_suspend:4641) igt-core-INFO: [cmd] rtcwake: wakeup from "disk" using /dev...
(drv_suspend:4641) igt-core-WARNING: [cmd] rtcwake: write error
(drv_suspend:4641) igt-aux-CRITICAL: Test assertion failure function suspend_v...
(drv_suspend:4641) igt-aux-CRITICAL: Failed assertion: ret == 0
(drv_suspend:4641) igt-aux-CRITICAL: rtcwake failed with 1
...
 airlied_4 / shard-apl6
(drv_suspend:1517) igt-core-WARNING: [cmd] rtcwake: write error
(drv_suspend:1517) igt-aux-CRITICAL: Test assertion failure function suspend_v...
(drv_suspend:1517) igt-aux-CRITICAL: Failed assertion: ret == 0
(drv_suspend:1517) igt-aux-CRITICAL: rtcwake failed with 1
Check dmesg for further details.
Subtest sysfs-reader-hibernate failed.
**** DEBUG ****
(drv_suspend:1517) igt-core-DEBUG: Test requirement passed: !igt_run_in_simula...
(drv_suspend:1517) igt-aux-DEBUG: Test requirement passed: (power_dir = open("...
(drv_suspend:1517) igt-aux-DEBUG: Test requirement passed: get_supported_suspe...
(drv_suspend:1517) igt-aux-DEBUG: Test requirement passed: test == SUSPEND_TES...
(drv_suspend:1517) igt-aux-DEBUG: Test requirement passed: ret == 0
(drv_suspend:1517) igt-core-INFO: [cmd] rtcwake: wakeup from "disk" using /dev...
(drv_suspend:1517) igt-core-WARNING: [cmd] rtcwake: write error
(drv_suspend:1517) igt-aux-CRITICAL: Test assertion failure function suspend_v...
(drv_suspend:1517) igt-aux-CRITICAL: Failed assertion: ret == 0
(drv_suspend:1517) igt-aux-CRITICAL: rtcwake failed with 1
...
 airlied_5 / shard-apl4
(drv_suspend:1618) igt-core-WARNING: [cmd] rtcwake: write error
(drv_suspend:1618) igt-aux-CRITICAL: Test assertion failure function suspend_v...
(drv_suspend:1618) igt-aux-CRITICAL: Failed assertion: ret == 0
(drv_suspend:1618) igt-aux-CRITICAL: rtcwake failed with 1
Check dmesg for further details.
Subtest sysfs-reader-hibernate failed.
**** DEBUG ****
(drv_suspend:1618) igt-core-DEBUG: Test requirement passed: !igt_run_in_simula...
(drv_suspend:1618) igt-aux-DEBUG: Test requirement passed: (power_dir = open("...
(drv_suspend:1618) igt-aux-DEBUG: Test requirement passed: get_supported_suspe...
(drv_suspend:1618) igt-aux-DEBUG: Test requirement passed: test == SUSPEND_TES...
(drv_suspend:1618) igt-aux-DEBUG: Test requirement passed: ret == 0
(drv_suspend:1618) igt-core-INFO: [cmd] rtcwake: wakeup from "disk" using /dev...
(drv_suspend:1618) igt-core-WARNING: [cmd] rtcwake: write error
(drv_suspend:1618) igt-aux-CRITICAL: Test assertion failure function suspend_v...
(drv_suspend:1618) igt-aux-CRITICAL: Failed assertion: ret == 0
(drv_suspend:1618) igt-aux-CRITICAL: rtcwake failed with 1
...
 airlied_6 / shard-apl2
(drv_suspend:4494) igt-core-WARNING: [cmd] rtcwake: write error
(drv_suspend:4494) igt-aux-WARNING: rtcwake failed with 1
Check dmesg for further details.
(drv_suspend:4494) igt-aux-CRITICAL: Test assertion failure function suspend_v...
(drv_suspend:4494) igt-aux-CRITICAL: Failed assertion: ret == 0
(drv_suspend:4494) igt-aux-CRITICAL: error: 1 != 0
Subtest sysfs-reader-hibernate failed.
**** DEBUG ****
(drv_suspend:4494) igt-core-DEBUG: Test requirement passed: !igt_run_in_simula...
(drv_suspend:4494) igt-aux-DEBUG: Test requirement passed: (power_dir = open("...
(drv_suspend:4494) igt-aux-DEBUG: Test requirement passed: get_supported_suspe...
(drv_suspend:4494) igt-aux-DEBUG: Test requirement passed: test == SUSPEND_TES...
(drv_suspend:4494) igt-aux-DEBUG: Test requirement passed: ret == 0
(drv_suspend:4494) igt-core-INFO: [cmd] rtcwake: wakeup from "disk" using /dev...
(drv_suspend:4494) igt-core-WARNING: [cmd] rtcwake: write error
(drv_suspend:4494) igt-aux-WARNING: rtcwake failed with 1
Check dmesg for further details.
...
 airlied_2 / shard-kbl1
(drv_suspend:1571) igt-core-WARNING: [cmd] rtcwake: write error
(drv_suspend:1571) igt-aux-CRITICAL: Test assertion failure function suspend_v...
(drv_suspend:1571) igt-aux-CRITICAL: Failed assertion: ret == 0
(drv_suspend:1571) igt-aux-CRITICAL: rtcwake failed with 1
Check dmesg for further details.
Subtest sysfs-reader-hibernate failed.
**** DEBUG ****
(drv_suspend:1571) igt-core-DEBUG: Test requirement passed: !igt_run_in_simula...
(drv_suspend:1571) igt-aux-DEBUG: Test requirement passed: (power_dir = open("...
(drv_suspend:1571) igt-aux-DEBUG: Test requirement passed: get_supported_suspe...
(drv_suspend:1571) igt-aux-DEBUG: Test requirement passed: test == SUSPEND_TES...
(drv_suspend:1571) igt-aux-DEBUG: Test requirement passed: ret == 0
(drv_suspend:1571) igt-core-INFO: [cmd] rtcwake: wakeup from "disk" using /dev...
(drv_suspend:1571) igt-core-WARNING: [cmd] rtcwake: write error
(drv_suspend:1571) igt-aux-CRITICAL: Test assertion failure function suspend_v...
(drv_suspend:1571) igt-aux-CRITICAL: Failed assertion: ret == 0
(drv_suspend:1571) igt-aux-CRITICAL: rtcwake failed with 1
...
 airlied_3 / shard-kbl4
(drv_suspend:1573) igt-core-WARNING: [cmd] rtcwake: write error[cmd] 
(drv_suspend:1573) igt-aux-CRITICAL: Test assertion failure function suspend_v...
(drv_suspend:1573) igt-aux-CRITICAL: Failed assertion: ret == 0
(drv_suspend:1573) igt-aux-CRITICAL: rtcwake failed with 1
Check dmesg for further details.
Subtest sysfs-reader-hibernate failed.
**** DEBUG ****
(drv_suspend:1573) igt-core-DEBUG: Test requirement passed: !igt_run_in_simula...
(drv_suspend:1573) igt-aux-DEBUG: Test requirement passed: (power_dir = open("...
(drv_suspend:1573) igt-aux-DEBUG: Test requirement passed: get_supported_suspe...
(drv_suspend:1573) igt-aux-DEBUG: Test requirement passed: test == SUSPEND_TES...
(drv_suspend:1573) igt-aux-DEBUG: Test requirement passed: ret == 0
(drv_suspend:1573) igt-core-INFO: [cmd] rtcwake: wakeup from "disk" using /dev...
(drv_suspend:1573) igt-core-WARNING: [cmd] rtcwake: write error[cmd] 
(drv_suspend:1573) igt-aux-CRITICAL: Test assertion failure function suspend_v...
(drv_suspend:1573) igt-aux-CRITICAL: Failed assertion: ret == 0
(drv_suspend:1573) igt-aux-CRITICAL: rtcwake failed with 1
...
 airlied_4 / shard-kbl5
(drv_suspend:1476) igt-core-WARNING: [cmd] rtcwake: write error
(drv_suspend:1476) igt-aux-CRITICAL: Test assertion failure function suspend_v...
(drv_suspend:1476) igt-aux-CRITICAL: Failed assertion: ret == 0
(drv_suspend:1476) igt-aux-CRITICAL: rtcwake failed with 1
Check dmesg for further details.
Subtest sysfs-reader-hibernate failed.
**** DEBUG ****
(drv_suspend:1476) igt-core-DEBUG: Test requirement passed: !igt_run_in_simula...
(drv_suspend:1476) igt-aux-DEBUG: Test requirement passed: (power_dir = open("...
(drv_suspend:1476) igt-aux-DEBUG: Test requirement passed: get_supported_suspe...
(drv_suspend:1476) igt-aux-DEBUG: Test requirement passed: test == SUSPEND_TES...
(drv_suspend:1476) igt-aux-DEBUG: Test requirement passed: ret == 0
(drv_suspend:1476) igt-core-INFO: [cmd] rtcwake: wakeup from "disk" using /dev...
(drv_suspend:1476) igt-core-WARNING: [cmd] rtcwake: write error
(drv_suspend:1476) igt-aux-CRITICAL: Test assertion failure function suspend_v...
(drv_suspend:1476) igt-aux-CRITICAL: Failed assertion: ret == 0
(drv_suspend:1476) igt-aux-CRITICAL: rtcwake failed with 1
...
 airlied_5 / shard-kbl3
(drv_suspend:1619) igt-core-WARNING: [cmd] rtcwake: write error
(drv_suspend:1619) igt-aux-CRITICAL: Test assertion failure function suspend_v...
(drv_suspend:1619) igt-aux-CRITICAL: Failed assertion: ret == 0
(drv_suspend:1619) igt-aux-CRITICAL: rtcwake failed with 1
Check dmesg for further details.
Subtest sysfs-reader-hibernate failed.
**** DEBUG ****
(drv_suspend:1619) igt-core-DEBUG: Test requirement passed: !igt_run_in_simula...
(drv_suspend:1619) igt-aux-DEBUG: Test requirement passed: (power_dir = open("...
(drv_suspend:1619) igt-aux-DEBUG: Test requirement passed: get_supported_suspe...
(drv_suspend:1619) igt-aux-DEBUG: Test requirement passed: test == SUSPEND_TES...
(drv_suspend:1619) igt-aux-DEBUG: Test requirement passed: ret == 0
(drv_suspend:1619) igt-core-INFO: [cmd] rtcwake: wakeup from "disk" using /dev...
(drv_suspend:1619) igt-core-WARNING: [cmd] rtcwake: write error
(drv_suspend:1619) igt-aux-CRITICAL: Test assertion failure function suspend_v...
(drv_suspend:1619) igt-aux-CRITICAL: Failed assertion: ret == 0
(drv_suspend:1619) igt-aux-CRITICAL: rtcwake failed with 1
...
 airlied_6 / shard-kbl6
(drv_suspend:1658) igt-core-WARNING: [cmd] rtcwake: write error[cmd] 
(drv_suspend:1658) igt-aux-WARNING: rtcwake failed with 1
Check dmesg for further details.
(drv_suspend:1658) igt-aux-CRITICAL: Test assertion failure function suspend_v...
(drv_suspend:1658) igt-aux-CRITICAL: Failed assertion: ret == 0
(drv_suspend:1658) igt-aux-CRITICAL: error: 1 != 0
Subtest sysfs-reader-hibernate failed.
**** DEBUG ****
(drv_suspend:1658) igt-core-DEBUG: Test requirement passed: !igt_run_in_simula...
(drv_suspend:1658) igt-aux-DEBUG: Test requirement passed: (power_dir = open("...
(drv_suspend:1658) igt-aux-DEBUG: Test requirement passed: get_supported_suspe...
(drv_suspend:1658) igt-aux-DEBUG: Test requirement passed: test == SUSPEND_TES...
(drv_suspend:1658) igt-aux-DEBUG: Test requirement passed: ret == 0
(drv_suspend:1658) igt-core-INFO: [cmd] rtcwake: wakeup from "disk" using /dev...
(drv_suspend:1658) igt-core-WARNING: [cmd] rtcwake: write error[cmd] 
(drv_suspend:1658) igt-aux-WARNING: rtcwake failed with 1
Check dmesg for further details.
...
igt@gem_cs_tlb@basic-default
 
 
 
 
 
 
 
 
 
 
 
 
 
 
 
 airlied_2 / shard-kbl7
[  263.143011] ------------[ cut here ]------------
[  263.143018] WARNING: CPU: 0 PID: 2798 at net/sched/sch_generic.c:320 dev_wa...
[  263.143025] Modules linked in: vgem snd_hda_codec_hdmi snd_hda_codec_realte...
[  263.143061] CPU: 0 PID: 2798 Comm: gem_cs_tlb Tainted: G     U          4.1...
[  263.143068] Hardware name:                  /NUC7i5BNB, BIOS BNKBL357.86A.0...
[  263.143075] task: ffff88046186d440 task.stack: ffffc90000adc000
[  263.143080] RIP: 0010:dev_watchdog+0x21d/0x230
[  263.143084] RSP: 0018:ffff88047ec03e18 EFLAGS: 00010296
[  263.143089] RAX: 000000000000003a RBX: 0000000000000000 RCX: 0000000000000102
[  263.143095] RDX: 0000000080000102 RSI: ffffffff81d18f67 RDI: 00000000ffffffff
[  263.143100] RBP: ffff88047ec03e48 R08: 0000000000000001 R09: 0000000000000001
[  263.143105] R10: 0000000000000000 R11: 0000000000000000 R12: ffff880465961468
[  263.143111] R13: 0000000000000000 R14: ffff8804622b0000 R15: 0000000000000001
[  263.143116] FS:  00007fa43dd038c0(0000) GS:ffff88047ec00000(0000) knlGS:000...
[  263.143122] CS:  0010 DS: 0000 ES: 0000 CR0: 0000000080050033
[  263.143127] CR2: 00007f3679521218 CR3: 0000000468ac2006 CR4: 00000000003606f0
[  263.143132] Call Trace:
...
 
 
 
 
igt@gem_ctx_param@invalid-param-get
 
 
 airlied_4 / shard-snb2
(gem_ctx_param:10122) CRITICAL: Test assertion failure function __real_main31,...
(gem_ctx_param:10122) CRITICAL: Failed assertion: __gem_context_get_param(fd, ...
(gem_ctx_param:10122) CRITICAL: error: 0 != -22
Subtest invalid-param-get failed.
**** DEBUG ****
(gem_ctx_param:10122) CRITICAL: Test assertion failure function __real_main31,...
(gem_ctx_param:10122) CRITICAL: Failed assertion: __gem_context_get_param(fd, ...
(gem_ctx_param:10122) CRITICAL: error: 0 != -22
(gem_ctx_param:10122) igt-core-INFO: Stack trace:
(gem_ctx_param:10122) igt-core-INFO:   #0 [__igt_fail_assert+0x101]
(gem_ctx_param:10122) igt-core-INFO:   #1 [__real_main31+0x7fd]
(gem_ctx_param:10122) igt-core-INFO:   #2 [main+0x27]
(gem_ctx_param:10122) igt-core-INFO:   #3 [__libc_start_main+0xf1]
(gem_ctx_param:10122) igt-core-INFO:   #4 [_start+0x2a]
(gem_ctx_param:10122) igt-core-INFO:   #5 [<unknown>+0x2a]
****  END  ****
 airlied_5 / shard-snb3
(gem_ctx_param:7229) CRITICAL: Test assertion failure function __real_main31, ...
(gem_ctx_param:7229) CRITICAL: Failed assertion: __gem_context_get_param(fd, &...
(gem_ctx_param:7229) CRITICAL: error: 0 != -22
Subtest invalid-param-get failed.
**** DEBUG ****
(gem_ctx_param:7229) CRITICAL: Test assertion failure function __real_main31, ...
(gem_ctx_param:7229) CRITICAL: Failed assertion: __gem_context_get_param(fd, &...
(gem_ctx_param:7229) CRITICAL: error: 0 != -22
(gem_ctx_param:7229) igt-core-INFO: Stack trace:
(gem_ctx_param:7229) igt-core-INFO:   #0 [__igt_fail_assert+0x101]
(gem_ctx_param:7229) igt-core-INFO:   #1 [__real_main31+0x7fd]
(gem_ctx_param:7229) igt-core-INFO:   #2 [main+0x27]
(gem_ctx_param:7229) igt-core-INFO:   #3 [__libc_start_main+0xf1]
(gem_ctx_param:7229) igt-core-INFO:   #4 [_start+0x2a]
(gem_ctx_param:7229) igt-core-INFO:   #5 [<unknown>+0x2a]
****  END  ****
 airlied_6 / shard-snb5
(gem_ctx_param:3870) CRITICAL: Test assertion failure function __real_main31, ...
(gem_ctx_param:3870) CRITICAL: Failed assertion: __gem_context_get_param(fd, &...
(gem_ctx_param:3870) CRITICAL: error: 0 != -22
Subtest invalid-param-get failed.
**** DEBUG ****
(gem_ctx_param:3870) CRITICAL: Test assertion failure function __real_main31, ...
(gem_ctx_param:3870) CRITICAL: Failed assertion: __gem_context_get_param(fd, &...
(gem_ctx_param:3870) CRITICAL: error: 0 != -22
(gem_ctx_param:3870) igt-core-INFO: Stack trace:
(gem_ctx_param:3870) igt-core-INFO:   #0 [__igt_fail_assert+0x101]
(gem_ctx_param:3870) igt-core-INFO:   #1 [__real_main31+0x7fd]
(gem_ctx_param:3870) igt-core-INFO:   #2 [main+0x27]
(gem_ctx_param:3870) igt-core-INFO:   #3 [__libc_start_main+0xf1]
(gem_ctx_param:3870) igt-core-INFO:   #4 [_start+0x2a]
(gem_ctx_param:3870) igt-core-INFO:   #5 [<unknown>+0x2a]
****  END  ****
 
 
 airlied_4 / shard-hsw6
(gem_ctx_param:7930) CRITICAL: Test assertion failure function __real_main31, ...
(gem_ctx_param:7930) CRITICAL: Failed assertion: __gem_context_get_param(fd, &...
(gem_ctx_param:7930) CRITICAL: error: 0 != -22
Subtest invalid-param-get failed.
**** DEBUG ****
(gem_ctx_param:7930) CRITICAL: Test assertion failure function __real_main31, ...
(gem_ctx_param:7930) CRITICAL: Failed assertion: __gem_context_get_param(fd, &...
(gem_ctx_param:7930) CRITICAL: error: 0 != -22
(gem_ctx_param:7930) igt-core-INFO: Stack trace:
(gem_ctx_param:7930) igt-core-INFO:   #0 [__igt_fail_assert+0x101]
(gem_ctx_param:7930) igt-core-INFO:   #1 [__real_main31+0x7fd]
(gem_ctx_param:7930) igt-core-INFO:   #2 [main+0x27]
(gem_ctx_param:7930) igt-core-INFO:   #3 [__libc_start_main+0xf1]
(gem_ctx_param:7930) igt-core-INFO:   #4 [_start+0x2a]
(gem_ctx_param:7930) igt-core-INFO:   #5 [<unknown>+0x2a]
****  END  ****
 airlied_5 / shard-hsw3
(gem_ctx_param:8765) CRITICAL: Test assertion failure function __real_main31, ...
(gem_ctx_param:8765) CRITICAL: Failed assertion: __gem_context_get_param(fd, &...
(gem_ctx_param:8765) CRITICAL: error: 0 != -22
Subtest invalid-param-get failed.
**** DEBUG ****
(gem_ctx_param:8765) CRITICAL: Test assertion failure function __real_main31, ...
(gem_ctx_param:8765) CRITICAL: Failed assertion: __gem_context_get_param(fd, &...
(gem_ctx_param:8765) CRITICAL: error: 0 != -22
(gem_ctx_param:8765) igt-core-INFO: Stack trace:
(gem_ctx_param:8765) igt-core-INFO:   #0 [__igt_fail_assert+0x101]
(gem_ctx_param:8765) igt-core-INFO:   #1 [__real_main31+0x7fd]
(gem_ctx_param:8765) igt-core-INFO:   #2 [main+0x27]
(gem_ctx_param:8765) igt-core-INFO:   #3 [__libc_start_main+0xf1]
(gem_ctx_param:8765) igt-core-INFO:   #4 [_start+0x2a]
(gem_ctx_param:8765) igt-core-INFO:   #5 [<unknown>+0x2a]
****  END  ****
 airlied_6 / shard-hsw3
(gem_ctx_param:4480) CRITICAL: Test assertion failure function __real_main31, ...
(gem_ctx_param:4480) CRITICAL: Failed assertion: __gem_context_get_param(fd, &...
(gem_ctx_param:4480) CRITICAL: error: 0 != -22
Subtest invalid-param-get failed.
**** DEBUG ****
(gem_ctx_param:4480) CRITICAL: Test assertion failure function __real_main31, ...
(gem_ctx_param:4480) CRITICAL: Failed assertion: __gem_context_get_param(fd, &...
(gem_ctx_param:4480) CRITICAL: error: 0 != -22
(gem_ctx_param:4480) igt-core-INFO: Stack trace:
(gem_ctx_param:4480) igt-core-INFO:   #0 [__igt_fail_assert+0x101]
(gem_ctx_param:4480) igt-core-INFO:   #1 [__real_main31+0x7fd]
(gem_ctx_param:4480) igt-core-INFO:   #2 [main+0x27]
(gem_ctx_param:4480) igt-core-INFO:   #3 [__libc_start_main+0xf1]
(gem_ctx_param:4480) igt-core-INFO:   #4 [_start+0x2a]
(gem_ctx_param:4480) igt-core-INFO:   #5 [<unknown>+0x2a]
****  END  ****
 
 
 airlied_4 / shard-apl7
(gem_ctx_param:6635) CRITICAL: Test assertion failure function __real_main31, ...
(gem_ctx_param:6635) CRITICAL: Failed assertion: __gem_context_get_param(fd, &...
(gem_ctx_param:6635) CRITICAL: error: 0 != -22
Subtest invalid-param-get failed.
**** DEBUG ****
(gem_ctx_param:6635) CRITICAL: Test assertion failure function __real_main31, ...
(gem_ctx_param:6635) CRITICAL: Failed assertion: __gem_context_get_param(fd, &...
(gem_ctx_param:6635) CRITICAL: error: 0 != -22
(gem_ctx_param:6635) igt-core-INFO: Stack trace:
(gem_ctx_param:6635) igt-core-INFO:   #0 [__igt_fail_assert+0x101]
(gem_ctx_param:6635) igt-core-INFO:   #1 [__real_main31+0x7fd]
(gem_ctx_param:6635) igt-core-INFO:   #2 [main+0x27]
(gem_ctx_param:6635) igt-core-INFO:   #3 [__libc_start_main+0xf1]
(gem_ctx_param:6635) igt-core-INFO:   #4 [_start+0x2a]
(gem_ctx_param:6635) igt-core-INFO:   #5 [<unknown>+0x2a]
****  END  ****
 airlied_5 / shard-apl8
(gem_ctx_param:4587) CRITICAL: Test assertion failure function __real_main31, ...
(gem_ctx_param:4587) CRITICAL: Failed assertion: __gem_context_get_param(fd, &...
(gem_ctx_param:4587) CRITICAL: error: 0 != -22
Subtest invalid-param-get failed.
**** DEBUG ****
(gem_ctx_param:4587) CRITICAL: Test assertion failure function __real_main31, ...
(gem_ctx_param:4587) CRITICAL: Failed assertion: __gem_context_get_param(fd, &...
(gem_ctx_param:4587) CRITICAL: error: 0 != -22
(gem_ctx_param:4587) igt-core-INFO: Stack trace:
(gem_ctx_param:4587) igt-core-INFO:   #0 [__igt_fail_assert+0x101]
(gem_ctx_param:4587) igt-core-INFO:   #1 [__real_main31+0x7fd]
(gem_ctx_param:4587) igt-core-INFO:   #2 [main+0x27]
(gem_ctx_param:4587) igt-core-INFO:   #3 [__libc_start_main+0xf1]
(gem_ctx_param:4587) igt-core-INFO:   #4 [_start+0x2a]
(gem_ctx_param:4587) igt-core-INFO:   #5 [<unknown>+0x2a]
****  END  ****
 airlied_6 / shard-apl5
(gem_ctx_param:6674) CRITICAL: Test assertion failure function __real_main31, ...
(gem_ctx_param:6674) CRITICAL: Failed assertion: __gem_context_get_param(fd, &...
(gem_ctx_param:6674) CRITICAL: error: 0 != -22
Subtest invalid-param-get failed.
**** DEBUG ****
(gem_ctx_param:6674) CRITICAL: Test assertion failure function __real_main31, ...
(gem_ctx_param:6674) CRITICAL: Failed assertion: __gem_context_get_param(fd, &...
(gem_ctx_param:6674) CRITICAL: error: 0 != -22
(gem_ctx_param:6674) igt-core-INFO: Stack trace:
(gem_ctx_param:6674) igt-core-INFO:   #0 [__igt_fail_assert+0x101]
(gem_ctx_param:6674) igt-core-INFO:   #1 [__real_main31+0x7fd]
(gem_ctx_param:6674) igt-core-INFO:   #2 [main+0x27]
(gem_ctx_param:6674) igt-core-INFO:   #3 [__libc_start_main+0xf1]
(gem_ctx_param:6674) igt-core-INFO:   #4 [_start+0x2a]
(gem_ctx_param:6674) igt-core-INFO:   #5 [<unknown>+0x2a]
****  END  ****
 
 
 airlied_4 / shard-kbl3
(gem_ctx_param:1971) CRITICAL: Test assertion failure function __real_main31, ...
(gem_ctx_param:1971) CRITICAL: Failed assertion: __gem_context_get_param(fd, &...
(gem_ctx_param:1971) CRITICAL: error: 0 != -22
Subtest invalid-param-get failed.
**** DEBUG ****
(gem_ctx_param:1971) CRITICAL: Test assertion failure function __real_main31, ...
(gem_ctx_param:1971) CRITICAL: Failed assertion: __gem_context_get_param(fd, &...
(gem_ctx_param:1971) CRITICAL: error: 0 != -22
(gem_ctx_param:1971) igt-core-INFO: Stack trace:
(gem_ctx_param:1971) igt-core-INFO:   #0 [__igt_fail_assert+0x101]
(gem_ctx_param:1971) igt-core-INFO:   #1 [__real_main31+0x7fd]
(gem_ctx_param:1971) igt-core-INFO:   #2 [main+0x27]
(gem_ctx_param:1971) igt-core-INFO:   #3 [__libc_start_main+0xf1]
(gem_ctx_param:1971) igt-core-INFO:   #4 [_start+0x2a]
(gem_ctx_param:1971) igt-core-INFO:   #5 [<unknown>+0x2a]
****  END  ****
 airlied_5 / shard-kbl5
(gem_ctx_param:2650) CRITICAL: Test assertion failure function __real_main31, ...
(gem_ctx_param:2650) CRITICAL: Failed assertion: __gem_context_get_param(fd, &...
(gem_ctx_param:2650) CRITICAL: error: 0 != -22
Subtest invalid-param-get failed.
**** DEBUG ****
(gem_ctx_param:2650) CRITICAL: Test assertion failure function __real_main31, ...
(gem_ctx_param:2650) CRITICAL: Failed assertion: __gem_context_get_param(fd, &...
(gem_ctx_param:2650) CRITICAL: error: 0 != -22
(gem_ctx_param:2650) igt-core-INFO: Stack trace:
(gem_ctx_param:2650) igt-core-INFO:   #0 [__igt_fail_assert+0x101]
(gem_ctx_param:2650) igt-core-INFO:   #1 [__real_main31+0x7fd]
(gem_ctx_param:2650) igt-core-INFO:   #2 [main+0x27]
(gem_ctx_param:2650) igt-core-INFO:   #3 [__libc_start_main+0xf1]
(gem_ctx_param:2650) igt-core-INFO:   #4 [_start+0x2a]
(gem_ctx_param:2650) igt-core-INFO:   #5 [<unknown>+0x2a]
****  END  ****
 airlied_6 / shard-kbl2
(gem_ctx_param:1823) CRITICAL: Test assertion failure function __real_main31, ...
(gem_ctx_param:1823) CRITICAL: Failed assertion: __gem_context_get_param(fd, &...
(gem_ctx_param:1823) CRITICAL: error: 0 != -22
Subtest invalid-param-get failed.
**** DEBUG ****
(gem_ctx_param:1823) CRITICAL: Test assertion failure function __real_main31, ...
(gem_ctx_param:1823) CRITICAL: Failed assertion: __gem_context_get_param(fd, &...
(gem_ctx_param:1823) CRITICAL: error: 0 != -22
(gem_ctx_param:1823) igt-core-INFO: Stack trace:
(gem_ctx_param:1823) igt-core-INFO:   #0 [__igt_fail_assert+0x101]
(gem_ctx_param:1823) igt-core-INFO:   #1 [__real_main31+0x7fd]
(gem_ctx_param:1823) igt-core-INFO:   #2 [main+0x27]
(gem_ctx_param:1823) igt-core-INFO:   #3 [__libc_start_main+0xf1]
(gem_ctx_param:1823) igt-core-INFO:   #4 [_start+0x2a]
(gem_ctx_param:1823) igt-core-INFO:   #5 [<unknown>+0x2a]
****  END  ****
igt@gem_ctx_param@invalid-param-set
 
 
 airlied_4 / shard-snb6
(gem_ctx_param:1765) CRITICAL: Test assertion failure function __real_main31, ...
(gem_ctx_param:1765) CRITICAL: Failed assertion: __gem_context_set_param(fd, &...
(gem_ctx_param:1765) CRITICAL: Last errno: 19, No such device
(gem_ctx_param:1765) CRITICAL: error: -19 != -22
Subtest invalid-param-set failed.
**** DEBUG ****
(gem_ctx_param:1765) CRITICAL: Test assertion failure function __real_main31, ...
(gem_ctx_param:1765) CRITICAL: Failed assertion: __gem_context_set_param(fd, &...
(gem_ctx_param:1765) CRITICAL: Last errno: 19, No such device
(gem_ctx_param:1765) CRITICAL: error: -19 != -22
(gem_ctx_param:1765) igt-core-INFO: Stack trace:
(gem_ctx_param:1765) igt-core-INFO:   #0 [__igt_fail_assert+0x101]
(gem_ctx_param:1765) igt-core-INFO:   #1 [__real_main31+0x71e]
(gem_ctx_param:1765) igt-core-INFO:   #2 [<unknown>+0x71e]
****  END  ****
 airlied_5 / shard-snb6
(gem_ctx_param:8177) CRITICAL: Test assertion failure function __real_main31, ...
(gem_ctx_param:8177) CRITICAL: Failed assertion: __gem_context_set_param(fd, &...
(gem_ctx_param:8177) CRITICAL: Last errno: 19, No such device
(gem_ctx_param:8177) CRITICAL: error: -19 != -22
Subtest invalid-param-set failed.
**** DEBUG ****
(gem_ctx_param:8177) CRITICAL: Test assertion failure function __real_main31, ...
(gem_ctx_param:8177) CRITICAL: Failed assertion: __gem_context_set_param(fd, &...
(gem_ctx_param:8177) CRITICAL: Last errno: 19, No such device
(gem_ctx_param:8177) CRITICAL: error: -19 != -22
(gem_ctx_param:8177) igt-core-INFO: Stack trace:
(gem_ctx_param:8177) igt-core-INFO:   #0 [__igt_fail_assert+0x101]
(gem_ctx_param:8177) igt-core-INFO:   #1 [__real_main31+0x71e]
(gem_ctx_param:8177) igt-core-INFO:   #2 [<unknown>+0x71e]
****  END  ****
 airlied_6 / shard-snb3
(gem_ctx_param:8236) CRITICAL: Test assertion failure function __real_main31, ...
(gem_ctx_param:8236) CRITICAL: Failed assertion: __gem_context_set_param(fd, &...
(gem_ctx_param:8236) CRITICAL: Last errno: 19, No such device
(gem_ctx_param:8236) CRITICAL: error: -19 != -22
Subtest invalid-param-set failed.
**** DEBUG ****
(gem_ctx_param:8236) CRITICAL: Test assertion failure function __real_main31, ...
(gem_ctx_param:8236) CRITICAL: Failed assertion: __gem_context_set_param(fd, &...
(gem_ctx_param:8236) CRITICAL: Last errno: 19, No such device
(gem_ctx_param:8236) CRITICAL: error: -19 != -22
(gem_ctx_param:8236) igt-core-INFO: Stack trace:
(gem_ctx_param:8236) igt-core-INFO:   #0 [__igt_fail_assert+0x101]
(gem_ctx_param:8236) igt-core-INFO:   #1 [__real_main31+0x71e]
(gem_ctx_param:8236) igt-core-INFO:   #2 [<unknown>+0x71e]
****  END  ****
 
 
 airlied_4 / shard-hsw4
(gem_ctx_param:1747) CRITICAL: Test assertion failure function __real_main31, ...
(gem_ctx_param:1747) CRITICAL: Failed assertion: __gem_context_set_param(fd, &...
(gem_ctx_param:1747) CRITICAL: Last errno: 19, No such device
(gem_ctx_param:1747) CRITICAL: error: -19 != -22
Subtest invalid-param-set failed.
**** DEBUG ****
(gem_ctx_param:1747) CRITICAL: Test assertion failure function __real_main31, ...
(gem_ctx_param:1747) CRITICAL: Failed assertion: __gem_context_set_param(fd, &...
(gem_ctx_param:1747) CRITICAL: Last errno: 19, No such device
(gem_ctx_param:1747) CRITICAL: error: -19 != -22
(gem_ctx_param:1747) igt-core-INFO: Stack trace:
(gem_ctx_param:1747) igt-core-INFO:   #0 [__igt_fail_assert+0x101]
(gem_ctx_param:1747) igt-core-INFO:   #1 [__real_main31+0x71e]
(gem_ctx_param:1747) igt-core-INFO:   #2 [<unknown>+0x71e]
****  END  ****
 airlied_5 / shard-hsw4
(gem_ctx_param:7613) CRITICAL: Test assertion failure function __real_main31, ...
(gem_ctx_param:7613) CRITICAL: Failed assertion: __gem_context_set_param(fd, &...
(gem_ctx_param:7613) CRITICAL: Last errno: 19, No such device
(gem_ctx_param:7613) CRITICAL: error: -19 != -22
Subtest invalid-param-set failed.
**** DEBUG ****
(gem_ctx_param:7613) CRITICAL: Test assertion failure function __real_main31, ...
(gem_ctx_param:7613) CRITICAL: Failed assertion: __gem_context_set_param(fd, &...
(gem_ctx_param:7613) CRITICAL: Last errno: 19, No such device
(gem_ctx_param:7613) CRITICAL: error: -19 != -22
(gem_ctx_param:7613) igt-core-INFO: Stack trace:
(gem_ctx_param:7613) igt-core-INFO:   #0 [__igt_fail_assert+0x101]
(gem_ctx_param:7613) igt-core-INFO:   #1 [__real_main31+0x71e]
(gem_ctx_param:7613) igt-core-INFO:   #2 [<unknown>+0x71e]
****  END  ****
 airlied_6 / shard-hsw4
(gem_ctx_param:9388) CRITICAL: Test assertion failure function __real_main31, ...
(gem_ctx_param:9388) CRITICAL: Failed assertion: __gem_context_set_param(fd, &...
(gem_ctx_param:9388) CRITICAL: Last errno: 19, No such device
(gem_ctx_param:9388) CRITICAL: error: -19 != -22
Subtest invalid-param-set failed.
**** DEBUG ****
(gem_ctx_param:9388) CRITICAL: Test assertion failure function __real_main31, ...
(gem_ctx_param:9388) CRITICAL: Failed assertion: __gem_context_set_param(fd, &...
(gem_ctx_param:9388) CRITICAL: Last errno: 19, No such device
(gem_ctx_param:9388) CRITICAL: error: -19 != -22
(gem_ctx_param:9388) igt-core-INFO: Stack trace:
(gem_ctx_param:9388) igt-core-INFO:   #0 [__igt_fail_assert+0x101]
(gem_ctx_param:9388) igt-core-INFO:   #1 [__real_main31+0x71e]
(gem_ctx_param:9388) igt-core-INFO:   #2 [<unknown>+0x71e]
****  END  ****
 
 
 airlied_4 / shard-apl7
(gem_ctx_param:1767) CRITICAL: Test assertion failure function __real_main31, ...
(gem_ctx_param:1767) CRITICAL: Failed assertion: __gem_context_set_param(fd, &...
(gem_ctx_param:1767) CRITICAL: error: 0 != -22
Subtest invalid-param-set failed.
**** DEBUG ****
(gem_ctx_param:1767) CRITICAL: Test assertion failure function __real_main31, ...
(gem_ctx_param:1767) CRITICAL: Failed assertion: __gem_context_set_param(fd, &...
(gem_ctx_param:1767) CRITICAL: error: 0 != -22
(gem_ctx_param:1767) igt-core-INFO: Stack trace:
(gem_ctx_param:1767) igt-core-INFO:   #0 [__igt_fail_assert+0x101]
(gem_ctx_param:1767) igt-core-INFO:   #1 [__real_main31+0x71e]
(gem_ctx_param:1767) igt-core-INFO:   #2 [<unknown>+0x71e]
****  END  ****
 airlied_5 / shard-apl7
(gem_ctx_param:8735) CRITICAL: Test assertion failure function __real_main31, ...
(gem_ctx_param:8735) CRITICAL: Failed assertion: __gem_context_set_param(fd, &...
(gem_ctx_param:8735) CRITICAL: error: 0 != -22
Subtest invalid-param-set failed.
**** DEBUG ****
(gem_ctx_param:8735) CRITICAL: Test assertion failure function __real_main31, ...
(gem_ctx_param:8735) CRITICAL: Failed assertion: __gem_context_set_param(fd, &...
(gem_ctx_param:8735) CRITICAL: error: 0 != -22
(gem_ctx_param:8735) igt-core-INFO: Stack trace:
(gem_ctx_param:8735) igt-core-INFO:   #0 [__igt_fail_assert+0x101]
(gem_ctx_param:8735) igt-core-INFO:   #1 [__real_main31+0x71e]
(gem_ctx_param:8735) igt-core-INFO:   #2 [<unknown>+0x71e]
****  END  ****
 airlied_6 / shard-apl6
(gem_ctx_param:8104) CRITICAL: Test assertion failure function __real_main31, ...
(gem_ctx_param:8104) CRITICAL: Failed assertion: __gem_context_set_param(fd, &...
(gem_ctx_param:8104) CRITICAL: error: 0 != -22
Subtest invalid-param-set failed.
**** DEBUG ****
(gem_ctx_param:8104) CRITICAL: Test assertion failure function __real_main31, ...
(gem_ctx_param:8104) CRITICAL: Failed assertion: __gem_context_set_param(fd, &...
(gem_ctx_param:8104) CRITICAL: error: 0 != -22
(gem_ctx_param:8104) igt-core-INFO: Stack trace:
(gem_ctx_param:8104) igt-core-INFO:   #0 [__igt_fail_assert+0x101]
(gem_ctx_param:8104) igt-core-INFO:   #1 [__real_main31+0x71e]
(gem_ctx_param:8104) igt-core-INFO:   #2 [<unknown>+0x71e]
****  END  ****
 
 
 airlied_4 / shard-kbl3
(gem_ctx_param:1659) CRITICAL: Test assertion failure function __real_main31, ...
(gem_ctx_param:1659) CRITICAL: Failed assertion: __gem_context_set_param(fd, &...
(gem_ctx_param:1659) CRITICAL: error: 0 != -22
Subtest invalid-param-set failed.
**** DEBUG ****
(gem_ctx_param:1659) CRITICAL: Test assertion failure function __real_main31, ...
(gem_ctx_param:1659) CRITICAL: Failed assertion: __gem_context_set_param(fd, &...
(gem_ctx_param:1659) CRITICAL: error: 0 != -22
(gem_ctx_param:1659) igt-core-INFO: Stack trace:
(gem_ctx_param:1659) igt-core-INFO:   #0 [__igt_fail_assert+0x101]
(gem_ctx_param:1659) igt-core-INFO:   #1 [__real_main31+0x71e]
(gem_ctx_param:1659) igt-core-INFO:   #2 [<unknown>+0x71e]
****  END  ****
 airlied_5 / shard-kbl7
(gem_ctx_param:1779) CRITICAL: Test assertion failure function __real_main31, ...
(gem_ctx_param:1779) CRITICAL: Failed assertion: __gem_context_set_param(fd, &...
(gem_ctx_param:1779) CRITICAL: error: 0 != -22
Subtest invalid-param-set failed.
**** DEBUG ****
(gem_ctx_param:1779) CRITICAL: Test assertion failure function __real_main31, ...
(gem_ctx_param:1779) CRITICAL: Failed assertion: __gem_context_set_param(fd, &...
(gem_ctx_param:1779) CRITICAL: error: 0 != -22
(gem_ctx_param:1779) igt-core-INFO: Stack trace:
(gem_ctx_param:1779) igt-core-INFO:   #0 [__igt_fail_assert+0x101]
(gem_ctx_param:1779) igt-core-INFO:   #1 [__real_main31+0x71e]
(gem_ctx_param:1779) igt-core-INFO:   #2 [<unknown>+0x71e]
****  END  ****
 airlied_6 / shard-kbl1
(gem_ctx_param:1566) CRITICAL: Test assertion failure function __real_main31, ...
(gem_ctx_param:1566) CRITICAL: Failed assertion: __gem_context_set_param(fd, &...
(gem_ctx_param:1566) CRITICAL: error: 0 != -22
Subtest invalid-param-set failed.
**** DEBUG ****
(gem_ctx_param:1566) CRITICAL: Test assertion failure function __real_main31, ...
(gem_ctx_param:1566) CRITICAL: Failed assertion: __gem_context_set_param(fd, &...
(gem_ctx_param:1566) CRITICAL: error: 0 != -22
(gem_ctx_param:1566) igt-core-INFO: Stack trace:
(gem_ctx_param:1566) igt-core-INFO:   #0 [__igt_fail_assert+0x101]
(gem_ctx_param:1566) igt-core-INFO:   #1 [__real_main31+0x71e]
(gem_ctx_param:1566) igt-core-INFO:   #2 [<unknown>+0x71e]
****  END  ****
igt@gem_eio@execbuf
 
 
 
 
 
 
 
 
 
 
 
 
 
 
 
 airlied_2 / shard-kbl1
[  407.019503] ------------[ cut here ]------------
[  407.019533] WARNING: CPU: 3 PID: 0 at net/sched/sch_generic.c:320 dev_watch...
[  407.019568] Modules linked in: vgem snd_hda_codec_hdmi snd_hda_codec_realte...
[  407.019791] CPU: 3 PID: 0 Comm: swapper/3 Tainted: G     U          4.14.0-...
[  407.019834] Hardware name:                  /NUC7i5BNB, BIOS BNKBL357.86A.0...
[  407.019882] task: ffff880275342a40 task.stack: ffffc900000bc000
[  407.019917] RIP: 0010:dev_watchdog+0x21d/0x230
[  407.019949] RSP: 0018:ffff88027ed83e18 EFLAGS: 00010296
[  407.019983] RAX: 000000000000003a RBX: 0000000000000000 RCX: 0000000000000103
[  407.020025] RDX: 0000000000000103 RSI: 00000000000000f6 RDI: 00000000ffffffff
[  407.020063] RBP: ffff88027ed83e48 R08: 0000000000000001 R09: 0000000000000001
[  407.020105] R10: 0000000000000000 R11: 0000000000000000 R12: ffff88026ee7eee8
[  407.020142] R13: 0000000000000003 R14: ffff8802690c4000 R15: 0000000000000001
[  407.020185] FS:  0000000000000000(0000) GS:ffff88027ed80000(0000) knlGS:000...
[  407.020228] CS:  0010 DS: 0000 ES: 0000 CR0: 0000000080050033
[  407.020263] CR2: 00007f42f0960ff8 CR3: 0000000261e2a005 CR4: 00000000003606e0
[  407.020300] Call Trace:
...
 airlied_3 / shard-kbl6
[  396.779645] ------------[ cut here ]------------
[  396.779677] WARNING: CPU: 3 PID: 0 at net/sched/sch_generic.c:320 dev_watch...
[  396.779712] Modules linked in: vgem snd_hda_codec_hdmi snd_hda_codec_realte...
[  396.779921] CPU: 3 PID: 0 Comm: swapper/3 Tainted: G     U          4.14.0-...
[  396.779966] Hardware name:                  /NUC7i5BNB, BIOS BNKBL357.86A.0...
[  396.780016] task: ffff880275342a40 task.stack: ffffc900000bc000
[  396.780053] RIP: 0010:dev_watchdog+0x21d/0x230
[  396.780082] RSP: 0018:ffff88027ed83e18 EFLAGS: 00010296
[  396.780121] RAX: 000000000000003a RBX: 0000000000000000 RCX: 0000000000000103
[  396.780159] RDX: 0000000000000103 RSI: 00000000000000f6 RDI: 00000000ffffffff
[  396.780203] RBP: ffff88027ed83e48 R08: 0000000000000001 R09: 0000000000000001
[  396.780250] R10: 0000000000000000 R11: 0000000000000000 R12: ffff88026a8db238
[  396.780293] R13: 0000000000000003 R14: ffff880268830000 R15: 0000000000000001
[  396.780339] FS:  0000000000000000(0000) GS:ffff88027ed80000(0000) knlGS:000...
[  396.780385] CS:  0010 DS: 0000 ES: 0000 CR0: 0000000080050033
[  396.780418] CR2: 00007fb196710048 CR3: 000000025db50002 CR4: 00000000003606e0
[  396.780457] Call Trace:
...
 
 
 
igt@gem_eio@in-flight-contexts
 
 
 
 airlied_5 / shard-snb5
(gem_eio:11825) ioctl-wrappers-CRITICAL: Test assertion failure function gem_e...
(gem_eio:11825) ioctl-wrappers-CRITICAL: Failed assertion: __gem_execbuf_wr(fd...
(gem_eio:11825) ioctl-wrappers-CRITICAL: error: -5 != 0
Subtest in-flight-contexts failed.
**** DEBUG ****
(gem_eio:11825) DEBUG: Test requirement passed: gem_has_exec_fence(fd)
(gem_eio:11825) DEBUG: Test requirement passed: ctx[0]
(gem_eio:11825) DEBUG: Starting test_inflight_contexts on engine 'default'
(gem_eio:11825) DEBUG: Disabling GPU reset
(gem_eio:11825) DEBUG: Test requirement passed: fd >= 0
(gem_eio:11825) DEBUG: Test requirement passed: i915_reset_control(false)
(gem_eio:11825) ioctl-wrappers-DEBUG: Test requirement passed: gem_has_ring(fd...
(gem_eio:11825) i915/gem-context-DEBUG: Test requirement passed: has_ban_perio...
(gem_eio:11825) igt-gt-DEBUG: Test requirement passed: has_gpu_reset(fd)
(gem_eio:11825) igt-gt-DEBUG: Test requirement passed: ctx == 0 || has_ctx_exe...
(gem_eio:11825) ioctl-wrappers-CRITICAL: Test assertion failure function gem_e...
(gem_eio:11825) ioctl-wrappers-CRITICAL: Failed assertion: __gem_execbuf_wr(fd...
...
 
 
 
 
 
 
 
 
 
 
 
 
 
 
 
 
igt@gem_eio@in-flight-external
 
 
 
 
 
 
 
 
 
 
 
 
 
 
 
 airlied_2 / shard-kbl7
[   23.312128] Setting dangerous option reset - tainting kernel
[   23.314178] i915 0000:00:02.0: Resetting chip after gpu hang
[   23.319198] Setting dangerous option reset - tainting kernel
[   33.754882] asynchronous wait on fence sw_sync:gem_eio:1 timed out
[   37.723384] i915 0000:00:02.0: Resetting chip after gpu hang

[   37.726157] ======================================================
[   37.726178] WARNING: possible circular locking dependency detected
[   37.726200] 4.14.0-rc3-CI-airlied_2+ #1 Tainted: G     U         
[   37.726219] ------------------------------------------------------
[   37.726241] kworker/3:2/178 is trying to acquire lock:
[   37.726258]  (cpu_hotplug_lock.rw_sem){++++}, at: [<ffffffff8113d4bc>] stop...
[   37.726305] 
               but task is already holding lock:
[   37.726326]  (&dev->struct_mutex){+.+.}, at: [<ffffffffa0162528>] i915_rese...
[   37.726466] 
               which lock already depends on the new lock.
...
 airlied_3 / shard-kbl5
[   29.637348] Setting dangerous option reset - tainting kernel
[   29.639515] i915 0000:00:02.0: Resetting chip after gpu hang
[   29.645600] Setting dangerous option reset - tainting kernel
[   39.903176] asynchronous wait on fence sw_sync:gem_eio:1 timed out
[   43.744571] i915 0000:00:02.0: Resetting chip after gpu hang

[   43.746349] ======================================================
[   43.746361] WARNING: possible circular locking dependency detected
[   43.746375] 4.14.0-rc3-CI-airlied_3+ #1 Tainted: G     U         
[   43.746387] ------------------------------------------------------
[   43.746399] kworker/1:4/461 is trying to acquire lock:
[   43.746409]  (cpu_hotplug_lock.rw_sem){++++}, at: [<ffffffff8113d4bc>] stop...
[   43.746441] 
               but task is already holding lock:
[   43.746452]  (&dev->struct_mutex){+.+.}, at: [<ffffffffa0163528>] i915_rese...
[   43.746535] 
               which lock already depends on the new lock.
...
 
 airlied_5 / shard-kbl2
[  186.942512] Setting dangerous option reset - tainting kernel
[  186.950214] i915 0000:00:02.0: Resetting chip after gpu hang
[  186.963845] Setting dangerous option reset - tainting kernel
[  188.711025] e1000e 0000:00:1f.6 eno1: Detected Hardware Unit Hang:
                 TDH                  <0>
                 TDT                  <12>
                 next_to_use          <12>
                 next_to_clean        <0>
               buffer_info[next_to_clean]:
                 time_stamp           <fffe43b0>
                 next_to_watch        <0>
                 jiffies              <fffe4d40>
                 next_to_watch.status <0>
               MAC Status             <40000083>
               PHY Status             <7e18>
               PHY 1000BASE-T Status  <26>
               PHY Extended Status    <ffff>
...
 
igt@gem_eio@in-flight-internal
 airlied_2 / shard-apl8
[  548.962578] Setting dangerous option reset - tainting kernel
[  548.963587] i915 0000:00:02.0: Resetting chip after gpu hang
[  548.972622] Setting dangerous option reset - tainting kernel
[  564.752849] i915 0000:00:02.0: Resetting chip after gpu hang

[  564.755253] ======================================================
[  564.755260] WARNING: possible circular locking dependency detected
[  564.755268] 4.14.0-rc3-CI-airlied_2+ #1 Tainted: G     U         
[  564.755275] ------------------------------------------------------
[  564.755282] kworker/2:0/2287 is trying to acquire lock:
[  564.755289]  (cpu_hotplug_lock.rw_sem){++++}, at: [<ffffffff8113d4bc>] stop...
[  564.755308] 
               but task is already holding lock:
[  564.755315]  (&dev->struct_mutex){+.+.}, at: [<ffffffffa02f2528>] i915_rese...
[  564.755386] 
               which lock already depends on the new lock.

...
 
 
 
 
 
 
 
 
 
igt@gem_eio@in-flight-suspend
 airlied_2 / shard-snb5
igt@gem_eio@in-flight-suspend
 airlied_3 / shard-snb6
igt@gem_eio@in-flight-suspend
 airlied_4 / shard-snb3
igt@gem_eio@in-flight-suspend
 airlied_5 / shard-snb1
igt@gem_eio@in-flight-suspend
 
 airlied_2 / shard-hsw4
[ 1046.716633] Setting dangerous option reset - tainting kernel
[ 1046.716848] i915 0000:00:02.0: Resetting chip after gpu hang
[ 1046.717431] Setting dangerous option reset - tainting kernel
[ 1046.722610] Suspending console(s) (use no_console_suspend to debug)
[ 1046.723186] sd 2:0:0:0: [sda] Synchronizing SCSI cache
[ 1046.723221] sd 2:0:0:0: [sda] Stopping disk
[ 1054.769548] i915 0000:00:02.0: Resetting chip after gpu hang
[ 1059.811022] sd 2:0:0:0: [sda] Starting disk
[ 1059.826214] WARN_ON((dev_priv->uncore.funcs.mmio_readl(dev_priv, (((const i...
[ 1059.826228] ------------[ cut here ]------------
[ 1059.826242] WARNING: CPU: 5 PID: 5644 at drivers/gpu/drm/i915/intel_ringbuf...
[ 1059.826242] Modules linked in: vgem snd_hda_codec_hdmi i915 x86_pkg_temp_th...
[ 1059.826253] CPU: 5 PID: 5644 Comm: kworker/u16:18 Tainted: G     U         ...
[ 1059.826253] Hardware name: MSI MS-7924/Z97M-G43(MS-7924), BIOS V1.12 02/15/...
[ 1059.826256] Workqueue: events_unbound async_run_entry_fn
[ 1059.826257] task: ffff8803d566d340 task.stack: ffffc9000058c000
[ 1059.826271] RIP: 0010:init_ring_common+0x61e/0x630 [i915]
...
 airlied_3 / shard-hsw5
[  967.204987] Setting dangerous option reset - tainting kernel
[  967.205205] i915 0000:00:02.0: Resetting chip after gpu hang
[  967.205995] Setting dangerous option reset - tainting kernel
[  967.224046] Suspending console(s) (use no_console_suspend to debug)
[  967.224991] sd 2:0:0:0: [sda] Synchronizing SCSI cache
[  967.229585] sd 2:0:0:0: [sda] Stopping disk
[  974.711025] i915 0000:00:02.0: Resetting chip after gpu hang
[  979.737793] sd 2:0:0:0: [sda] Starting disk
[  979.743779] WARN_ON((dev_priv->uncore.funcs.mmio_readl(dev_priv, (((const i...
[  979.743797] ------------[ cut here ]------------
[  979.743816] WARNING: CPU: 2 PID: 5688 at drivers/gpu/drm/i915/intel_ringbuf...
[  979.743817] Modules linked in: vgem snd_hda_codec_realtek snd_hda_codec_gen...
[  979.743832] CPU: 2 PID: 5688 Comm: kworker/u16:22 Tainted: G     U         ...
[  979.743833] Hardware name: MSI MS-7924/Z97M-G43(MS-7924), BIOS V1.12 02/15/...
[  979.743836] Workqueue: events_unbound async_run_entry_fn
[  979.743837] task: ffff88038bac29c0 task.stack: ffffc90000650000
[  979.743856] RIP: 0010:init_ring_common+0x61e/0x630 [i915]
...
 airlied_4 / shard-hsw3
[ 1471.553273] Setting dangerous option reset - tainting kernel
[ 1471.553550] i915 0000:00:02.0: Resetting chip after gpu hang
[ 1471.555742] Setting dangerous option reset - tainting kernel
[ 1471.567287] Suspending console(s) (use no_console_suspend to debug)
[ 1471.569117] sd 4:0:0:0: [sda] Synchronizing SCSI cache
[ 1471.569311] sd 4:0:0:0: [sda] Stopping disk
[ 1479.767295] i915 0000:00:02.0: Resetting chip after gpu hang
[ 1484.800151] sd 4:0:0:0: [sda] Starting disk
[ 1484.802634] WARN_ON((dev_priv->uncore.funcs.mmio_readl(dev_priv, (((const i...
[ 1484.802650] ------------[ cut here ]------------
[ 1484.802667] WARNING: CPU: 7 PID: 10409 at drivers/gpu/drm/i915/intel_ringbu...
[ 1484.802668] Modules linked in: i2c_dev vgem snd_hda_codec_hdmi i915 x86_pkg...
[ 1484.802706] CPU: 7 PID: 10409 Comm: kworker/u16:8 Tainted: G     U  W      ...
[ 1484.802707] Hardware name: MSI MS-7924/Z97M-G43(MS-7924), BIOS V1.12 02/15/...
[ 1484.802711] Workqueue: events_unbound async_run_entry_fn
[ 1484.802714] task: ffff880406b65340 task.stack: ffffc90000c74000
[ 1484.802730] RIP: 0010:init_ring_common+0x606/0x610 [i915]
...
 airlied_5 / shard-hsw4
[  520.018238] Setting dangerous option reset - tainting kernel
[  520.020546] i915 0000:00:02.0: Resetting chip after gpu hang
[  520.023717] Setting dangerous option reset - tainting kernel
[  520.034324] Suspending console(s) (use no_console_suspend to debug)
[  520.036557] sd 2:0:0:0: [sda] Synchronizing SCSI cache
[  520.037008] sd 2:0:0:0: [sda] Stopping disk
[  527.712368] i915 0000:00:02.0: Resetting chip after gpu hang
[  532.752753] WARN_ON((dev_priv->uncore.funcs.mmio_readl(dev_priv, (((const i...
[  532.752772] ------------[ cut here ]------------
[  532.752791] WARNING: CPU: 1 PID: 2811 at drivers/gpu/drm/i915/intel_ringbuf...
[  532.752793] Modules linked in: vgem snd_hda_codec_hdmi i915 x86_pkg_temp_th...
[  532.752834] CPU: 1 PID: 2811 Comm: kworker/u16:10 Tainted: G     U         ...
[  532.752836] Hardware name: MSI MS-7924/Z97M-G43(MS-7924), BIOS V1.12 02/15/...
[  532.752840] Workqueue: events_unbound async_run_entry_fn
[  532.752844] task: ffff8803fb1229c0 task.stack: ffffc90000d40000
[  532.752863] RIP: 0010:init_ring_common+0x606/0x610 [i915]
[  532.752865] RSP: 0018:ffffc90000d43c20 EFLAGS: 00010282
...
 
 
 
 
 
 airlied_6 / shard-apl7
(gem_eio:3480) igt-core-WARNING: [cmd] rtcwake: [cmd] write error
(gem_eio:3480) igt-aux-WARNING: rtcwake failed with 1
Check dmesg for further details.
(gem_eio:3480) igt-aux-CRITICAL: Test assertion failure function suspend_via_r...
(gem_eio:3480) igt-aux-CRITICAL: Failed assertion: ret == 0
(gem_eio:3480) igt-aux-CRITICAL: error: 1 != 0
Subtest in-flight-suspend failed.
**** DEBUG ****
(gem_eio:3480) DEBUG: Test requirement passed: gem_has_exec_fence(fd)
(gem_eio:3480) DEBUG: Disabling GPU reset
(gem_eio:3480) DEBUG: Test requirement passed: fd >= 0
(gem_eio:3480) DEBUG: Test requirement passed: i915_reset_control(false)
(gem_eio:3480) ioctl-wrappers-DEBUG: Test requirement passed: gem_has_ring(fd,...
(gem_eio:3480) i915/gem-context-DEBUG: Test requirement passed: has_ban_period...
(gem_eio:3480) igt-gt-DEBUG: Test requirement passed: has_gpu_reset(fd)
(gem_eio:3480) igt-gt-DEBUG: Test requirement passed: ctx == 0 || has_ctx_exec...
(gem_eio:3480) igt-core-DEBUG: Test requirement passed: !igt_run_in_simulation()
...
 airlied_2 / shard-kbl4
[  215.103713] Setting dangerous option reset - tainting kernel
[  215.105947] i915 0000:00:02.0: Resetting chip after gpu hang
[  215.111314] Setting dangerous option reset - tainting kernel
[  215.125658] Suspending console(s) (use no_console_suspend to debug)
[  230.777952] i915 0000:00:02.0: Resetting chip after gpu hang

[  230.779569] ======================================================
[  230.779570] WARNING: possible circular locking dependency detected
[  230.779573] 4.14.0-rc3-CI-airlied_2+ #1 Tainted: G     U         
[  230.779574] ------------------------------------------------------
[  230.779577] kworker/u8:9/1439 is trying to acquire lock:
[  230.779578]  (cpu_hotplug_lock.rw_sem){++++}, at: [<ffffffff8113d4bc>] stop...
[  230.779592] 
               but task is already holding lock:
[  230.779593]  (&dev->struct_mutex){+.+.}, at: [<ffffffffa01add3c>] i915_gem_...
[  230.779664] 
               which lock already depends on the new lock.
...
 airlied_3 / shard-kbl7
[  211.867126] Setting dangerous option reset - tainting kernel
[  211.869533] i915 0000:00:02.0: Resetting chip after gpu hang
[  211.872997] Setting dangerous option reset - tainting kernel
[  211.887895] Suspending console(s) (use no_console_suspend to debug)
[  227.770739] i915 0000:00:02.0: Resetting chip after gpu hang

[  227.772965] ======================================================
[  227.772967] WARNING: possible circular locking dependency detected
[  227.772970] 4.14.0-rc3-CI-airlied_3+ #1 Tainted: G     U         
[  227.772972] ------------------------------------------------------
[  227.772974] kworker/u8:41/1553 is trying to acquire lock:
[  227.772976]  (cpu_hotplug_lock.rw_sem){++++}, at: [<ffffffff8113d4bc>] stop...
[  227.772992] 
               but task is already holding lock:
[  227.772993]  (&dev->struct_mutex){+.+.}, at: [<ffffffffa0196d3c>] i915_gem_...
[  227.773076] 
               which lock already depends on the new lock.
...
 airlied_4 / shard-kbl1
[  212.992522] Setting dangerous option reset - tainting kernel
[  212.993068] i915 0000:00:02.0: Resetting chip after gpu hang
[  212.998236] Setting dangerous option reset - tainting kernel
[  213.012332] Suspending console(s) (use no_console_suspend to debug)
[  228.704441] i915 0000:00:02.0: Resetting chip after gpu hang
[  233.792156] [drm:drm_lspcon_get_mode] *ERROR* LSPCON read(0x80, 0x41) failed
[  233.792180] [drm:lspcon_wait_mode [i915]] *ERROR* Error reading LSPCON mode
[  233.806449] [drm:drm_lspcon_get_mode] *ERROR* LSPCON read(0x80, 0x41) failed
[  233.806473] [drm:lspcon_change_mode.constprop.4 [i915]] *ERROR* Error readi...
[  233.806492] [drm:lspcon_resume [i915]] *ERROR* LSPCON resume failed
[  234.107275] Setting dangerous option reset - tainting kernel
[  234.107668] i915 0000:00:02.0: Resetting chip after gpu hang
[  234.135326] Setting dangerous option reset - tainting kernel
[  234.135810] i915 0000:00:02.0: Resetting chip after gpu hang
 airlied_5 / shard-kbl2
[  193.037681] Setting dangerous option reset - tainting kernel
[  193.040152] i915 0000:00:02.0: Resetting chip after gpu hang
[  193.044355] Setting dangerous option reset - tainting kernel
[  193.059433] Suspending console(s) (use no_console_suspend to debug)
[  206.752430] i915 0000:00:02.0: Resetting chip after gpu hang
[  211.828117] [drm:drm_lspcon_get_mode] *ERROR* LSPCON read(0x80, 0x41) failed
[  211.828141] [drm:lspcon_wait_mode [i915]] *ERROR* Error reading LSPCON mode
[  211.842382] [drm:drm_lspcon_get_mode] *ERROR* LSPCON read(0x80, 0x41) failed
[  211.842406] [drm:lspcon_change_mode.constprop.4 [i915]] *ERROR* Error readi...
[  211.842425] [drm:lspcon_resume [i915]] *ERROR* LSPCON resume failed
[  212.136604] Setting dangerous option reset - tainting kernel
[  212.137398] i915 0000:00:02.0: Resetting chip after gpu hang
[  212.166410] Setting dangerous option reset - tainting kernel
[  212.166838] i915 0000:00:02.0: Resetting chip after gpu hang
 
igt@gem_eio@wait
 
 
 
 
 
 
 
 
 
 
 
 
 
 
 
 airlied_2 / shard-kbl1
[   79.847555] ------------[ cut here ]------------
[   79.847582] WARNING: CPU: 0 PID: 0 at net/sched/sch_generic.c:320 dev_watch...
[   79.847600] Modules linked in: snd_hda_codec_hdmi snd_hda_codec_realtek snd...
[   79.848011] CPU: 0 PID: 0 Comm: swapper/0 Tainted: G     U          4.14.0-...
[   79.848041] Hardware name:                  /NUC7i5BNB, BIOS BNKBL357.86A.0...
[   79.848073] task: ffffffff81e15500 task.stack: ffffffff81e00000
[   79.848106] RIP: 0010:dev_watchdog+0x21d/0x230
[   79.848138] RSP: 0018:ffff88027ec03e18 EFLAGS: 00010296
[   79.848187] RAX: 000000000000003a RBX: 0000000000000000 RCX: 0000000000000103
[   79.848217] RDX: 0000000000000103 RSI: 00000000000000f6 RDI: 00000000ffffffff
[   79.848251] RBP: ffff88027ec03e48 R08: ffffffff81e15e08 R09: 0000000000000000
[   79.848280] R10: 00000000b81131c3 R11: 0000000000000000 R12: ffff880271241e58
[   79.848313] R13: 0000000000000000 R14: ffff88026852c000 R15: 0000000000000001
[   79.848342] FS:  0000000000000000(0000) GS:ffff88027ec00000(0000) knlGS:000...
[   79.848372] CS:  0010 DS: 0000 ES: 0000 CR0: 0000000080050033
[   79.848402] CR2: 00007fdd79731dc8 CR3: 000000026f00f002 CR4: 00000000003606f0
[   79.848545] Call Trace:
...
 airlied_3 / shard-kbl4
[   81.895716] ------------[ cut here ]------------
[   81.895763] WARNING: CPU: 3 PID: 0 at net/sched/sch_generic.c:320 dev_watch...
[   81.895797] Modules linked in: snd_hda_codec_hdmi snd_hda_codec_realtek snd...
[   81.896330] CPU: 3 PID: 0 Comm: swapper/3 Tainted: G     U          4.14.0-...
[   81.896363] Hardware name:                  /NUC7i5BNB, BIOS BNKBL357.86A.0...
[   81.896395] task: ffff880275342a40 task.stack: ffffc900000bc000
[   81.896432] RIP: 0010:dev_watchdog+0x21d/0x230
[   81.896466] RSP: 0018:ffff88027ed83e18 EFLAGS: 00010296
[   81.896521] RAX: 000000000000003a RBX: 0000000000000000 RCX: 0000000000000103
[   81.896555] RDX: 0000000000000103 RSI: 00000000000000f6 RDI: 00000000ffffffff
[   81.896588] RBP: ffff88027ed83e48 R08: ffff880275343348 R09: 0000000000000000
[   81.896621] R10: 00000000af066716 R11: 0000000000000000 R12: ffff88026f78bc28
[   81.896654] R13: 0000000000000003 R14: ffff8802690d4000 R15: 0000000000000001
[   81.896690] FS:  0000000000000000(0000) GS:ffff88027ed80000(0000) knlGS:000...
[   81.896725] CS:  0010 DS: 0000 ES: 0000 CR0: 0000000080050033
[   81.896759] CR2: 000055d0f0066628 CR3: 000000026b161006 CR4: 00000000003606e0
[   81.896791] Call Trace:
...
 
 
 
igt@gem_exec_params@invalid-bsd2-flag-on-render
 
 
 
 
 
 
 
 
 
 
 
 
 
 
 
 airlied_2 / shard-kbl3
[   81.686774] [drm:intel_dp_get_link_train_fallback_values [i915]] *ERROR* Li...
 
 
 
 
igt@gem_exec_reloc@basic-write-read-noreloc
 
 
 
 
 
 
 
 
 
 
 
 
 
 
 
 
 airlied_3 / shard-kbl4
[  383.711845] i915 0000:00:02.0: Resetting bcs0 after gpu hang
[  383.713673] i915 0000:00:02.0: Resetting vcs0 after gpu hang
[  383.715303] i915 0000:00:02.0: Resetting vcs1 after gpu hang
[  383.716505] i915 0000:00:02.0: Resetting vecs0 after gpu hang
[  387.744091] i915 0000:00:02.0: Resetting rcs0 after gpu hang
[  395.743662] i915 0000:00:02.0: Resetting bcs0 after gpu hang
[  395.744469] i915 0000:00:02.0: Resetting vcs0 after gpu hang
[  395.745370] i915 0000:00:02.0: Resetting vecs0 after gpu hang
[  403.743946] i915 0000:00:02.0: Resetting rcs0 after gpu hang
[  419.744071] i915 0000:00:02.0: Resetting rcs0 after gpu hang
[  435.744233] i915 0000:00:02.0: Resetting rcs0 after gpu hang
[  449.760163] i915 0000:00:02.0: Resetting rcs0 after gpu hang
[  449.764225] Setting dangerous option reset - tainting kernel
[  461.727962] i915 0000:00:02.0: Resetting bcs0 after gpu hang
[  461.729487] i915 0000:00:02.0: Resetting vcs1 after gpu hang
[  461.731313] i915 0000:00:02.0: Resetting vecs0 after gpu hang
[  463.712247] i915 0000:00:02.0: Resetting rcs0 after gpu hang
...
 
 
 
igt@gem_exec_reuse@contexts
 
 
 
 
 
 
 
 
 
 
 
 
 
 
 
 
 
 
 
 airlied_6 / shard-kbl2
[   48.111145] ------------[ cut here ]------------
[   48.111151] WARNING: CPU: 2 PID: 1554 at net/sched/sch_generic.c:320 dev_wa...
[   48.111153] Modules linked in: vgem snd_hda_codec_hdmi snd_hda_codec_realte...
[   48.111186] CPU: 2 PID: 1554 Comm: gem_exec_reuse Tainted: G     U         ...
[   48.111188] Hardware name:                  /NUC7i5BNB, BIOS BNKBL357.86A.0...
[   48.111189] task: ffff880269d80040 task.stack: ffffc90001ddc000
[   48.111192] RIP: 0010:dev_watchdog+0x21e/0x230
[   48.111193] RSP: 0018:ffff88027ed03e48 EFLAGS: 00010296
[   48.111195] RAX: 000000000000003a RBX: 0000000000000000 RCX: 0000000000000102
[   48.111197] RDX: 0000000080000102 RSI: ffffffff81d2025f RDI: 00000000ffffffff
[   48.111198] RBP: ffff88026dca03e0 R08: ffff880269d80928 R09: 0000000000000000
[   48.111200] R10: 0000000027c4f95d R11: 0000000000000000 R12: ffff88026dca0000
[   48.111201] R13: 0000000000000002 R14: 0000000000000001 R15: ffff88026ed5cdc8
[   48.111203] FS:  00007f181e61d8c0(0000) GS:ffff88027ed00000(0000) knlGS:000...
[   48.111204] CS:  0010 DS: 0000 ES: 0000 CR0: 0000000080050033
[   48.111205] CR2: 00007f181b6af000 CR3: 0000000269545004 CR4: 00000000003606e0
[   48.111207] Call Trace:
...
igt@gem_exec_schedule@deep-blt
 airlied_5 / shard-apl7
(gem_exec_schedule:7737) igt-aux-CRITICAL: Test assertion failure function sig...
(gem_exec_schedule:7737) igt-aux-CRITICAL: Failed assertion: !"GPU hung"
Subtest deep-blt failed.
**** DEBUG ****
(gem_exec_schedule:7737) drmtest-DEBUG: Test requirement passed: !(fd<0)
(gem_exec_schedule:7737) ioctl-wrappers-DEBUG: Test requirement passed: gem_ha...
(gem_exec_schedule:7737) igt-dummyload-DEBUG: Test requirement passed: nengine
(gem_exec_schedule:7737) ioctl-wrappers-DEBUG: Test requirement passed: gem_ha...
(gem_exec_schedule:7737) igt-dummyload-DEBUG: Test requirement passed: nengine
(gem_exec_schedule:7737) ioctl-wrappers-DEBUG: Test requirement passed: gem_ha...
(gem_exec_schedule:7737) igt-dummyload-DEBUG: Test requirement passed: nengine
(gem_exec_schedule:7737) ioctl-wrappers-DEBUG: Test requirement passed: gem_ha...
(gem_exec_schedule:7737) igt-dummyload-DEBUG: Test requirement passed: nengine
(gem_exec_schedule:7737) ioctl-wrappers-DEBUG: Test requirement passed: gem_ha...
(gem_exec_schedule:7737) igt-dummyload-DEBUG: Test requirement passed: nengine
(gem_exec_schedule:7737) ioctl-wrappers-DEBUG: Test requirement passed: gem_ha...
(gem_exec_schedule:7737) igt-dummyload-DEBUG: Test requirement passed: nengine
...
 
 
igt@gem_exec_schedule@deep-bsd
 
igt@gem_exec_schedule@deep-bsd1
 
 
 
igt@gem_exec_schedule@deep-bsd2
 
igt@gem_exec_schedule@deep-vebox
 
 
igt@gem_exec_schedule@in-order-blt
 
 
 
 
 
 
igt@gem_exec_schedule@in-order-bsd
 
 
 
 
 
 
igt@gem_exec_schedule@in-order-bsd1
 
 
 
igt@gem_exec_schedule@in-order-bsd2
 
 
 
igt@gem_exec_schedule@in-order-render
 
 
 
 
 
 
igt@gem_exec_schedule@in-order-vebox
 
 
 
 
 
 
igt@gem_exec_schedule@out-order-blt
 
 
 
 
 
 
igt@gem_exec_schedule@out-order-bsd
 
 
 
 
 
 
 
igt@gem_exec_schedule@out-order-bsd1
 
 
 
 
 
igt@gem_exec_schedule@out-order-bsd2
 
 
 
igt@gem_exec_schedule@out-order-render
 
 
 
 
 
 
igt@gem_exec_schedule@out-order-vebox
 
 
 
 
 
 
igt@gem_exec_schedule@pi-ringfull-blt
 airlied_4 / shard-apl3
(gem_exec_schedule:3529) CRITICAL: Test assertion failure function test_pi_rin...
(gem_exec_schedule:3529) CRITICAL: Failed assertion: result[2]
(gem_exec_schedule:3529) CRITICAL: Last errno: 4, Interrupted system call
(gem_exec_schedule:3529) CRITICAL: High priority child unable to submit within...
Subtest pi-ringfull-blt failed.
**** DEBUG ****
(gem_exec_schedule:3529) drmtest-DEBUG: Test requirement passed: !(fd<0)
(gem_exec_schedule:3529) DEBUG: Filled low-priority ring with 199 batches
(gem_exec_schedule:3529) DEBUG: LP parent executing
(gem_exec_schedule:3529) CRITICAL: Test assertion failure function test_pi_rin...
(gem_exec_schedule:3529) CRITICAL: Failed assertion: result[2]
(gem_exec_schedule:3529) CRITICAL: Last errno: 4, Interrupted system call
(gem_exec_schedule:3529) CRITICAL: High priority child unable to submit within...
(gem_exec_schedule:3529) igt-core-INFO: Stack trace:
(gem_exec_schedule:3529) igt-core-INFO:   #0 [__igt_fail_assert+0x101]
(gem_exec_schedule:3529) igt-core-INFO:   #1 [__real_main951+0x23f4]
(gem_exec_schedule:3529) igt-core-INFO:   #2 [main+0x27]
...
 airlied_5 / shard-apl5
(gem_exec_schedule:3304) CRITICAL: Test assertion failure function test_pi_rin...
(gem_exec_schedule:3304) CRITICAL: Failed assertion: result[2]
(gem_exec_schedule:3304) CRITICAL: Last errno: 4, Interrupted system call
(gem_exec_schedule:3304) CRITICAL: High priority child unable to submit within...
Subtest pi-ringfull-blt failed.
**** DEBUG ****
(gem_exec_schedule:3304) drmtest-DEBUG: Test requirement passed: !(fd<0)
(gem_exec_schedule:3304) DEBUG: Filled low-priority ring with 199 batches
(gem_exec_schedule:3304) DEBUG: LP parent executing
(gem_exec_schedule:3304) CRITICAL: Test assertion failure function test_pi_rin...
(gem_exec_schedule:3304) CRITICAL: Failed assertion: result[2]
(gem_exec_schedule:3304) CRITICAL: Last errno: 4, Interrupted system call
(gem_exec_schedule:3304) CRITICAL: High priority child unable to submit within...
(gem_exec_schedule:3304) igt-core-INFO: Stack trace:
(gem_exec_schedule:3304) igt-core-INFO:   #0 [__igt_fail_assert+0x101]
(gem_exec_schedule:3304) igt-core-INFO:   #1 [__real_main951+0x23f4]
(gem_exec_schedule:3304) igt-core-INFO:   #2 [main+0x27]
...
 airlied_6 / shard-apl6
(gem_exec_schedule:6716) CRITICAL: Test assertion failure function test_pi_rin...
(gem_exec_schedule:6716) CRITICAL: Failed assertion: result[2]
(gem_exec_schedule:6716) CRITICAL: Last errno: 4, Interrupted system call
(gem_exec_schedule:6716) CRITICAL: High priority child unable to submit within...
Subtest pi-ringfull-blt failed.
**** DEBUG ****
(gem_exec_schedule:6716) drmtest-DEBUG: Test requirement passed: !(fd<0)
(gem_exec_schedule:6716) DEBUG: Filled low-priority ring with 199 batches
(gem_exec_schedule:6716) DEBUG: LP parent executing
(gem_exec_schedule:6716) CRITICAL: Test assertion failure function test_pi_rin...
(gem_exec_schedule:6716) CRITICAL: Failed assertion: result[2]
(gem_exec_schedule:6716) CRITICAL: Last errno: 4, Interrupted system call
(gem_exec_schedule:6716) CRITICAL: High priority child unable to submit within...
(gem_exec_schedule:6716) igt-core-INFO: Stack trace:
(gem_exec_schedule:6716) igt-core-INFO:   #0 [__igt_fail_assert+0x101]
(gem_exec_schedule:6716) igt-core-INFO:   #1 [__real_main951+0x23f4]
(gem_exec_schedule:6716) igt-core-INFO:   #2 [main+0x27]
...
 airlied_4 / shard-kbl1
(gem_exec_schedule:2526) CRITICAL: Test assertion failure function test_pi_rin...
(gem_exec_schedule:2526) CRITICAL: Failed assertion: result[2]
(gem_exec_schedule:2526) CRITICAL: Last errno: 4, Interrupted system call
(gem_exec_schedule:2526) CRITICAL: High priority child unable to submit within...
Subtest pi-ringfull-blt failed.
**** DEBUG ****
(gem_exec_schedule:2526) drmtest-DEBUG: Test requirement passed: !(fd<0)
(gem_exec_schedule:2526) DEBUG: Filled low-priority ring with 199 batches
(gem_exec_schedule:2526) DEBUG: LP parent executing
(gem_exec_schedule:2526) CRITICAL: Test assertion failure function test_pi_rin...
(gem_exec_schedule:2526) CRITICAL: Failed assertion: result[2]
(gem_exec_schedule:2526) CRITICAL: Last errno: 4, Interrupted system call
(gem_exec_schedule:2526) CRITICAL: High priority child unable to submit within...
(gem_exec_schedule:2526) igt-core-INFO: Stack trace:
(gem_exec_schedule:2526) igt-core-INFO:   #0 [__igt_fail_assert+0x101]
(gem_exec_schedule:2526) igt-core-INFO:   #1 [__real_main951+0x23f4]
(gem_exec_schedule:2526) igt-core-INFO:   #2 [main+0x27]
...
 airlied_5 / shard-kbl1
(gem_exec_schedule:1433) CRITICAL: Test assertion failure function test_pi_rin...
(gem_exec_schedule:1433) CRITICAL: Failed assertion: result[2]
(gem_exec_schedule:1433) CRITICAL: Last errno: 4, Interrupted system call
(gem_exec_schedule:1433) CRITICAL: High priority child unable to submit within...
Subtest pi-ringfull-blt failed.
**** DEBUG ****
(gem_exec_schedule:1433) drmtest-DEBUG: Test requirement passed: !(fd<0)
(gem_exec_schedule:1433) DEBUG: Filled low-priority ring with 199 batches
(gem_exec_schedule:1433) DEBUG: LP parent executing
(gem_exec_schedule:1433) CRITICAL: Test assertion failure function test_pi_rin...
(gem_exec_schedule:1433) CRITICAL: Failed assertion: result[2]
(gem_exec_schedule:1433) CRITICAL: Last errno: 4, Interrupted system call
(gem_exec_schedule:1433) CRITICAL: High priority child unable to submit within...
(gem_exec_schedule:1433) igt-core-INFO: Stack trace:
(gem_exec_schedule:1433) igt-core-INFO:   #0 [__igt_fail_assert+0x101]
(gem_exec_schedule:1433) igt-core-INFO:   #1 [__real_main951+0x23f4]
(gem_exec_schedule:1433) igt-core-INFO:   #2 [main+0x27]
...
 airlied_6 / shard-kbl3
(gem_exec_schedule:3696) CRITICAL: Test assertion failure function test_pi_rin...
(gem_exec_schedule:3696) CRITICAL: Failed assertion: result[2]
(gem_exec_schedule:3696) CRITICAL: Last errno: 4, Interrupted system call
(gem_exec_schedule:3696) CRITICAL: High priority child unable to submit within...
Subtest pi-ringfull-blt failed.
**** DEBUG ****
(gem_exec_schedule:3696) drmtest-DEBUG: Test requirement passed: !(fd<0)
(gem_exec_schedule:3696) DEBUG: Filled low-priority ring with 199 batches
(gem_exec_schedule:3696) DEBUG: LP parent executing
(gem_exec_schedule:3696) CRITICAL: Test assertion failure function test_pi_rin...
(gem_exec_schedule:3696) CRITICAL: Failed assertion: result[2]
(gem_exec_schedule:3696) CRITICAL: Last errno: 4, Interrupted system call
(gem_exec_schedule:3696) CRITICAL: High priority child unable to submit within...
(gem_exec_schedule:3696) igt-core-INFO: Stack trace:
(gem_exec_schedule:3696) igt-core-INFO:   #0 [__igt_fail_assert+0x101]
(gem_exec_schedule:3696) igt-core-INFO:   #1 [__real_main951+0x23f4]
(gem_exec_schedule:3696) igt-core-INFO:   #2 [main+0x27]
...
igt@gem_exec_schedule@pi-ringfull-bsd
 airlied_4 / shard-apl4
(gem_exec_schedule:6831) CRITICAL: Test assertion failure function test_pi_rin...
(gem_exec_schedule:6831) CRITICAL: Failed assertion: result[2]
(gem_exec_schedule:6831) CRITICAL: Last errno: 4, Interrupted system call
(gem_exec_schedule:6831) CRITICAL: High priority child unable to submit within...
Subtest pi-ringfull-bsd failed.
**** DEBUG ****
(gem_exec_schedule:6831) drmtest-DEBUG: Test requirement passed: !(fd<0)
(gem_exec_schedule:6831) DEBUG: Filled low-priority ring with 199 batches
(gem_exec_schedule:6831) DEBUG: LP parent executing
(gem_exec_schedule:6831) CRITICAL: Test assertion failure function test_pi_rin...
(gem_exec_schedule:6831) CRITICAL: Failed assertion: result[2]
(gem_exec_schedule:6831) CRITICAL: Last errno: 4, Interrupted system call
(gem_exec_schedule:6831) CRITICAL: High priority child unable to submit within...
(gem_exec_schedule:6831) igt-core-INFO: Stack trace:
(gem_exec_schedule:6831) igt-core-INFO:   #0 [__igt_fail_assert+0x101]
(gem_exec_schedule:6831) igt-core-INFO:   #1 [__real_main951+0x23f4]
(gem_exec_schedule:6831) igt-core-INFO:   #2 [main+0x27]
...
 airlied_5 / shard-apl3
(gem_exec_schedule:3059) CRITICAL: Test assertion failure function test_pi_rin...
(gem_exec_schedule:3059) CRITICAL: Failed assertion: result[2]
(gem_exec_schedule:3059) CRITICAL: Last errno: 4, Interrupted system call
(gem_exec_schedule:3059) CRITICAL: High priority child unable to submit within...
Subtest pi-ringfull-bsd failed.
**** DEBUG ****
(gem_exec_schedule:3059) drmtest-DEBUG: Test requirement passed: !(fd<0)
(gem_exec_schedule:3059) DEBUG: Filled low-priority ring with 199 batches
(gem_exec_schedule:3059) DEBUG: LP parent executing
(gem_exec_schedule:3059) CRITICAL: Test assertion failure function test_pi_rin...
(gem_exec_schedule:3059) CRITICAL: Failed assertion: result[2]
(gem_exec_schedule:3059) CRITICAL: Last errno: 4, Interrupted system call
(gem_exec_schedule:3059) CRITICAL: High priority child unable to submit within...
(gem_exec_schedule:3059) igt-core-INFO: Stack trace:
(gem_exec_schedule:3059) igt-core-INFO:   #0 [__igt_fail_assert+0x101]
(gem_exec_schedule:3059) igt-core-INFO:   #1 [__real_main951+0x23f4]
(gem_exec_schedule:3059) igt-core-INFO:   #2 [main+0x27]
...
 airlied_6 / shard-apl5
(gem_exec_schedule:1664) CRITICAL: Test assertion failure function test_pi_rin...
(gem_exec_schedule:1664) CRITICAL: Failed assertion: result[2]
(gem_exec_schedule:1664) CRITICAL: Last errno: 4, Interrupted system call
(gem_exec_schedule:1664) CRITICAL: High priority child unable to submit within...
Subtest pi-ringfull-bsd failed.
**** DEBUG ****
(gem_exec_schedule:1664) drmtest-DEBUG: Test requirement passed: !(fd<0)
(gem_exec_schedule:1664) DEBUG: Filled low-priority ring with 199 batches
(gem_exec_schedule:1664) DEBUG: LP parent executing
(gem_exec_schedule:1664) CRITICAL: Test assertion failure function test_pi_rin...
(gem_exec_schedule:1664) CRITICAL: Failed assertion: result[2]
(gem_exec_schedule:1664) CRITICAL: Last errno: 4, Interrupted system call
(gem_exec_schedule:1664) CRITICAL: High priority child unable to submit within...
(gem_exec_schedule:1664) igt-core-INFO: Stack trace:
(gem_exec_schedule:1664) igt-core-INFO:   #0 [__igt_fail_assert+0x101]
(gem_exec_schedule:1664) igt-core-INFO:   #1 [__real_main951+0x23f4]
(gem_exec_schedule:1664) igt-core-INFO:   #2 [main+0x27]
...
 airlied_4 / shard-kbl6
(gem_exec_schedule:1239) CRITICAL: Test assertion failure function test_pi_rin...
(gem_exec_schedule:1239) CRITICAL: Failed assertion: result[2]
(gem_exec_schedule:1239) CRITICAL: Last errno: 4, Interrupted system call
(gem_exec_schedule:1239) CRITICAL: High priority child unable to submit within...
Subtest pi-ringfull-bsd failed.
**** DEBUG ****
(gem_exec_schedule:1239) drmtest-DEBUG: Test requirement passed: !(fd<0)
(gem_exec_schedule:1239) DEBUG: Filled low-priority ring with 199 batches
(gem_exec_schedule:1239) DEBUG: LP parent executing
(gem_exec_schedule:1239) CRITICAL: Test assertion failure function test_pi_rin...
(gem_exec_schedule:1239) CRITICAL: Failed assertion: result[2]
(gem_exec_schedule:1239) CRITICAL: Last errno: 4, Interrupted system call
(gem_exec_schedule:1239) CRITICAL: High priority child unable to submit within...
(gem_exec_schedule:1239) igt-core-INFO: Stack trace:
(gem_exec_schedule:1239) igt-core-INFO:   #0 [__igt_fail_assert+0x101]
(gem_exec_schedule:1239) igt-core-INFO:   #1 [__real_main951+0x23f4]
(gem_exec_schedule:1239) igt-core-INFO:   #2 [main+0x27]
...
 airlied_5 / shard-kbl1
(gem_exec_schedule:3093) CRITICAL: Test assertion failure function test_pi_rin...
(gem_exec_schedule:3093) CRITICAL: Failed assertion: result[2]
(gem_exec_schedule:3093) CRITICAL: Last errno: 4, Interrupted system call
(gem_exec_schedule:3093) CRITICAL: High priority child unable to submit within...
Subtest pi-ringfull-bsd failed.
**** DEBUG ****
(gem_exec_schedule:3093) drmtest-DEBUG: Test requirement passed: !(fd<0)
(gem_exec_schedule:3093) DEBUG: Filled low-priority ring with 199 batches
(gem_exec_schedule:3093) DEBUG: LP parent executing
(gem_exec_schedule:3093) CRITICAL: Test assertion failure function test_pi_rin...
(gem_exec_schedule:3093) CRITICAL: Failed assertion: result[2]
(gem_exec_schedule:3093) CRITICAL: Last errno: 4, Interrupted system call
(gem_exec_schedule:3093) CRITICAL: High priority child unable to submit within...
(gem_exec_schedule:3093) igt-core-INFO: Stack trace:
(gem_exec_schedule:3093) igt-core-INFO:   #0 [__igt_fail_assert+0x101]
(gem_exec_schedule:3093) igt-core-INFO:   #1 [__real_main951+0x23f4]
(gem_exec_schedule:3093) igt-core-INFO:   #2 [main+0x27]
...
 airlied_6 / shard-kbl7
(gem_exec_schedule:1710) CRITICAL: Test assertion failure function test_pi_rin...
(gem_exec_schedule:1710) CRITICAL: Failed assertion: result[2]
(gem_exec_schedule:1710) CRITICAL: Last errno: 4, Interrupted system call
(gem_exec_schedule:1710) CRITICAL: High priority child unable to submit within...
Subtest pi-ringfull-bsd failed.
**** DEBUG ****
(gem_exec_schedule:1710) drmtest-DEBUG: Test requirement passed: !(fd<0)
(gem_exec_schedule:1710) DEBUG: Filled low-priority ring with 199 batches
(gem_exec_schedule:1710) DEBUG: LP parent executing
(gem_exec_schedule:1710) CRITICAL: Test assertion failure function test_pi_rin...
(gem_exec_schedule:1710) CRITICAL: Failed assertion: result[2]
(gem_exec_schedule:1710) CRITICAL: Last errno: 4, Interrupted system call
(gem_exec_schedule:1710) CRITICAL: High priority child unable to submit within...
(gem_exec_schedule:1710) igt-core-INFO: Stack trace:
(gem_exec_schedule:1710) igt-core-INFO:   #0 [__igt_fail_assert+0x101]
(gem_exec_schedule:1710) igt-core-INFO:   #1 [__real_main951+0x23f4]
(gem_exec_schedule:1710) igt-core-INFO:   #2 [main+0x27]
...
igt@gem_exec_schedule@pi-ringfull-bsd1
 airlied_4 / shard-kbl1
(gem_exec_schedule:3238) CRITICAL: Test assertion failure function test_pi_rin...
(gem_exec_schedule:3238) CRITICAL: Failed assertion: result[2]
(gem_exec_schedule:3238) CRITICAL: Last errno: 4, Interrupted system call
(gem_exec_schedule:3238) CRITICAL: High priority child unable to submit within...
Subtest pi-ringfull-bsd1 failed.
**** DEBUG ****
(gem_exec_schedule:3238) drmtest-DEBUG: Test requirement passed: !(fd<0)
(gem_exec_schedule:3238) DEBUG: Filled low-priority ring with 199 batches
(gem_exec_schedule:3238) DEBUG: LP parent executing
(gem_exec_schedule:3238) CRITICAL: Test assertion failure function test_pi_rin...
(gem_exec_schedule:3238) CRITICAL: Failed assertion: result[2]
(gem_exec_schedule:3238) CRITICAL: Last errno: 4, Interrupted system call
(gem_exec_schedule:3238) CRITICAL: High priority child unable to submit within...
(gem_exec_schedule:3238) igt-core-INFO: Stack trace:
(gem_exec_schedule:3238) igt-core-INFO:   #0 [__igt_fail_assert+0x101]
(gem_exec_schedule:3238) igt-core-INFO:   #1 [__real_main951+0x23f4]
(gem_exec_schedule:3238) igt-core-INFO:   #2 [main+0x27]
...
 airlied_5 / shard-kbl3
(gem_exec_schedule:3142) CRITICAL: Test assertion failure function test_pi_rin...
(gem_exec_schedule:3142) CRITICAL: Failed assertion: result[2]
(gem_exec_schedule:3142) CRITICAL: Last errno: 4, Interrupted system call
(gem_exec_schedule:3142) CRITICAL: High priority child unable to submit within...
Subtest pi-ringfull-bsd1 failed.
**** DEBUG ****
(gem_exec_schedule:3142) drmtest-DEBUG: Test requirement passed: !(fd<0)
(gem_exec_schedule:3142) DEBUG: Filled low-priority ring with 199 batches
(gem_exec_schedule:3142) DEBUG: LP parent executing
(gem_exec_schedule:3142) CRITICAL: Test assertion failure function test_pi_rin...
(gem_exec_schedule:3142) CRITICAL: Failed assertion: result[2]
(gem_exec_schedule:3142) CRITICAL: Last errno: 4, Interrupted system call
(gem_exec_schedule:3142) CRITICAL: High priority child unable to submit within...
(gem_exec_schedule:3142) igt-core-INFO: Stack trace:
(gem_exec_schedule:3142) igt-core-INFO:   #0 [__igt_fail_assert+0x101]
(gem_exec_schedule:3142) igt-core-INFO:   #1 [__real_main951+0x23f4]
(gem_exec_schedule:3142) igt-core-INFO:   #2 [main+0x27]
...
 airlied_6 / shard-kbl5
(gem_exec_schedule:1469) CRITICAL: Test assertion failure function test_pi_rin...
(gem_exec_schedule:1469) CRITICAL: Failed assertion: result[2]
(gem_exec_schedule:1469) CRITICAL: Last errno: 4, Interrupted system call
(gem_exec_schedule:1469) CRITICAL: High priority child unable to submit within...
Subtest pi-ringfull-bsd1 failed.
**** DEBUG ****
(gem_exec_schedule:1469) drmtest-DEBUG: Test requirement passed: !(fd<0)
(gem_exec_schedule:1469) DEBUG: Filled low-priority ring with 199 batches
(gem_exec_schedule:1469) DEBUG: LP parent executing
(gem_exec_schedule:1469) CRITICAL: Test assertion failure function test_pi_rin...
(gem_exec_schedule:1469) CRITICAL: Failed assertion: result[2]
(gem_exec_schedule:1469) CRITICAL: Last errno: 4, Interrupted system call
(gem_exec_schedule:1469) CRITICAL: High priority child unable to submit within...
(gem_exec_schedule:1469) igt-core-INFO: Stack trace:
(gem_exec_schedule:1469) igt-core-INFO:   #0 [__igt_fail_assert+0x101]
(gem_exec_schedule:1469) igt-core-INFO:   #1 [__real_main951+0x23f4]
(gem_exec_schedule:1469) igt-core-INFO:   #2 [main+0x27]
...
igt@gem_exec_schedule@pi-ringfull-bsd2
 airlied_4 / shard-kbl6
(gem_exec_schedule:1844) CRITICAL: Test assertion failure function test_pi_rin...
(gem_exec_schedule:1844) CRITICAL: Failed assertion: result[2]
(gem_exec_schedule:1844) CRITICAL: Last errno: 4, Interrupted system call
(gem_exec_schedule:1844) CRITICAL: High priority child unable to submit within...
Subtest pi-ringfull-bsd2 failed.
**** DEBUG ****
(gem_exec_schedule:1844) drmtest-DEBUG: Test requirement passed: !(fd<0)
(gem_exec_schedule:1844) DEBUG: Filled low-priority ring with 199 batches
(gem_exec_schedule:1844) DEBUG: LP parent executing
(gem_exec_schedule:1844) CRITICAL: Test assertion failure function test_pi_rin...
(gem_exec_schedule:1844) CRITICAL: Failed assertion: result[2]
(gem_exec_schedule:1844) CRITICAL: Last errno: 4, Interrupted system call
(gem_exec_schedule:1844) CRITICAL: High priority child unable to submit within...
(gem_exec_schedule:1844) igt-core-INFO: Stack trace:
(gem_exec_schedule:1844) igt-core-INFO:   #0 [__igt_fail_assert+0x101]
(gem_exec_schedule:1844) igt-core-INFO:   #1 [__real_main951+0x23f4]
(gem_exec_schedule:1844) igt-core-INFO:   #2 [main+0x27]
...
 airlied_5 / shard-kbl6
(gem_exec_schedule:2987) CRITICAL: Test assertion failure function test_pi_rin...
(gem_exec_schedule:2987) CRITICAL: Failed assertion: result[2]
(gem_exec_schedule:2987) CRITICAL: Last errno: 4, Interrupted system call
(gem_exec_schedule:2987) CRITICAL: High priority child unable to submit within...
Subtest pi-ringfull-bsd2 failed.
**** DEBUG ****
(gem_exec_schedule:2987) drmtest-DEBUG: Test requirement passed: !(fd<0)
(gem_exec_schedule:2987) DEBUG: Filled low-priority ring with 199 batches
(gem_exec_schedule:2987) DEBUG: LP parent executing
(gem_exec_schedule:2987) CRITICAL: Test assertion failure function test_pi_rin...
(gem_exec_schedule:2987) CRITICAL: Failed assertion: result[2]
(gem_exec_schedule:2987) CRITICAL: Last errno: 4, Interrupted system call
(gem_exec_schedule:2987) CRITICAL: High priority child unable to submit within...
(gem_exec_schedule:2987) igt-core-INFO: Stack trace:
(gem_exec_schedule:2987) igt-core-INFO:   #0 [__igt_fail_assert+0x101]
(gem_exec_schedule:2987) igt-core-INFO:   #1 [__real_main951+0x23f4]
(gem_exec_schedule:2987) igt-core-INFO:   #2 [main+0x27]
...
 airlied_6 / shard-kbl7
(gem_exec_schedule:2702) CRITICAL: Test assertion failure function test_pi_rin...
(gem_exec_schedule:2702) CRITICAL: Failed assertion: result[2]
(gem_exec_schedule:2702) CRITICAL: Last errno: 4, Interrupted system call
(gem_exec_schedule:2702) CRITICAL: High priority child unable to submit within...
Subtest pi-ringfull-bsd2 failed.
**** DEBUG ****
(gem_exec_schedule:2702) drmtest-DEBUG: Test requirement passed: !(fd<0)
(gem_exec_schedule:2702) DEBUG: Filled low-priority ring with 199 batches
(gem_exec_schedule:2702) DEBUG: LP parent executing
(gem_exec_schedule:2702) CRITICAL: Test assertion failure function test_pi_rin...
(gem_exec_schedule:2702) CRITICAL: Failed assertion: result[2]
(gem_exec_schedule:2702) CRITICAL: Last errno: 4, Interrupted system call
(gem_exec_schedule:2702) CRITICAL: High priority child unable to submit within...
(gem_exec_schedule:2702) igt-core-INFO: Stack trace:
(gem_exec_schedule:2702) igt-core-INFO:   #0 [__igt_fail_assert+0x101]
(gem_exec_schedule:2702) igt-core-INFO:   #1 [__real_main951+0x23f4]
(gem_exec_schedule:2702) igt-core-INFO:   #2 [main+0x27]
...
igt@gem_exec_schedule@pi-ringfull-default
 airlied_4 / shard-apl4
(gem_exec_schedule:4751) CRITICAL: Test assertion failure function test_pi_rin...
(gem_exec_schedule:4751) CRITICAL: Failed assertion: result[2]
(gem_exec_schedule:4751) CRITICAL: Last errno: 4, Interrupted system call
(gem_exec_schedule:4751) CRITICAL: High priority child unable to submit within...
Subtest pi-ringfull-default failed.
**** DEBUG ****
(gem_exec_schedule:4751) drmtest-DEBUG: Test requirement passed: !(fd<0)
(gem_exec_schedule:4751) DEBUG: Filled low-priority ring with 125 batches
(gem_exec_schedule:4751) DEBUG: LP parent executing
(gem_exec_schedule:4751) CRITICAL: Test assertion failure function test_pi_rin...
(gem_exec_schedule:4751) CRITICAL: Failed assertion: result[2]
(gem_exec_schedule:4751) CRITICAL: Last errno: 4, Interrupted system call
(gem_exec_schedule:4751) CRITICAL: High priority child unable to submit within...
(gem_exec_schedule:4751) igt-core-INFO: Stack trace:
(gem_exec_schedule:4751) igt-core-INFO:   #0 [__igt_fail_assert+0x101]
(gem_exec_schedule:4751) igt-core-INFO:   #1 [__real_main951+0x23f4]
(gem_exec_schedule:4751) igt-core-INFO:   #2 [main+0x27]
...
 airlied_5 / shard-apl3
(gem_exec_schedule:6230) CRITICAL: Test assertion failure function test_pi_rin...
(gem_exec_schedule:6230) CRITICAL: Failed assertion: result[2]
(gem_exec_schedule:6230) CRITICAL: Last errno: 4, Interrupted system call
(gem_exec_schedule:6230) CRITICAL: High priority child unable to submit within...
Subtest pi-ringfull-default failed.
**** DEBUG ****
(gem_exec_schedule:6230) drmtest-DEBUG: Test requirement passed: !(fd<0)
(gem_exec_schedule:6230) DEBUG: Filled low-priority ring with 125 batches
(gem_exec_schedule:6230) DEBUG: LP parent executing
(gem_exec_schedule:6230) CRITICAL: Test assertion failure function test_pi_rin...
(gem_exec_schedule:6230) CRITICAL: Failed assertion: result[2]
(gem_exec_schedule:6230) CRITICAL: Last errno: 4, Interrupted system call
(gem_exec_schedule:6230) CRITICAL: High priority child unable to submit within...
(gem_exec_schedule:6230) igt-core-INFO: Stack trace:
(gem_exec_schedule:6230) igt-core-INFO:   #0 [__igt_fail_assert+0x101]
(gem_exec_schedule:6230) igt-core-INFO:   #1 [__real_main951+0x23f4]
(gem_exec_schedule:6230) igt-core-INFO:   #2 [main+0x27]
...
 airlied_6 / shard-apl4
(gem_exec_schedule:8989) CRITICAL: Test assertion failure function test_pi_rin...
(gem_exec_schedule:8989) CRITICAL: Failed assertion: result[2]
(gem_exec_schedule:8989) CRITICAL: Last errno: 4, Interrupted system call
(gem_exec_schedule:8989) CRITICAL: High priority child unable to submit within...
Subtest pi-ringfull-default failed.
**** DEBUG ****
(gem_exec_schedule:8989) drmtest-DEBUG: Test requirement passed: !(fd<0)
(gem_exec_schedule:8989) DEBUG: Filled low-priority ring with 125 batches
(gem_exec_schedule:8989) DEBUG: LP parent executing
(gem_exec_schedule:8989) CRITICAL: Test assertion failure function test_pi_rin...
(gem_exec_schedule:8989) CRITICAL: Failed assertion: result[2]
(gem_exec_schedule:8989) CRITICAL: Last errno: 4, Interrupted system call
(gem_exec_schedule:8989) CRITICAL: High priority child unable to submit within...
(gem_exec_schedule:8989) igt-core-INFO: Stack trace:
(gem_exec_schedule:8989) igt-core-INFO:   #0 [__igt_fail_assert+0x101]
(gem_exec_schedule:8989) igt-core-INFO:   #1 [__real_main951+0x23f4]
(gem_exec_schedule:8989) igt-core-INFO:   #2 [main+0x27]
...
 airlied_4 / shard-kbl2
(gem_exec_schedule:2655) CRITICAL: Test assertion failure function test_pi_rin...
(gem_exec_schedule:2655) CRITICAL: Failed assertion: result[2]
(gem_exec_schedule:2655) CRITICAL: Last errno: 4, Interrupted system call
(gem_exec_schedule:2655) CRITICAL: High priority child unable to submit within...
Subtest pi-ringfull-default failed.
**** DEBUG ****
(gem_exec_schedule:2655) drmtest-DEBUG: Test requirement passed: !(fd<0)
(gem_exec_schedule:2655) DEBUG: Filled low-priority ring with 125 batches
(gem_exec_schedule:2655) DEBUG: LP parent executing
(gem_exec_schedule:2655) CRITICAL: Test assertion failure function test_pi_rin...
(gem_exec_schedule:2655) CRITICAL: Failed assertion: result[2]
(gem_exec_schedule:2655) CRITICAL: Last errno: 4, Interrupted system call
(gem_exec_schedule:2655) CRITICAL: High priority child unable to submit within...
(gem_exec_schedule:2655) igt-core-INFO: Stack trace:
(gem_exec_schedule:2655) igt-core-INFO:   #0 [__igt_fail_assert+0x101]
(gem_exec_schedule:2655) igt-core-INFO:   #1 [__real_main951+0x23f4]
(gem_exec_schedule:2655) igt-core-INFO:   #2 [main+0x27]
...
 airlied_5 / shard-kbl3
(gem_exec_schedule:1782) CRITICAL: Test assertion failure function test_pi_rin...
(gem_exec_schedule:1782) CRITICAL: Failed assertion: result[2]
(gem_exec_schedule:1782) CRITICAL: Last errno: 4, Interrupted system call
(gem_exec_schedule:1782) CRITICAL: High priority child unable to submit within...
Subtest pi-ringfull-default failed.
**** DEBUG ****
(gem_exec_schedule:1782) drmtest-DEBUG: Test requirement passed: !(fd<0)
(gem_exec_schedule:1782) DEBUG: Filled low-priority ring with 125 batches
(gem_exec_schedule:1782) DEBUG: LP parent executing
(gem_exec_schedule:1782) CRITICAL: Test assertion failure function test_pi_rin...
(gem_exec_schedule:1782) CRITICAL: Failed assertion: result[2]
(gem_exec_schedule:1782) CRITICAL: Last errno: 4, Interrupted system call
(gem_exec_schedule:1782) CRITICAL: High priority child unable to submit within...
(gem_exec_schedule:1782) igt-core-INFO: Stack trace:
(gem_exec_schedule:1782) igt-core-INFO:   #0 [__igt_fail_assert+0x101]
(gem_exec_schedule:1782) igt-core-INFO:   #1 [__real_main951+0x23f4]
(gem_exec_schedule:1782) igt-core-INFO:   #2 [main+0x27]
...
 airlied_6 / shard-kbl7
(gem_exec_schedule:3789) CRITICAL: Test assertion failure function test_pi_rin...
(gem_exec_schedule:3789) CRITICAL: Failed assertion: result[2]
(gem_exec_schedule:3789) CRITICAL: Last errno: 4, Interrupted system call
(gem_exec_schedule:3789) CRITICAL: High priority child unable to submit within...
Subtest pi-ringfull-default failed.
**** DEBUG ****
(gem_exec_schedule:3789) drmtest-DEBUG: Test requirement passed: !(fd<0)
(gem_exec_schedule:3789) DEBUG: Filled low-priority ring with 125 batches
(gem_exec_schedule:3789) DEBUG: LP parent executing
(gem_exec_schedule:3789) CRITICAL: Test assertion failure function test_pi_rin...
(gem_exec_schedule:3789) CRITICAL: Failed assertion: result[2]
(gem_exec_schedule:3789) CRITICAL: Last errno: 4, Interrupted system call
(gem_exec_schedule:3789) CRITICAL: High priority child unable to submit within...
(gem_exec_schedule:3789) igt-core-INFO: Stack trace:
(gem_exec_schedule:3789) igt-core-INFO:   #0 [__igt_fail_assert+0x101]
(gem_exec_schedule:3789) igt-core-INFO:   #1 [__real_main951+0x23f4]
(gem_exec_schedule:3789) igt-core-INFO:   #2 [main+0x27]
...
igt@gem_exec_schedule@pi-ringfull-render
 airlied_4 / shard-apl8
(gem_exec_schedule:5255) CRITICAL: Test assertion failure function test_pi_rin...
(gem_exec_schedule:5255) CRITICAL: Failed assertion: result[2]
(gem_exec_schedule:5255) CRITICAL: Last errno: 4, Interrupted system call
(gem_exec_schedule:5255) CRITICAL: High priority child unable to submit within...
Subtest pi-ringfull-render failed.
**** DEBUG ****
(gem_exec_schedule:5255) drmtest-DEBUG: Test requirement passed: !(fd<0)
(gem_exec_schedule:5255) DEBUG: Filled low-priority ring with 125 batches
(gem_exec_schedule:5255) DEBUG: LP parent executing
(gem_exec_schedule:5255) CRITICAL: Test assertion failure function test_pi_rin...
(gem_exec_schedule:5255) CRITICAL: Failed assertion: result[2]
(gem_exec_schedule:5255) CRITICAL: Last errno: 4, Interrupted system call
(gem_exec_schedule:5255) CRITICAL: High priority child unable to submit within...
(gem_exec_schedule:5255) igt-core-INFO: Stack trace:
(gem_exec_schedule:5255) igt-core-INFO:   #0 [__igt_fail_assert+0x101]
(gem_exec_schedule:5255) igt-core-INFO:   #1 [__real_main951+0x23f4]
(gem_exec_schedule:5255) igt-core-INFO:   #2 [main+0x27]
...
 airlied_5 / shard-apl2
(gem_exec_schedule:7227) CRITICAL: Test assertion failure function test_pi_rin...
(gem_exec_schedule:7227) CRITICAL: Failed assertion: result[2]
(gem_exec_schedule:7227) CRITICAL: Last errno: 4, Interrupted system call
(gem_exec_schedule:7227) CRITICAL: High priority child unable to submit within...
Subtest pi-ringfull-render failed.
**** DEBUG ****
(gem_exec_schedule:7227) drmtest-DEBUG: Test requirement passed: !(fd<0)
(gem_exec_schedule:7227) DEBUG: Filled low-priority ring with 125 batches
(gem_exec_schedule:7227) DEBUG: LP parent executing
(gem_exec_schedule:7227) CRITICAL: Test assertion failure function test_pi_rin...
(gem_exec_schedule:7227) CRITICAL: Failed assertion: result[2]
(gem_exec_schedule:7227) CRITICAL: Last errno: 4, Interrupted system call
(gem_exec_schedule:7227) CRITICAL: High priority child unable to submit within...
(gem_exec_schedule:7227) igt-core-INFO: Stack trace:
(gem_exec_schedule:7227) igt-core-INFO:   #0 [__igt_fail_assert+0x101]
(gem_exec_schedule:7227) igt-core-INFO:   #1 [__real_main951+0x23f4]
(gem_exec_schedule:7227) igt-core-INFO:   #2 [main+0x27]
...
 airlied_6 / shard-apl3
(gem_exec_schedule:3688) CRITICAL: Test assertion failure function test_pi_rin...
(gem_exec_schedule:3688) CRITICAL: Failed assertion: result[2]
(gem_exec_schedule:3688) CRITICAL: Last errno: 4, Interrupted system call
(gem_exec_schedule:3688) CRITICAL: High priority child unable to submit within...
Subtest pi-ringfull-render failed.
**** DEBUG ****
(gem_exec_schedule:3688) drmtest-DEBUG: Test requirement passed: !(fd<0)
(gem_exec_schedule:3688) DEBUG: Filled low-priority ring with 125 batches
(gem_exec_schedule:3688) DEBUG: LP parent executing
(gem_exec_schedule:3688) CRITICAL: Test assertion failure function test_pi_rin...
(gem_exec_schedule:3688) CRITICAL: Failed assertion: result[2]
(gem_exec_schedule:3688) CRITICAL: Last errno: 4, Interrupted system call
(gem_exec_schedule:3688) CRITICAL: High priority child unable to submit within...
(gem_exec_schedule:3688) igt-core-INFO: Stack trace:
(gem_exec_schedule:3688) igt-core-INFO:   #0 [__igt_fail_assert+0x101]
(gem_exec_schedule:3688) igt-core-INFO:   #1 [__real_main951+0x23f4]
(gem_exec_schedule:3688) igt-core-INFO:   #2 [main+0x27]
...
 airlied_4 / shard-kbl5
(gem_exec_schedule:1866) CRITICAL: Test assertion failure function test_pi_rin...
(gem_exec_schedule:1866) CRITICAL: Failed assertion: result[2]
(gem_exec_schedule:1866) CRITICAL: Last errno: 4, Interrupted system call
(gem_exec_schedule:1866) CRITICAL: High priority child unable to submit within...
Subtest pi-ringfull-render failed.
**** DEBUG ****
(gem_exec_schedule:1866) drmtest-DEBUG: Test requirement passed: !(fd<0)
(gem_exec_schedule:1866) DEBUG: Filled low-priority ring with 125 batches
(gem_exec_schedule:1866) DEBUG: LP parent executing
(gem_exec_schedule:1866) CRITICAL: Test assertion failure function test_pi_rin...
(gem_exec_schedule:1866) CRITICAL: Failed assertion: result[2]
(gem_exec_schedule:1866) CRITICAL: Last errno: 4, Interrupted system call
(gem_exec_schedule:1866) CRITICAL: High priority child unable to submit within...
(gem_exec_schedule:1866) igt-core-INFO: Stack trace:
(gem_exec_schedule:1866) igt-core-INFO:   #0 [__igt_fail_assert+0x101]
(gem_exec_schedule:1866) igt-core-INFO:   #1 [__real_main951+0x23f4]
(gem_exec_schedule:1866) igt-core-INFO:   #2 [main+0x27]
...
 airlied_5 / shard-kbl1
(gem_exec_schedule:1497) CRITICAL: Test assertion failure function test_pi_rin...
(gem_exec_schedule:1497) CRITICAL: Failed assertion: result[2]
(gem_exec_schedule:1497) CRITICAL: Last errno: 4, Interrupted system call
(gem_exec_schedule:1497) CRITICAL: High priority child unable to submit within...
Subtest pi-ringfull-render failed.
**** DEBUG ****
(gem_exec_schedule:1497) drmtest-DEBUG: Test requirement passed: !(fd<0)
(gem_exec_schedule:1497) DEBUG: Filled low-priority ring with 125 batches
(gem_exec_schedule:1497) DEBUG: LP parent executing
(gem_exec_schedule:1497) CRITICAL: Test assertion failure function test_pi_rin...
(gem_exec_schedule:1497) CRITICAL: Failed assertion: result[2]
(gem_exec_schedule:1497) CRITICAL: Last errno: 4, Interrupted system call
(gem_exec_schedule:1497) CRITICAL: High priority child unable to submit within...
(gem_exec_schedule:1497) igt-core-INFO: Stack trace:
(gem_exec_schedule:1497) igt-core-INFO:   #0 [__igt_fail_assert+0x101]
(gem_exec_schedule:1497) igt-core-INFO:   #1 [__real_main951+0x23f4]
(gem_exec_schedule:1497) igt-core-INFO:   #2 [main+0x27]
...
 airlied_6 / shard-kbl1
(gem_exec_schedule:2096) CRITICAL: Test assertion failure function test_pi_rin...
(gem_exec_schedule:2096) CRITICAL: Failed assertion: result[2]
(gem_exec_schedule:2096) CRITICAL: Last errno: 4, Interrupted system call
(gem_exec_schedule:2096) CRITICAL: High priority child unable to submit within...
Subtest pi-ringfull-render failed.
**** DEBUG ****
(gem_exec_schedule:2096) drmtest-DEBUG: Test requirement passed: !(fd<0)
(gem_exec_schedule:2096) DEBUG: Filled low-priority ring with 125 batches
(gem_exec_schedule:2096) DEBUG: LP parent executing
(gem_exec_schedule:2096) CRITICAL: Test assertion failure function test_pi_rin...
(gem_exec_schedule:2096) CRITICAL: Failed assertion: result[2]
(gem_exec_schedule:2096) CRITICAL: Last errno: 4, Interrupted system call
(gem_exec_schedule:2096) CRITICAL: High priority child unable to submit within...
(gem_exec_schedule:2096) igt-core-INFO: Stack trace:
(gem_exec_schedule:2096) igt-core-INFO:   #0 [__igt_fail_assert+0x101]
(gem_exec_schedule:2096) igt-core-INFO:   #1 [__real_main951+0x23f4]
(gem_exec_schedule:2096) igt-core-INFO:   #2 [main+0x27]
...
igt@gem_exec_schedule@pi-ringfull-vebox
 airlied_4 / shard-apl7
(gem_exec_schedule:5629) CRITICAL: Test assertion failure function test_pi_rin...
(gem_exec_schedule:5629) CRITICAL: Failed assertion: result[2]
(gem_exec_schedule:5629) CRITICAL: Last errno: 4, Interrupted system call
(gem_exec_schedule:5629) CRITICAL: High priority child unable to submit within...
Subtest pi-ringfull-vebox failed.
**** DEBUG ****
(gem_exec_schedule:5629) drmtest-DEBUG: Test requirement passed: !(fd<0)
(gem_exec_schedule:5629) DEBUG: Filled low-priority ring with 199 batches
(gem_exec_schedule:5629) DEBUG: LP parent executing
(gem_exec_schedule:5629) CRITICAL: Test assertion failure function test_pi_rin...
(gem_exec_schedule:5629) CRITICAL: Failed assertion: result[2]
(gem_exec_schedule:5629) CRITICAL: Last errno: 4, Interrupted system call
(gem_exec_schedule:5629) CRITICAL: High priority child unable to submit within...
(gem_exec_schedule:5629) igt-core-INFO: Stack trace:
(gem_exec_schedule:5629) igt-core-INFO:   #0 [__igt_fail_assert+0x101]
(gem_exec_schedule:5629) igt-core-INFO:   #1 [__real_main951+0x23f4]
(gem_exec_schedule:5629) igt-core-INFO:   #2 [main+0x27]
...
 airlied_5 / shard-apl6
(gem_exec_schedule:1527) CRITICAL: Test assertion failure function test_pi_rin...
(gem_exec_schedule:1527) CRITICAL: Failed assertion: result[2]
(gem_exec_schedule:1527) CRITICAL: Last errno: 4, Interrupted system call
(gem_exec_schedule:1527) CRITICAL: High priority child unable to submit within...
Subtest pi-ringfull-vebox failed.
**** DEBUG ****
(gem_exec_schedule:1527) drmtest-DEBUG: Test requirement passed: !(fd<0)
(gem_exec_schedule:1527) DEBUG: Filled low-priority ring with 199 batches
(gem_exec_schedule:1527) DEBUG: LP parent executing
(gem_exec_schedule:1527) CRITICAL: Test assertion failure function test_pi_rin...
(gem_exec_schedule:1527) CRITICAL: Failed assertion: result[2]
(gem_exec_schedule:1527) CRITICAL: Last errno: 4, Interrupted system call
(gem_exec_schedule:1527) CRITICAL: High priority child unable to submit within...
(gem_exec_schedule:1527) igt-core-INFO: Stack trace:
(gem_exec_schedule:1527) igt-core-INFO:   #0 [__igt_fail_assert+0x101]
(gem_exec_schedule:1527) igt-core-INFO:   #1 [__real_main951+0x23f4]
(gem_exec_schedule:1527) igt-core-INFO:   #2 [main+0x27]
...
 airlied_6 / shard-apl1
(gem_exec_schedule:5634) CRITICAL: Test assertion failure function test_pi_rin...
(gem_exec_schedule:5634) CRITICAL: Failed assertion: result[2]
(gem_exec_schedule:5634) CRITICAL: Last errno: 4, Interrupted system call
(gem_exec_schedule:5634) CRITICAL: High priority child unable to submit within...
Subtest pi-ringfull-vebox failed.
**** DEBUG ****
(gem_exec_schedule:5634) drmtest-DEBUG: Test requirement passed: !(fd<0)
(gem_exec_schedule:5634) DEBUG: Filled low-priority ring with 199 batches
(gem_exec_schedule:5634) DEBUG: LP parent executing
(gem_exec_schedule:5634) CRITICAL: Test assertion failure function test_pi_rin...
(gem_exec_schedule:5634) CRITICAL: Failed assertion: result[2]
(gem_exec_schedule:5634) CRITICAL: Last errno: 4, Interrupted system call
(gem_exec_schedule:5634) CRITICAL: High priority child unable to submit within...
(gem_exec_schedule:5634) igt-core-INFO: Stack trace:
(gem_exec_schedule:5634) igt-core-INFO:   #0 [__igt_fail_assert+0x101]
(gem_exec_schedule:5634) igt-core-INFO:   #1 [__real_main951+0x23f4]
(gem_exec_schedule:5634) igt-core-INFO:   #2 [main+0x27]
...
 airlied_4 / shard-kbl3
(gem_exec_schedule:1591) CRITICAL: Test assertion failure function test_pi_rin...
(gem_exec_schedule:1591) CRITICAL: Failed assertion: result[2]
(gem_exec_schedule:1591) CRITICAL: Last errno: 4, Interrupted system call
(gem_exec_schedule:1591) CRITICAL: High priority child unable to submit within...
Subtest pi-ringfull-vebox failed.
**** DEBUG ****
(gem_exec_schedule:1591) drmtest-DEBUG: Test requirement passed: !(fd<0)
(gem_exec_schedule:1591) DEBUG: Filled low-priority ring with 199 batches
(gem_exec_schedule:1591) DEBUG: LP parent executing
(gem_exec_schedule:1591) CRITICAL: Test assertion failure function test_pi_rin...
(gem_exec_schedule:1591) CRITICAL: Failed assertion: result[2]
(gem_exec_schedule:1591) CRITICAL: Last errno: 4, Interrupted system call
(gem_exec_schedule:1591) CRITICAL: High priority child unable to submit within...
(gem_exec_schedule:1591) igt-core-INFO: Stack trace:
(gem_exec_schedule:1591) igt-core-INFO:   #0 [__igt_fail_assert+0x101]
(gem_exec_schedule:1591) igt-core-INFO:   #1 [__real_main951+0x23f4]
(gem_exec_schedule:1591) igt-core-INFO:   #2 [main+0x27]
...
 airlied_5 / shard-kbl4
(gem_exec_schedule:1499) CRITICAL: Test assertion failure function test_pi_rin...
(gem_exec_schedule:1499) CRITICAL: Failed assertion: result[2]
(gem_exec_schedule:1499) CRITICAL: Last errno: 4, Interrupted system call
(gem_exec_schedule:1499) CRITICAL: High priority child unable to submit within...
Subtest pi-ringfull-vebox failed.
**** DEBUG ****
(gem_exec_schedule:1499) drmtest-DEBUG: Test requirement passed: !(fd<0)
(gem_exec_schedule:1499) DEBUG: Filled low-priority ring with 199 batches
(gem_exec_schedule:1499) DEBUG: LP parent executing
(gem_exec_schedule:1499) CRITICAL: Test assertion failure function test_pi_rin...
(gem_exec_schedule:1499) CRITICAL: Failed assertion: result[2]
(gem_exec_schedule:1499) CRITICAL: Last errno: 4, Interrupted system call
(gem_exec_schedule:1499) CRITICAL: High priority child unable to submit within...
(gem_exec_schedule:1499) igt-core-INFO: Stack trace:
(gem_exec_schedule:1499) igt-core-INFO:   #0 [__igt_fail_assert+0x101]
(gem_exec_schedule:1499) igt-core-INFO:   #1 [__real_main951+0x23f4]
(gem_exec_schedule:1499) igt-core-INFO:   #2 [main+0x27]
...
 airlied_6 / shard-kbl4
(gem_exec_schedule:1587) CRITICAL: Test assertion failure function test_pi_rin...
(gem_exec_schedule:1587) CRITICAL: Failed assertion: result[2]
(gem_exec_schedule:1587) CRITICAL: Last errno: 4, Interrupted system call
(gem_exec_schedule:1587) CRITICAL: High priority child unable to submit within...
Subtest pi-ringfull-vebox failed.
**** DEBUG ****
(gem_exec_schedule:1587) drmtest-DEBUG: Test requirement passed: !(fd<0)
(gem_exec_schedule:1587) DEBUG: Filled low-priority ring with 199 batches
(gem_exec_schedule:1587) DEBUG: LP parent executing
(gem_exec_schedule:1587) CRITICAL: Test assertion failure function test_pi_rin...
(gem_exec_schedule:1587) CRITICAL: Failed assertion: result[2]
(gem_exec_schedule:1587) CRITICAL: Last errno: 4, Interrupted system call
(gem_exec_schedule:1587) CRITICAL: High priority child unable to submit within...
(gem_exec_schedule:1587) igt-core-INFO: Stack trace:
(gem_exec_schedule:1587) igt-core-INFO:   #0 [__igt_fail_assert+0x101]
(gem_exec_schedule:1587) igt-core-INFO:   #1 [__real_main951+0x23f4]
(gem_exec_schedule:1587) igt-core-INFO:   #2 [main+0x27]
...
igt@gem_exec_schedule@preempt-blt
 
 
 
 
 
 
igt@gem_exec_schedule@preempt-bsd
 
 
 
 
 
 
igt@gem_exec_schedule@preempt-bsd1
 
 
 
igt@gem_exec_schedule@preempt-bsd2
 
 
 
igt@gem_exec_schedule@preempt-contexts-blt
 
 
 
 
 
 
igt@gem_exec_schedule@preempt-contexts-bsd
 
 
 
 
 
 
igt@gem_exec_schedule@preempt-contexts-bsd1
 
 
 
igt@gem_exec_schedule@preempt-contexts-bsd2
 
 
 
igt@gem_exec_schedule@preempt-contexts-render
 
 
 
 
 
 
igt@gem_exec_schedule@preempt-contexts-vebox
 
 
 
 
 
 
igt@gem_exec_schedule@preempt-other-blt
 
 
 
 
 
 
igt@gem_exec_schedule@preempt-other-bsd
 
 
 
 
 
 
igt@gem_exec_schedule@preempt-other-bsd1
 
 
 
igt@gem_exec_schedule@preempt-other-bsd2
 
 
 
igt@gem_exec_schedule@preempt-other-render
 
 
 
 
 
 
igt@gem_exec_schedule@preempt-other-vebox
 
 
 
 
 
 
igt@gem_exec_schedule@preempt-render
 
 
 
 
 
 
 
 
igt@gem_exec_schedule@preempt-self-blt
 
 
 
 
 
 
igt@gem_exec_schedule@preempt-self-bsd
 
 
 
 
 
 
igt@gem_exec_schedule@preempt-self-bsd1
 
 
 
igt@gem_exec_schedule@preempt-self-bsd2
 
 
 
igt@gem_exec_schedule@preempt-self-render
 
 
 
 
 
 
igt@gem_exec_schedule@preempt-self-vebox
 
 
 
 
 
 
igt@gem_exec_schedule@preempt-vebox
 
 
 
 
 
 
igt@gem_exec_schedule@promotion-blt
 
 
 
 
 
 
igt@gem_exec_schedule@promotion-bsd
 
 
 
 
 
 
igt@gem_exec_schedule@promotion-bsd1
 
 
 
igt@gem_exec_schedule@promotion-bsd2
 
 
 
igt@gem_exec_schedule@promotion-render
 
 
 
 
 
 
igt@gem_exec_schedule@promotion-vebox
 
 
 
 
 
 
igt@gem_exec_schedule@reorder-wide-blt
 
 
 
 
 
 
igt@gem_exec_schedule@reorder-wide-bsd
 
 
 
 
 
 
igt@gem_exec_schedule@reorder-wide-bsd1
 
 
 
igt@gem_exec_schedule@reorder-wide-bsd2
 
 
 
igt@gem_exec_schedule@reorder-wide-render
 
 
 
 
 
 
igt@gem_exec_schedule@reorder-wide-vebox
 
 
 
 
 
 
igt@gem_exec_schedule@smoketest-all
 
 
 
 
 
 
igt@gem_exec_schedule@smoketest-blt
 
 
 
 
 
 
igt@gem_exec_schedule@smoketest-bsd
 
 
 
 
 
 
igt@gem_exec_schedule@smoketest-bsd1
 
 
 
igt@gem_exec_schedule@smoketest-bsd2
 
 
 
 
igt@gem_exec_schedule@smoketest-render