Bug ID Bug Status Last Updated Bug Summary Filters Archived on Failure Rate
  • CLOSED/WORKSFORME
  • 6 hours ago
  • [CI][SHARDS] igt@kms_atomic_transition@* - fail - Failed assertion: alpha, Last errno: 22, Invalid argument, Cannot configure the test with all sprite planes enabled
  • ICL: igt@kms_atomic_transition@* - fail - Failed assertion: alpha, Last errno: 22, Invalid argument, Cannot configure the test with all sprite planes enabled : 0 / 177 runs (0.0%)
5 hours ago 0 / 177 runs (0.0%)
  • CLOSED/DUPLICATE
  • 10 months, 1 week ago
  • [CI] igt@kms_flip@blocking-wf_vblank - fail - Test assertion failure function calibrate_ts - Failed assertion: ev.sequence == last_seq + 1
  • all machines: wf_vblank - Failed assertion: ev.sequence == last_seq \+ 1 : 160 / 4704 runs (3.4%)
2 days, 2 hours ago 170 / 4755 runs (3.6%)
  • RESOLVED/CODE_FIX
  • CLOSED/FIXED
  • 2 days, 3 hours ago
  • 2 days, 3 hours ago
  • irq/124-mei_me - Call Trace: <4>[ 56.184872] mei_irq_read_handler+0x26d/0x650 [mei]
  • [CI] igt@* - incomplete - irq/124-mei_me - Call Trace: <4>[ 56.184872] mei_irq_read_handler+0x26d/0x650 [mei]
  • skl cfl kbl: all suspend tests - incomplete - irq/124-mei_me - Call Trace: <4>[ 56.184872] mei_irq_read_handler+0x26d/0x650 [mei] : 81 / 3031 runs (2.7%)
2 days, 3 hours ago 83 / 3043 runs (2.7%)
  • CLOSED/WORKSFORME
  • 2 days, 3 hours ago
  • [BAT]igt@kms_chamelium@* - fail / warn - Chamelium RPC call failed: RPC failed at server. <class 'chameleond.utils.i2c.I2cBusError'>:I2C access error
  • CHAMELIUM: kms_chamelium@* - fail / warn - Chamelium RPC call failed: RPC failed at server. <class 'chameleond.utils.i2c.I2cBusError'>:I2C access : 15 / 803 runs (1.9%)
2 days, 3 hours ago 15 / 804 runs (1.9%)
  • CLOSED/FIXED
  • 2 days, 3 hours ago
  • [CI][BAT] all suspend tests - dmesg-warn - called from state HALTED
  • All machines: igt@runner@aborted - fail - Previous test: *(s3|suspend)* : 111 / 111 runs (100.0%)
  • SNB: all suspend tests - dmesg-warn - called from state HALTED : 18 / 165 runs (10.9%)
2 days, 3 hours ago 111 / 168 runs (66.1%)
  • CLOSED/WORKSFORME
  • 2 days, 7 hours ago
  • [CI][DRMTIP] igt@gem_bad_reloc@negative-reloc-lut-vebox - dmesg-warn - GEM_BUG_ON(!intel_engine_is_idle(engine))
  • BSW: igt@gem_bad_reloc@negative-reloc-lut-vebox - dmesg-warn - GEM_BUG_ON(!intel_engine_is_idle(engine)) : 0 / 11 runs (0.0%)
2 days, 3 hours ago 0 / 11 runs (0.0%)
  • CLOSED/FIXED
  • 2 days, 5 hours ago
  • [CI][BAT] igt@gem_exec_suspend@basic-S3 RPM wakelock ref not held during HW access RIP: 0010:gen5_read32
  • ILK: suspend tests + random ones - dmesg-warn - RPM wakelock ref not held during HW access : 1 / 23 runs (4.3%)
  • ILK: igt@runner@aborted - fail - Previous test: debugfs_test (read_all_entries_display_off) : 0 / 595 runs (0.0%)
  • ILK: igt@runner@aborted - fail - Previous test: gem_exec_suspend (basic-s3) : 573 / 578 runs (99.1%)
2 days, 5 hours ago 573 / 664 runs (86.3%)
  • CLOSED/WORKSFORME
  • 2 days, 7 hours ago
  • [CI][BAT] igt@drv_selftest@live_requests - incomplete - GEM_BUG_ON(!i915_request_completed(rq))
  • CFL: igt@drv_selftest@live_requests - incomplete : 0 / 1473 runs (0.0%)
2 days, 5 hours ago 0 / 1473 runs (0.0%)
  • CLOSED/FIXED
  • 2 days, 23 hours ago
  • [CI][SHARDS] igt@gem_exec_whisper@normal - fail - Failed assertion: map[i] == i
  • SKL: igt@gem_exec_whisper@normal - fail - Failed assertion: map[i] == i : 4 / 9 runs (44.4%)
2 days, 23 hours ago 4 / 9 runs (44.4%)
  • CLOSED/FIXED
  • 3 days, 22 hours ago
  • [CI][DRMTIP] igt@gem_exec_whisper@normal - timeout
  • SKL: igt@gem_exec_whisper@normal - timeout : 25 / 409 runs (6.1%)
3 days, 22 hours ago 25 / 409 runs (6.1%)
  • RESOLVED/DUPLICATE
  • 1 week ago
  • [CI][SHARDS] igt@i915_selftest@live_workarounds - dmesg-fail - *ERROR* rcs0_REF workaround lost on before reset!
  • ICL: igt@i915_selftest@live_workarounds - dmesg-fail - *ERROR* rcs0_REF workaround lost on before reset! : 0 / 2 runs (0.0%)
1 week ago 0 / 2 runs (0.0%)
  • CLOSED/FIXED
  • 1 week, 3 days ago
  • [CI][BAT] igt@i915_selftest@mock_vma - dmesg-warn - mock: overflow 0x00000001bb800000+2097152 of DMA mask ffffffff bus mask 0
  • All machines: igt@i915_selftest@mock_vma - dmesg-warn - mock: overflow 0x00000001bb800000+2097152 of DMA mask ffffffff bus mask 0 : 3 / 5 runs (60.0%)
1 week, 3 days ago 3 / 5 runs (60.0%)
  • CLOSED/FIXED
  • 1 week, 6 days ago
  • [CI] igt@*(suspend|s3)* - dmesg-warn - Display power well on
  • HSW: igt@*(suspend|s3)* - dmesg-warn - Display power well o : 0 / 3539 runs (0.0%)
1 week, 6 days ago 0 / 3539 runs (0.0%)
  • CLOSED/FIXED
  • 3 weeks ago
  • [CI][BAT] igt@* - incomplete - Softdog | 18 minutes timeout - [drm:drm_atomic_helper_wait_for_flip_done] *ERROR* [CRTC:37:pipe [A|B]] flip_done timed out
  • SNB SNBm: all tests - incomplete - flip_done timed out : 29 / 1273 runs (2.3%)
  • SNB SNBm: all tests - dmesg-warn / dmesg-fail - flip_done timed out : 35 / 1296 runs (2.7%)
1 week, 6 days ago 35 / 1296 runs (2.7%)
  • CLOSED/FIXED
  • 1 week, 6 days ago
  • [CI] igt@kms_ccs@pipe-[a|b]-crc-sprite-planes-basic - fail - Test assertion failure function try_config, Failed assertion: ret == 0
  • SKL BXT KBL CFL APL WHL: igt@kms_ccs@pipe-[abc]-crc-sprite-planes-basic - Test assertion failure function try_config, file ../tests/kms_ccs : 493 / 579 runs (85.1%)
1 week, 6 days ago 493 / 579 runs (85.1%)
  • CLOSED/FIXED
  • 1 week, 6 days ago
  • [CI] igt@kms_* - incomplete - softdog - backtrace in dmesg indicates: NULL deref in intel_psr_flush
  • SKL KBL CFL: igt@kms_* - incomplete : 73 / 2554 runs (2.9%)
1 week, 6 days ago 73 / 2554 runs (2.9%)
  • CLOSED/FIXED
  • 3 weeks ago
  • [CI][DRMTIP] igt@drv_selftest@live_hangcheck - fail - igt/evict_vma kthread did not wait
  • BDW: igt@drv_selftest@live_hangcheck - dmesg-fail - Failed to switch back to kernel context; declaring wedged : 0 / 1051 runs (0.0%)
1 week, 6 days ago 0 / 1051 runs (0.0%)
  • CLOSED/FIXED
  • 3 weeks ago
  • [CI][DRMTIP] igt@* - incomplete - [transcoder EDP] PSR aux error
  • fi-skl-6700k2: random tests - incomplete : 0 / 26 runs (0.0%)
  • SKL ICL: all tests - incomplete - [transcoder EDP] PSR aux error : 11 / 1398 runs (0.8%)
1 week, 6 days ago 11 / 1398 runs (0.8%)
  • RESOLVED/FIXED
  • 1 month, 3 weeks ago
  • [CI][SHARDS] igt@gem_cpu_reloc@full - incomplete
  • SKL KBL: igt@gem_cpu_reloc@full| igt@gem_userptr_blits@readonly-unsync - incomplete : 2 / 182 runs (1.1%)
1 week, 6 days ago 2 / 182 runs (1.1%)
  • CLOSED/FIXED
  • 2 months ago
  • [CI][BAT] igt_runner: abort on TAINT_PAGE, TAINT_DIE, and TAINT_OOPS
  • BXT: igt@pm_rpm@module-reload - timeout - pm_rpm: executing$ : 0 / 836 runs (0.0%)
  • BXT: igt@amdgpu/amd_prime@(amd-to-i915|i915-to-amd) - timeout - last line in dmesg "[IGT] amd_prime: executing" : 1 / 1075 runs (0.1%)
1 week, 6 days ago 1 / 1075 runs (0.1%)
  • CLOSED/FIXED
  • 3 weeks ago
  • [CI][DRMTIP] igt@kms_plane_alpha_blend@pipe-a-constant-alpha-mid - incomplete - *ERROR* PSR idle timed out 0x[a-f0-9]+, atomic update may fail
  • ICL: igt@kms_plane_alpha_blend@pipe-a-constant-alpha-mid - incomplete - *ERROR* PSR idle timed out 0x[a-f0-9]+, atomic update may fail : 0 / 263 runs (0.0%)
1 week, 6 days ago 0 / 263 runs (0.0%)
  • CLOSED/FIXED
  • 2 months ago
  • [CI][BAT] igt@* - dmesg-warn / dmesg-fail - *ERROR* HDCP key Load is not possible
  • SKL KBL: all tests - dmesg-warn / dmesg-fail - *ERROR* HDCP key Load is not possible : 108 / 1266 runs (8.5%)
1 week, 6 days ago 108 / 1266 runs (8.5%)
  • CLOSED/FIXED
  • 1 week, 6 days ago
  • [CI][DRMTIP] igt@gem_tiled_fence_blits@normal - fail - Failed assertion: linear[i] == start_val
  • BLB ELK GDG ILK: igt@gem_tiled_fence_blits@normal - fail - Failed assertion: linear[i] == start_val : 22 / 42 runs (52.4%)
1 week, 6 days ago 22 / 42 runs (52.4%)
  • CLOSED/FIXED
  • 3 weeks ago
  • [CI][SHARDS] igt@kms_properties@connector-properties-atomic - fail - Test assertion failure function max_bpc_prop_test, Failed assertion: ret == 0
  • All machines: igt@kms_properties@connector-properties-atomic - fail - Test assertion failure function max_bpc_prop_test, Failed assertion: ret == 0 : 260 / 349 runs (74.5%)
1 week, 6 days ago 260 / 349 runs (74.5%)
  • CLOSED/FIXED
  • 1 week, 6 days ago
  • [CI] Make IGT_runner exit with an error code != 0 when aborting
  • shard-hsw shard-iclb: igt@runner@aborted - fail - Previous test: nothing : 2 / 70 runs (2.9%)
1 week, 6 days ago 2 / 70 runs (2.9%)
  • CLOSED/FIXED
  • 3 weeks ago
  • [CI][BAT] igt@i915_selftest@live_sanitycheck - incomplete - BUG: unable to handle kernel (paging request|NULL pointer dereference) at
  • GDG: igt@i915_selftest@live_sanitycheck - incomplete - BUG: unable to handle kernel NULL pointer dereference at : 0 / 203 runs (0.0%)
  • GDG: igt@i915_selftest@live_sanitycheck - incomplete - BUG: unable to handle kernel paging request at : 0 / 203 runs (0.0%)
1 week, 6 days ago 0 / 203 runs (0.0%)
  • CLOSED/FIXED
  • 3 weeks ago
  • [CI][BAT] igt@* - dmesg-warn / dmesg-fail - Missing case (intel_dig_port->tc_type == 0)
  • ICL: igt@runner@aborted - fail - Previous test: (drm_read|kms_flip|kms_plane|kms_vblank|kms_atomic_transition|kms_universal_plane|kms_ccs|kms_busy) \(.*\) : 8 / 29 runs (27.6%)
  • ICL: all tests - dmesg-warn / dmesg-fail - Missing case (intel_dig_port->tc_type == 0) : 104 / 291 runs (35.7%)
1 week, 6 days ago 112 / 291 runs (38.5%)
  • CLOSED/WORKSFORME
  • 1 week, 6 days ago
  • [CI][SHARDS] igt@gem_busy@extended-semaphore-blt - fail - Failed assertion: read == active
  • BYT HSW: igt@gem_busy@extended-semaphore-blt - fail - Failed assertion: read == active : 0 / 7 runs (0.0%)
1 week, 6 days ago 0 / 7 runs (0.0%)
  • CLOSED/FIXED
  • 3 weeks ago
  • [CI][SHARDS] igt@debugfs_test@read_all_entries_display_on - incomplete - Reading file "i915_dsc_fec_support"
  • ICL: igt@debugfs_test@read_all_entries_display_on - incomplete - Reading file "i915_dsc_fec_support" : 0 / 47 runs (0.0%)
1 week, 6 days ago 0 / 47 runs (0.0%)
  • CLOSED/FIXED
  • 3 weeks ago
  • [CI][BAT] icl incomplete - GEM_BUG_ON(!i915_request_completed(rq)) / GEM_BUG_ON(buf[2 * head + 1] != port->context_id) HSDES#:1806554093
  • ICL: igt@runner@aborted - fail - Previous test: i915_selftest (live_(contexts|hangcheck)) : 9 / 562 runs (1.6%)
  • ICL: igt@gem_exec_schedule@wide-render - fail - igt@gem_exec_schedule@wide-render : 0 / 206 runs (0.0%)
  • ICL: igt@gem_exec_nop@basic-parallel - incomplete : 0 / 989 runs (0.0%)
  • ICL: igt@drv_selftest@live_(context|hangcheck|execlist) / igt@gem_ctx_switch@basic-default - incomplete : 120 / 1041 runs (11.5%)
  • ICL: igt@drv_selftest@live_requests - incomplete - GEM_BUG_ON(status & (1 << 1)) : 1 / 898 runs (0.1%)
1 week, 6 days ago 121 / 1048 runs (11.5%)
  • CLOSED/FIXED
  • 1 month, 1 week ago
  • [CI][DRMTIP] igt@kms_busy@extended-pageflip-hang-newfb-render-f - incomplete - GEM_BUG_ON(!intel_engine_is_idle(engine))
  • BDW: igt@gem_exec_whisper@normal - dmesg-fail - GEM_BUG_ON(!intel_engine_is_idle(engine)) : 0 / 38 runs (0.0%)
  • ICL: all tests - incomplete - GEM_BUG_ON(!intel_engine_is_idle(engine)) : 0 / 1009 runs (0.0%)
  • ICL: all tests - dmesg-warn - GEM_BUG_ON(!intel_engine_is_idle(engine)) : 15 / 1018 runs (1.5%)
2 weeks ago 15 / 1018 runs (1.5%)
  • CLOSED/FIXED
  • 2 weeks ago
  • [CI][BAT] igt@amdgpu/amd_prime@amd-to-i915 - fail - Failed assertion: r == 0, Last errno: 28, No space left on device
  • SKL: igt@kms_atomic_transition@plane-all-modeset-transition - fail - Last errno: 28, No space left on device : 3 / 75 runs (4.0%)
  • VEGA M: igt@amdgpu/amd_prime@amd-to-i915 - fail - Failed assertion: r == 0, Last errno: 28, No space left on device : 10 / 58 runs (17.2%)
2 weeks ago 13 / 133 runs (9.8%)
  • CLOSED/DUPLICATE
  • 1 week, 6 days ago
  • [CI][BAT] igt@i915_selftest@live_contexts - dmesg-fail - igt_vm_isolation failed with error -5
  • ICL: igt@i915_selftest@live_contexts - dmesg-fail - igt_vm_isolation failed with error -5 : 0 / 1 runs (0.0%)
2 weeks, 2 days ago 0 / 1 runs (0.0%)
  • CLOSED/FIXED
  • 3 weeks ago
  • [CI][BAT] igt@i915_selftest@live_sanitycheck - incomplete - general protection fault: 0000 [#1] PREEMPT SMP PTI
  • GDG: igt@i915_selftest@live_sanitycheck - incomplete - general protection fault: 0000 : 2 / 196 runs (1.0%)
2 weeks, 2 days ago 2 / 196 runs (1.0%)
  • CLOSED/FIXED
  • 4 weeks ago
  • [CI][BAT] igt@. - dmesg-warn - WARN_ON(intel_wait_for_register(dev_priv, regs->driver, (0x1 << ((pw_idx) * 2)), (0x1 << ((pw_idx) * 2)), 1))
  • ICL: igt@runner@aborted - fail - Previous test: kms_chamelium (common|hdmi-hpd-after-suspend) : 427 / 493 runs (86.6%)
  • ICL: igt@runner@aborted - fail - Previous test: nothing : 309 / 309 runs (100.0%)
  • ICL: all tests - dmesg-warn / dmesg-fail - WARN_ON(intel_wait_for_register(dev_priv, regs->driver, (0x1 << ((pw_idx) * 2)), (0x1 << ((pw_idx) * 2)), 1)) : 540 / 1024 runs (52.7%)
  • ICL: igt@pm_backlight@fade_with_suspend - dmesg-fail - WARN_ON(intel_wait_for_register(dev_priv, regs->driver, (0x1 << ((pw_idx) * 2)),... : 1 / 200 runs (0.5%)
4 weeks ago 556 / 1027 runs (54.1%)
  • CLOSED/NOTABUG
  • 4 weeks, 1 day ago
  • [CI][BAT] igt@debugfs_test@read_all_entries* - incomplete
  • fi-hsw-peppy: igt@debugfs_test@read_all_entries* - incomplete : 0 / 3 runs (0.0%)
4 weeks, 1 day ago 0 / 3 runs (0.0%)
  • CLOSED/FIXED
  • 1 month ago
  • [CI][DRMTIP] igt@kms_rotation_crc@primary-(x|y|yf)-tiled-reflect-x-(0|90|180|270) - dmesg-warn - Atomic update failure on pipe [ABC]
  • ICL: igt@kms_rotation_crc@primary-(x|y|yf)-tiled-reflect-x-(0|90|180|270) - dmesg-warn - Atomic update failure on pipe [ABC] : 0 / 202 runs (0.0%)
1 month ago 0 / 202 runs (0.0%)
  • CLOSED/DUPLICATE
  • 1 month, 1 week ago
  • [CI][BAT] igt@kms_chamelium may need to wait a little bit for the network to come back up before connecting to chamelium
  • fi-skl-6700k2: random test - incomplete : 0 / 678 runs (0.0%)
  • CHAMELIUM: igt@kms_chamelium@common-hpd-after-suspend - warn - Last errno: 113, No route to host : 38 / 746 runs (5.1%)
1 month, 1 week ago 38 / 746 runs (5.1%)
  • CLOSED/DUPLICATE
  • 3 weeks ago
  • [CI][DRMTIP] igt@kms_psr@cursor_plane_move - incomplete
  • KBL: igt@kms_psr@cursor_plane_move - incomplete - empty logs : 0 / 43 runs (0.0%)
1 month, 1 week ago 0 / 43 runs (0.0%)
  • CLOSED/FIXED
  • 1 month, 1 week ago
  • [CI][DRMTIP] igt@kms_vblank@pipe-b-ts-continuation-idle - dmesg-warn - WARN_ON((val & icl_dpclka_cfgcr0_clk_off(dev_priv, port)) == 0)
  • ICL: igt@kms_vblank@pipe-b-ts-continuation-idle - dmesg-warn - WARN_ON((val & icl_dpclka_cfgcr0_clk_off(dev_priv, port)) == 0) : 0 / 145 runs (0.0%)
1 month, 1 week ago 0 / 145 runs (0.0%)
  • CLOSED/NOTOURBUG
  • 1 month, 2 weeks ago
  • [CI][SHARDS]ICL: igt@kms_flip@blocking-absolute-wf_vblank-interruptible - incomplete - WARNING: CPU: \d+ PID: \d+ at drivers/gpu/drm/drm_vblank.c:\d+ drm_wait_one_vblank
  • ICL: igt@kms_flip@blocking-absolute-wf_vblank-interruptible - incomplete - WARNING: CPU: \d+ PID: \d+ at drivers/gpu/drm/drm_vblank.c:\d+ drm_wait_one_vblank : 0 / 39 runs (0.0%)
1 month, 2 weeks ago 0 / 39 runs (0.0%)
  • CLOSED/FIXED
  • 1 month, 2 weeks ago
  • [CI][BAT] igt@* - dmesg-warn - crtc active state doesn't match with hw state (expected 1, found 0)
  • ICL: random tests - dmesg-warn - tests that did not get the full dmesg : 1 / 7 runs (14.3%)
  • ICL: all tests - dmesg-warn / dmesg-fail - crtc active state doesn't match with hw state (expected 1, found 0) : 22 / 36 runs (61.1%)
  • ICL: igt@runner@aborted - fail - Previous test: (?!nothing) : 31 / 34 runs (91.2%)
1 month, 2 weeks ago 31 / 36 runs (86.1%)
  • CLOSED/DUPLICATE
  • 3 weeks ago
  • [CI][DRMTIP] igt@kms_content_protection@(legacy|atomic) - dmesg-fail - Content Protection not enabled, *ERROR* HDCP key Load is not possible
  • CFL: igt@kms_content_protection@(legacy|atomic) - dmesg-fail - Content Protection not enabled, *ERROR* HDCP key Load is not possible : 4 / 13 runs (30.8%)
1 month, 2 weeks ago 4 / 13 runs (30.8%)
  • CLOSED/FIXED
  • 1 month, 2 weeks ago
  • [CI][BAT] fi-kbl-7567u's chamelium is improperly setup
  • fi-kbl-7567: random chamelium tests - fail - Chamelium RPC call failed: libcurl failed to execute the HTTP POST transaction, explaining: No route to host : 2 / 311 runs (0.6%)
  • fi-kbl-7500u kbl-7567u: igt@kms_chamelium@hdmi-hpd-storm - fail - Failed assertion: igt_hpd_storm_detected(data->drm_fd) : 5 / 5 runs (100.0%)
  • fi-kbl-7567u: igt@kms_chamelium@hdmi-hpd(-fast)? - fail - Failed assertion: reprobe_connector(data, port) == DRM_MODE_CONNECTED : 338 / 604 runs (56.0%)
  • fi-kbl-7567u: igt@kms_chamelium@(hdmi|common)-hpd-after-suspend - fail - Failed assertion: reprobe_connector(data, port) == connected ... : 203 / 604 runs (33.6%)
  • kbl-7567u: igt@kms_chamelium@hdmi-* - fail - Failed assertion: finished : 340 / 604 runs (56.3%)
1 month, 2 weeks ago 342 / 604 runs (56.6%)
  • CLOSED/FIXED
  • 1 month, 2 weeks ago
  • [CI][BAT] fi-kbl-7500u's chamelium is improperly setup
  • fi-kbl-7500u: igt@kms_chamelium@hdmi-hpd-fast - Failed assertion: reprobe_connector(data, port) == DRM_MODE_CONNECTED : 16 / 282 runs (5.7%)
  • fi-kbl-7567u fi-kbl-7500u: igt@kms_chamelium@hdmi-hpd-fast - fail - Failed assertion: igt_hotplug_detected(mon, HOTPLUG_TIMEOUT) : 292 / 347 runs (84.1%)
  • fi-kbl-7500u fi-kbl-7500u: igt@kms_chamelium@hdmi-(crc-fast|edid-read|crc-argb8888) - fail - Failed assertion: finished : 303 / 344 runs (88.1%)
  • fi-kbl-7500u: igt@kms_chamelium@common-hpd-after-suspend - fail - Failed assertion: reprobe_connector(data, port) == connected ? DRM_MODE_DISCONNECTED : DRM_... : 326 / 494 runs (66.0%)
1 month, 2 weeks ago 331 / 370 runs (89.5%)
  • CLOSED/DUPLICATE
  • 1 month, 2 weeks ago
  • [CI][SHARDS] igt@gem_pwrite_pread@snooped-copy-performance - incomplete
  • SKL: igt@gem_pwrite_pread@snooped-copy-performance - incomplete : 0 / 306 runs (0.0%)
1 month, 2 weeks ago 0 / 306 runs (0.0%)
  • CLOSED/FIXED
  • 1 month, 2 weeks ago
  • [CI][DRMTIP] igt@kms_atomic_transition@plane-all-transition-nonblocking-fencing - incomplete - Atomic update on pipe
  • ICL: igt@kms_atomic_transition@plane-all-transition-* - incomplete : 2 / 107 runs (1.9%)
1 month, 2 weeks ago 2 / 107 runs (1.9%)
  • NEW
  • 2 weeks, 2 days ago
  • [CI][SHARDS] [ICL] igt@pm_rpm@* - incomplete
  • ICL: igt@pm_rpm@* - incomplete : 0 / 14 runs (0.0%)
1 month, 3 weeks ago 0 / 14 runs (0.0%)
  • CLOSED/FIXED
  • 1 month, 3 weeks ago
  • [CI][BAT] igt@kms_chamelium@(dp-hpd-fast|common-hpd-after-suspend) - fail - Failed assertion: igt_hotplug_detected(mon, HOTPLUG_TIMEOUT)
  • CHAMELIUM: igt@kms_chamelium@(dp-hpd-fast|common-hpd-after-suspend) - fail - Failed assertion: igt_hotplug_detected\(mon, HOTPLUG_TIMEOUT\) : 1 / 324 runs (0.3%)
1 month, 3 weeks ago 1 / 324 runs (0.3%)
  • CLOSED/FIXED
  • 1 month, 3 weeks ago
  • [CI][BAT] igt@kms_chamelium@(dp-edid-read|dp-crc-fast) - fail - Failed assertion: finished
  • CHAMELIUM: igt@kms_chamelium@(dp-edid-read|dp-crc-fast) - fail - Failed assertion: finished : 1 / 324 runs (0.3%)
1 month, 3 weeks ago 1 / 324 runs (0.3%)
  • CLOSED/DUPLICATE
  • 1 month, 4 weeks ago
  • [CI][BAT] igt@i915_selftest@live_hangcheck - dmesg-fail - igt_reset_queue(vcs0): Failed to start request
  • BSW: igt@i915_selftest@live_hangcheck - dmesg-fail - igt_reset_queue(vcs0): Failed to start request : 0 / 0 runs (0.0%)
1 month, 4 weeks ago 0 / 0 runs (0.0%)
  • CLOSED/DUPLICATE
  • 3 weeks ago
  • [CI][BAT] igt@i915_selftest@live_context - dmesg-fail - igt_ctx_readonly(): engine 'vcs0' was reset 1 times!
  • BSW: igt@i915_selftest@live_context - dmesg-fail - igt_ctx_readonly(): engine 'vcs0' was reset 1 times! : 0 / 0 runs (0.0%)
1 month, 4 weeks ago 0 / 0 runs (0.0%)
  • CLOSED/FIXED
  • 2 months ago
  • [CI][DRMTIP] igt@kms_ccs_pipe-[abc]-*-basic / igt@*(alpha|coverage)-7efc - dmesg-fail - WARN_ON(intel_wait_for_register(dev_priv, regs->driver, (0x1 << ((pw_idx) * 2)), (0x1 << ((pw_idx) * 2)), 1))
  • ICL: igt@kms_ccs_pipe-[abc]-*-basic / igt@*(alpha|coverage)-7efc - dmesg-fail - WARN_ON(intel_wait_for_register(dev_priv, regs->driver, (0x1 << ((pw_idx) *... : 5 / 9 runs (55.6%)
2 months ago 5 / 9 runs (55.6%)
  • CLOSED/DUPLICATE
  • 3 weeks ago
  • [CI][BAT] igt@* - incomplete - GEM_BUG_ON(intel_engine_signaled(engine, seqno))
  • GUC: all tests - incomplete - GEM_BUG_ON(intel_engine_signaled(engine, seqno)) : 0 / 1 runs (0.0%)
2 months ago 0 / 1 runs (0.0%)
  • CLOSED/DUPLICATE
  • 2 months, 3 weeks ago
  • [CI][BAT] igt@drv_selftest@live_coherency - dmesg-warn - Unclaimed read from register 0x44018
  • BYT: igt@drv_selftest@live_coherency - dmesg-warn - Unclaimed read from register 0x44018 : 0 / 435 runs (0.0%)
2 months ago 0 / 435 runs (0.0%)
  • CLOSED/DUPLICATE
  • 2 months, 3 weeks ago
  • [CI][DRMTIP] igt@gem_exec_parallel@blt-fds - fail - Failed assertion: gem_bo_busy(fd, obj[SCRATCH].handle)
  • PNV: igt@gem_exec_parallel@blt-fds - fail - Failed assertion: gem_bo_busy(fd, obj[SCRATCH].handle) : 0 / 14 runs (0.0%)
2 months ago 0 / 14 runs (0.0%)
  • CLOSED/DUPLICATE
  • 3 months ago
  • [CI][DRMTIP] igt@gem_exec_parallel@blt-fds - fail - Failed assertion: map[i] == i
  • BYT: igt@gem_exec_parallel@blt-fds - fail - Failed assertion: map[i] == i : 0 / 27 runs (0.0%)
2 months ago 0 / 27 runs (0.0%)
  • CLOSED/DUPLICATE
  • 3 months ago
  • [CI][DRMTIP]igt@gem_wait@write-wait-blt - fail - Failed assertion: __gem_wait(fd, &wait) == 0, Last errno: 62, Timer expired
  • BYT: igt@gem_wait@write-wait-blt - fail - Failed assertion: __gem_wait(fd, &wait) == 0, Last errno: 62, Timer expired : 0 / 29 runs (0.0%)
2 months ago 0 / 29 runs (0.0%)
  • CLOSED/NOTOURBUG
  • 2 months ago
  • [CI][BAT] igt@drv_selftest@live_sanitycheck - incomplete - fake context support initialized, general protection fault
  • GDG: igt@drv_selftest@live_sanitycheck - incomplete - fake context support initialized, general protection fault : 0 / 711 runs (0.0%)
2 months ago 0 / 711 runs (0.0%)
  • CLOSED/FIXED
  • 2 months ago
  • [CI] igt@drv_suspend@debugfs-reader - dmesg-warn - *ERROR* dpcd read (1 bytes at 1536) failed (-5)
  • cfl cnl kbl skl: igt@drv_suspend@debugfs-reader - dmesg-warn - *ERROR* dpcd read (1 bytes at 1536) failed (-5) : 3 / 17 runs (17.6%)
2 months ago 13 / 89 runs (14.6%)
  • CLOSED/FIXED
  • 2 months ago
  • [CI] igt@kms_rotation_crc@exhaust-fences - dmesg-warn - *ERROR* Overflow of CRC buffer, userspace reads too slow
  • SKL GUC ICL: igt@kms_rotation_crc@exhaust-fences - *ERROR* Overflow of CRC buffer, userspace reads too slow. : 122 / 227 runs (53.7%)
2 months ago 122 / 227 runs (53.7%)
  • CLOSED/FIXED
  • 2 months ago
  • [CI][DRMTIP] igt@kms_frontbuffer_tracking@* - fail - PSR still disabled
  • PSR PSR2: igt@* - fail - PSR still disabled : 29 / 823 runs (3.5%)
2 months ago 29 / 823 runs (3.5%)
  • CLOSED/FIXED
  • 2 months ago
  • [CI] igt@* - incomplete - intel_engine_unpin_breadcrumbs_irq:226 GEM_BUG_ON(!b->irq_enabled)
  • GUC: all tests - incomplete : 114 / 1851 runs (6.2%)
2 months ago 114 / 1851 runs (6.2%)
  • CLOSED/FIXED
  • 2 months ago
  • [CI][BAT] igt@pm_rpm@module-reload - fail - Test assertion failure function __igt_pm_enable_audio_runtime_pm[...]Failed assertion: fd >= 0
  • KBL: igt@pm_rpm@module-reload - fail - Test assertion failure function __igt_pm_enable_audio_runtime_pm[...]Failed assertion: fd >= 0 : 0 / 456 runs (0.0%)
2 months ago 0 / 456 runs (0.0%)
  • CLOSED/FIXED
  • 2 months ago
  • [CI][BAT] igt@drv_selftest@live_hangcheck - dmesg-fail - failed to idle after reset
  • CFL: igt@drv_selftest@live_hangcheck - dmesg-fail - failed to idle after reset : 0 / 382 runs (0.0%)
2 months ago 0 / 382 runs (0.0%)
  • CLOSED/FIXED
  • 2 months ago
  • [CI][SHARDS] igt@gem_eio@in-flight-suspend - dmesg-warn - GEM_BUG_ON(!execlists_is_active(execlists, 0))
  • GLK: igt@gem_eio@in-flight-suspend - dmesg-warn - GEM_BUG_ON(!execlists_is_active(execlists, 0)) : 0 / 382 runs (0.0%)
2 months ago 0 / 382 runs (0.0%)
  • CLOSED/FIXED
  • 2 months ago
  • [CI][BAT] igt@gem_exec_reloc@basic-* / igt@kms_cursor_crc@cursor-*-offscreen - dmesg-warn - pipe_off wait timed out
  • ICL: igt@gem_exec_reloc@basic-* / igt@kms_cursor_crc@cursor-*-offscreen - dmesg-warn - pipe_off wait timed out : 0 / 117 runs (0.0%)
2 months ago 0 / 117 runs (0.0%)
  • CLOSED/DUPLICATE
  • 2 months, 1 week ago
  • [CI][BAT] igt@gem_exec_create@madvise - dmesg-warn - ODEBUG: active_state not available
  • APL: igt@gem_exec_create@madvise - dmesg-warn - ODEBUG: active_state not available : 0 / 46 runs (0.0%)
2 months ago 0 / 46 runs (0.0%)
  • CLOSED/FIXED
  • 2 months ago
  • [CI][BAT] igt@* - dmesg-warn / dmesg-fail - KSV list failed to become ready
  • APL KBL: all tests - dmesg-warn / dmesg-fail - KSV list failed to become ready : 21 / 235 runs (8.9%)
2 months ago 21 / 235 runs (8.9%)
  • CLOSED/FIXED
  • 2 months, 1 week ago
  • [CI][BAT] The chamelium of fi-icl-u2 is not connected but still configured...
  • ICL: igt@kms_chamelium@* - all statuses : 24 / 95 runs (25.3%)
2 months ago 24 / 95 runs (25.3%)
  • CLOSED/FIXED
  • 2 months ago
  • [CI][DRMTIP] igt@* - dmesg-warn / dmesg-fail - HDCP authentication failed
  • fi-glk-j4005: all tests - dmesg-warn / dmesg-fail - HDCP authentication failed : 0 / 99 runs (0.0%)
2 months ago 0 / 99 runs (0.0%)
  • CLOSED/FIXED
  • 2 months ago
  • [CI][SHARDS] igt@gem_exec_reuse@baggage - dmesg-warn - ODEBUG: Out of memory. ODEBUG disabled
  • APL: igt@gem_exec_reuse@baggage - dmesg-warn - ODEBUG: Out of memory. ODEBUG disabled : 3 / 35 runs (8.6%)
2 months ago 3 / 35 runs (8.6%)
  • CLOSED/FIXED
  • 2 months ago
  • [CI][SHARDS] igt@gem_exec_reuse@baggage - dmesg-warn - ODEBUG: active_state not available
  • APL: igt@gem_exec_reuse@baggage - dmesg-warn - ODEBUG: active_state not available : 1 / 29 runs (3.4%)
2 months ago 1 / 29 runs (3.4%)
  • CLOSED/FIXED
  • 2 months, 1 week ago
  • [CI] igt@kms_plane_lowres@pipe-a-tiling-none - dmesg-fail - *ERROR* Couldn't find PLL settings for mode!
  • SNB: all tests - dmesg - Couldn't find PLL settings for mode! : 0 / 2456 runs (0.0%)
2 months, 1 week ago 0 / 2456 runs (0.0%)
  • CLOSED/FIXED
  • 2 months, 1 week ago
  • [CI] igt@gem_exec_async@concurrent-writes-* - fail - Failed assertion: batch[i] == i
  • GLK: igt@gem_exec_async@concurrent-writes-* - fail - Failed assertion: batch[i] == i : 0 / 1010 runs (0.0%)
2 months, 1 week ago 0 / 1010 runs (0.0%)
  • CLOSED/FIXED
  • 2 months, 1 week ago
  • [CI] igt@kms_flip@flip-vs-expired-vblank - fail - Failed assertion: (__wait_for_vblank((1 << 11) | (1 << 10), o->pipe, exp_seq, 0, &reply)) == 0
  • GLK: igt@kms_flip@flip-vs-expired-vblank - fail - Failed assertion: (__wait_for_vblank((1 << 11) | (1 << 10), o->pipe, exp_seq, 0, &reply)) == 0 : 0 / 1007 runs (0.0%)
2 months, 1 week ago 0 / 1007 runs (0.0%)
  • CLOSED/FIXED
  • 2 months, 1 week ago
  • [CI] igt@kms_cursor_legacy@basic-* - fail - Failed assertion: poll(&pfd, 1, 0) == 0
  • GLK: igt@kms_cursor_legacy@basic-* - fail - Failed assertion: poll(&pfd, 1, 0) == 0 : 0 / 2543 runs (0.0%)
2 months, 1 week ago 0 / 2543 runs (0.0%)
  • CLOSED/DUPLICATE
  • 2 months, 1 week ago
  • [CI][BAT] igt@drv_selftest@live_contexts - dmesg-fail - rcs0: timed out on STOP_RING
  • BSW: igt@drv_selftest@live_contexts - dmesg-fail - rcs0: timed out on STOP_RING : 0 / 0 runs (0.0%)
2 months, 1 week ago 0 / 0 runs (0.0%)
  • CLOSED/DUPLICATE
  • 2 months, 1 week ago
  • [CI][BAT] igt@drv_selftest@live_requests - incomplete - GEM_BUG_ON(status & (1 << 1))
  • ICL: igt@drv_selftest@live_requests - incomplete - GEM_BUG_ON(status & (1 << 1)) : 0 / 0 runs (0.0%)
2 months, 1 week ago 0 / 0 runs (0.0%)
  • CLOSED/DUPLICATE
  • 2 months, 2 weeks ago
  • [CI][BAT] igt@* - dmesg-warn / dmesg-fail - bcs0: reset request timeout
  • BSW: all tests - dmesg-warn / dmesg-fail - bcs0: reset request timeout : 0 / 0 runs (0.0%)
2 months, 2 weeks ago 0 / 0 runs (0.0%)
  • CLOSED/DUPLICATE
  • 2 months, 2 weeks ago
  • [CI][SHARDS] igt@kms_flip@flip-vs-expired-vblank - dmesg-fail - Unclaimed write to register 0x2040
  • SNB: igt@kms_flip@flip-vs-expired-vblank - dmesg-fail - Unclaimed write to register 0x2040 : 0 / 2 runs (0.0%)
2 months, 2 weeks ago 0 / 2 runs (0.0%)
  • CLOSED/FIXED
  • 2 months, 2 weeks ago
  • [CI][BAT] igt@gem_exec_suspend@basic-s3 - dmesg-warn - *ERROR* Timed out waiting for PSR Idle State
  • ICL: igt@gem_exec_suspend@basic-s3 - dmesg-warn - *ERROR* Timed out waiting for PSR Idle State : 2 / 76 runs (2.6%)
2 months, 2 weeks ago 2 / 76 runs (2.6%)
  • CLOSED/DUPLICATE
  • 2 months, 2 weeks ago
  • [CI][SHARDS] igt@kms_frontbuffer_tracking@fbc-modesetfrombusy - dmesg-fail - *ERROR* rcs0 : timed out trying to stop ring
  • SNB: igt@kms_frontbuffer_tracking@fbc-modesetfrombusy - dmesg-fail - *ERROR* rcs0 : timed out trying to stop ring : 0 / 0 runs (0.0%)
2 months, 2 weeks ago 0 / 0 runs (0.0%)
  • CLOSED/WONTFIX
  • 2 months, 2 weeks ago
  • [CI][BAT] igt@drv_selftest@live_guc - dmesg-warn - *ERROR* MMIO: GuC action 0x10 failed with error
2 months, 2 weeks ago 424 / 683 runs (62.1%)
  • CLOSED/WORKSFORME
  • 2 months, 2 weeks ago
  • [CI][DRMTIP] igt@kms_panel_fitting@atomic-fastset - dmesg-warn - WARN_ON(crtc->config->scaler_state.scaler_id < 0)
  • GLK: igt@kms_panel_fitting@atomic-fastset - dmesg-warn - WARN_ON(crtc->config->scaler_state.scaler_id < 0) : 7 / 296 runs (2.4%)
2 months, 2 weeks ago 7 / 296 runs (2.4%)
  • CLOSED/WORKSFORME
  • 2 months, 2 weeks ago
  • [CI][DRMTIP] igt@kms_psr@primary_page_flip - fail - Failed assertion: psr_active(data->debugfs_fd, false)
  • PSR PSR2: igt@kms_psr@primary_page_flip - fail - Failed assertion: psr_active(data->debugfs_fd, false) : 106 / 556 runs (19.1%)
2 months, 2 weeks ago 106 / 556 runs (19.1%)
  • CLOSED/DUPLICATE
  • 2 months, 2 weeks ago
  • [CI][BAT] igt@pm_rpm@module-reload - timeout - pm_rpm: executing$
  • BXT: igt@pm_rpm@module-reload - timeout - pm_rpm: executing$ : 0 / 0 runs (0.0%)
2 months, 2 weeks ago 0 / 0 runs (0.0%)
  • CLOSED/WORKSFORME
  • 2 months, 2 weeks ago
  • [CI][DRMTIP] igt@kms_fbcon_fbt@psr-suspend - incomplete - soft hang
  • ICL: igt@kms_fbcon_fbt@psr-suspend - incomplete : 2 / 16 runs (12.5%)
2 months, 2 weeks ago 2 / 16 runs (12.5%)
  • CLOSED/DUPLICATE
  • 5 months, 2 weeks ago
  • [CI] igt@prime_busy@*hang* - dmesg-warn - *ERROR* Failed to reset GuC, ret = -110
  • GUC: igt@prime_busy@*hang* - dmesg-warn - *ERROR* Failed to reset GuC, ret = -110 : 40 / 79 runs (50.6%)
2 months, 2 weeks ago 40 / 79 runs (50.6%)
  • CLOSED/WORKSFORME
  • 2 months, 2 weeks ago
  • [CI][SHARDS] igt@* - fail - gem exec bo fails with error -5 on gen9
  • BXT APL GLK KBL CFL WHL: All tests - fail - Failed assertion: __gem_execbuf(fd, execbuf) == 0, error: -5 != 0 : 1 / 645 runs (0.2%)
  • Gen9+: igt@kms_vblank@pipe-c-*-idle-hang - fail - Failed assertion: __gem_execbuf_wr(fd, execbuf) == 0, error: -5 != 0 : 0 / 362 runs (0.0%)
  • Gen9+: all tests - fail - Failed assertion: (drm_intel_gem_bo_context_exec(batch->bo, ctx, used, ring)) == 0 : 7 / 705 runs (1.0%)
2 months, 2 weeks ago 14 / 1828 runs (0.8%)
  • CLOSED/WORKSFORME
  • 2 months, 2 weeks ago
  • [CI][DRMTIP] igt@kms_chv_cursor_fail@pipe-[abc]-* - dmesg-warn - *ERROR* Overflow of CRC buffer, userspace reads too slow.
  • SKL CFL: igt@kms_chv_cursor_fail@pipe-[abc]-* - dmesg-warn - *ERROR* Overflow of CRC buffer, userspace reads too slow. : 5 / 264 runs (1.9%)
2 months, 2 weeks ago 5 / 264 runs (1.9%)
  • CLOSED/WORKSFORME
  • 2 months, 2 weeks ago
  • [CI][BAT] igt@kms_psr@sprite_plane_onoff - fail - Failed assertion: psr_wait_entry_if_enabled(data)
  • PSR: igt@kms_psr@sprite_plane_onoff - fail - Failed assertion: psr_wait_entry_if_enabled(data) : 307 / 869 runs (35.3%)
2 months, 2 weeks ago 307 / 869 runs (35.3%)
  • CLOSED/FIXED
  • 2 months, 2 weeks ago
  • [CI][DRMTIP] igt@kms_plane_scaling@pipe-b-scaler-with-rotation - fail - Failed assertion: ret == 0, Last errno: 22, Invalid argument
  • ICL: igt@kms_plane_scaling@pipe-b-scaler-with-rotation - fail - Failed assertion: ret == 0, Last errno: 22, Invalid argument : 9 / 21 runs (42.9%)
2 months, 2 weeks ago 9 / 21 runs (42.9%)
  • CLOSED/WORKSFORME
  • 2 months, 2 weeks ago
  • [CI] igt@kms_pipe_crc_basic@[nonblocking|read]-crc-pipe-[b|c]-frame-sequence - Failed assertion: crcs[j].frame + 1 == crcs[j + 1].frame / Last errno: 9, Bad file descriptor
  • CFL: igt@pipe_crc_basic@* - fail - Last errno: 9, Bad file descriptor : 0 / 717 runs (0.0%)
  • SKL CFL: igt@kms_pipe_crc_basic@read-crc-pipe-* - Failed assertion: crcs[j].frame + 1 == crcs[j + 1].frame : 0 / 955 runs (0.0%)
2 months, 2 weeks ago 0 / 955 runs (0.0%)
  • CLOSED/WORKSFORME
  • 2 months, 2 weeks ago
  • [CI] [SKL only] igt@*@* - dmesg-warn - *ERROR* Potential atomic update failure on pipe A
  • fi-skl-6260u/6600u/6700hq: all tests - Potential atomic update failure on pipe A : 53 / 2058 runs (2.6%)
2 months, 2 weeks ago 68 / 2090 runs (3.3%)
  • CLOSED/WORKSFORME
  • 2 months, 2 weeks ago
  • [Intel GFX CI] Many "*ERROR* amdgpu: IB test timed out." messages in dmesg
  • VEGAm: all tests - dmesg-warn - amdgpu: IB test timed out. : 8 / 679 runs (1.2%)
2 months, 2 weeks ago 8 / 679 runs (1.2%)
  • CLOSED/WORKSFORME
  • 2 months, 2 weeks ago
  • [CI] igt@kms_pipe_crc_basic@* - fail - Failed assertion: !wedged
  • SKL: all tests - fail - Failed assertion: !wedged : 170 / 2019 runs (8.4%)
2 months, 2 weeks ago 170 / 2019 runs (8.4%)
  • CLOSED/WORKSFORME
  • 2 months, 2 weeks ago
  • [CI] fi-hsw-peppy: all tests - dmesg-warn - *ERROR* Panel is unable to calculate any CRC after 6 vblanks
  • fi-hsw-peppy: all tests - *ERROR* Panel is unable to calculate any CRC after 6 vblanks : 48 / 1303 runs (3.7%)
2 months, 2 weeks ago 48 / 1303 runs (3.7%)
  • CLOSED/WORKSFORME
  • 2 months, 2 weeks ago
  • [Intel GFX CI] Plenty of "*ERROR* VCE not responding, trying to reset the ECPU!!!" in dmesg
  • VEGAm: all tests - dmesg-warn - VCE not responding, trying to reset the ECPU!!! : 2 / 679 runs (0.3%)
2 months, 2 weeks ago 2 / 679 runs (0.3%)
  • CLOSED/FIXED
  • 2 months, 2 weeks ago
  • [CI] igt@gem_exec_capture@capture-render - fail - Failed assertion: found
  • BLB PNV BXT: igt@gem_exec_capture@* - Failed assertion: found : 3 / 41 runs (7.3%)
2 months, 2 weeks ago 3 / 41 runs (7.3%)
  • CLOSED/WORKSFORME
  • 2 months, 2 weeks ago
  • [CI][SHARDS] igt@kms_universal_plane@cursor-fb-leak-pipe-[abc] - fail - Failed assertion: count1 == count2
  • BYT BXT BSW APL GLK: igt@kms_universal_plane@cursor-fb-leak-pipe-* - fail - Failed assertion: count1 == count2 : 14 / 729 runs (1.9%)
2 months, 2 weeks ago 14 / 729 runs (1.9%)
  • CLOSED/WORKSFORME
  • 2 months, 2 weeks ago
  • [CI] igt@* - WARNING at sound/pci/hda/hda_codec.c:2494 snd_hda_spdif_ctls_unassign [snd_hda_codec]
  • all machines: all tests - dmesg-warn - WARNING at sound/pci/hda/hda_codec.c:2494 snd_hda_spdif_ctls_unassign [snd_hda_codec] : 32 / 3191 runs (1.0%)
2 months, 2 weeks ago 32 / 3191 runs (1.0%)
  • CLOSED/WORKSFORME
  • 2 months, 2 weeks ago
  • [CI] igt@kms_flip@*(flip|wf_vblank_ts_check)* - fail - Failed assertion: elapsed >= min && elapsed <= max
  • all machines: igt@kms_flip@*(flip|wf_vblank_ts_check)* - Failed assertion: elapsed >= min && elapsed <= max : 1 / 1975 runs (0.1%)
2 months, 2 weeks ago 22 / 2844 runs (0.8%)
  • CLOSED/WORKSFORME
  • 2 months, 2 weeks ago
  • [CI] igt@kms_flip@(2x-)?flip-vs-expired-vblank(-interruptible)? - fail - Failed assertion: timercmp(&reply.ts, &o->flip_state.last_ts, ==)
  • HSW SKL BXT APL KBL CFL GLK: igt@kms_flip@(2x-)?flip-vs-expired-vblank(-interruptible)? - Failed assertion: timercmp(&reply.ts, &o->flip_state.last_ts, ==) : 74 / 1084 runs (6.8%)
2 months, 2 weeks ago 74 / 1084 runs (6.8%)
  • CLOSED/NOTOURBUG
  • 5 months, 3 weeks ago
  • [BAT] igt@drv_module_reload@* - dmesg-warn - *ERROR* Gen9 Plane WM* latency not provided
  • CNL: igt@drv_selftest@live_* - dmesg-warn / dmesg-fail - *ERROR* Gen9 Plane WM\d latency not provided : 33 / 593 runs (5.6%)
  • fi-cnl-drrs/psr: igt@drv_module_reload@* - *ERROR* Gen9 Plane WM* latency not provided : 777 / 1037 runs (74.9%)
2 months, 2 weeks ago 846 / 1408 runs (60.1%)
  • CLOSED/DUPLICATE
  • 2 months, 2 weeks ago
  • [CI][BAT] igt@drv_selftest@mock_sanitycheck - dmesg-warn - WARNING: CPU: 1 PID: 4189 at drivers/gpu/drm/drm_mode_config.c:444 drm_mode_config_cleanup
  • GLK: igt@drv_selftest@mock_sanitycheck - dmesg-warn - WARNING: CPU: 1 PID: 4189 at drivers/gpu/drm/drm_mode_config.c:444 drm_mode_config_cleanup : 2 / 783 runs (0.3%)
2 months, 2 weeks ago 2 / 783 runs (0.3%)
  • CLOSED/WORKSFORME
  • 2 months, 2 weeks ago
  • [CI][DRMTIP] igt@kms_* - dmesg-warn - pipe_off wait timed out
  • SKL: all tests - dmesg-warn - pipe_off wait timed out : 1 / 1258 runs (0.1%)
2 months, 2 weeks ago 1 / 1253 runs (0.1%)
  • CLOSED/FIXED
  • 2 months, 2 weeks ago
  • [CI] igt@kms_flip@busy-flip-interruptible - Failed assertion: __wait_for_vblank(TEST_VBLANK_BLOCK, o->pipe, 1, 0, &reply) == 0
  • BXT APL GLK: igt@kms_flip@busy-flip-interruptible - Failed assertion: __wait_for_vblank(TEST_VBLANK_BLOCK, o->pipe, 1, 0, &reply) == 0 : 5 / 1123 runs (0.4%)
2 months, 2 weeks ago 5 / 1123 runs (0.4%)
  • CLOSED/WORKSFORME
  • 2 months, 2 weeks ago
  • [CI] igt@perf@i915-ref-count - fail - Test assertion failure function __real_main4086 - Failed assertion: drm_fd == -1 - error: 3 != -1
  • CFL WHL: igt@perf@i915-ref-count - Failed assertion: drm_fd == -1 : 44 / 65 runs (67.7%)
2 months, 2 weeks ago 44 / 65 runs (67.7%)
  • CLOSED/WORKSFORME
  • 2 months, 2 weeks ago
  • [CI] igt@gem_mmap_gtt@(forked-)big-copy(-xy) - incomplete
  • fi-gdg-551 fi-bwr-2160 fi-pnv-d510: igt@gem_mmap_gtt@(forked-)big-copy(-xy) - incomplete : 87 / 109 runs (79.8%)
2 months, 2 weeks ago 94 / 116 runs (81.0%)
  • CLOSED/DUPLICATE
  • 3 months ago
  • [CI][DRMTIP] igt@prime_mmap_coherency@ioctl-errors - fail - Failed assertion: !(ptr2_cpu[i] != 0x11111111)
  • BYT: igt@prime_mmap_coherency@ioctl-errors - fail - Failed assertion: !(ptr2_cpu[i] != 0x11111111) : 11 / 35 runs (31.4%)
2 months, 2 weeks ago 11 / 35 runs (31.4%)
  • CLOSED/WORKSFORME
  • 2 months, 2 weeks ago
  • [Intel GFX CI][BAT] igt@amdgpu_amd_basic@userptr - incomplete - general protection fault: 0000 [#1] PREEMPT SMP PTI, __mmu_notifier_release
  • VEGA M: igt@amdgpu/amd_basic@userptr - incomplete : 21 / 497 runs (4.2%)
2 months, 2 weeks ago 21 / 497 runs (4.2%)
  • CLOSED/DUPLICATE
  • 2 months, 3 weeks ago
  • [CI][BAT] igt@gem_sync@basic-many-each - fail - Failed assertion: !"GPU hung"
  • BYT: igt@gem_sync@basic-many-each - fail - Failed assertion: !"GPU hung" : 5 / 472 runs (1.1%)
2 months, 2 weeks ago 5 / 472 runs (1.1%)
  • CLOSED/WORKSFORME
  • 3 months ago
  • [CI][BAT] igt@* - dmesg-warn / dmesg-fail - WARN_ON(!pstate->fb)
  • ICL: all tests - dmesg-warn|dmesg-fail - WARN_ON(!pstate->fb) : 3 / 374 runs (0.8%)
2 months, 2 weeks ago 3 / 374 runs (0.8%)
  • CLOSED/WORKSFORME
  • 2 months, 2 weeks ago
  • [BAT][CNL only] igt@kms_* - dmesg-warn - *ERROR* CPU pipe [A|B|C] FIFO underrun
  • fi-cnl-y3/psr: all tests - *ERROR* CPU pipe [ABC] FIFO underrun : 151 / 1072 runs (14.1%)
2 months, 2 weeks ago 167 / 1103 runs (15.1%)
  • CLOSED/WORKSFORME
  • 2 months, 2 weeks ago
  • [BAT] [CNL only] igt@* - incomplete - system hang?
  • fi-cnl-y3/psr: all tests - incomplete : 160 / 1072 runs (14.9%)
2 months, 2 weeks ago 203 / 1200 runs (16.9%)
  • CLOSED/FIXED
  • 3 months ago
  • [CI] igt@gem_exec_capture@.* - incomplete
  • fi-pnv-d510 fi-blb-e6850: igt@gem_exec_capture@.* - incomplete : 71 / 109 runs (65.1%)
2 months, 2 weeks ago 72 / 116 runs (62.1%)
  • CLOSED/FIXED
  • 4 months, 1 week ago
  • [CI] igt@drv_missed_irq - fail - Failed assertion: missed_rings == expect_rings
  • ILK APL GLK ICL: igt@drv_missed_irq - Failed assertion: missed_rings == expect_rings : 0 / 211 runs (0.0%)
2 months, 2 weeks ago 10 / 574 runs (1.7%)
  • CLOSED/WORKSFORME
  • 2 months, 2 weeks ago
  • [CI][DRMTIP] igt@kms_flip@* - dmesg-warn - vblank wait timed out on crtc 0
  • BDW: all tests - dmesg-warn - vblank wait timed out on crtc \d : 3 / 417 runs (0.7%)
2 months, 2 weeks ago 3 / 417 runs (0.7%)
  • CLOSED/WORKSFORME
  • 2 months, 2 weeks ago
  • [CI][DRMTIP] igt@* - fail - Opening crc fd, and poll for first CRC.
  • PSR: all tests - fail - Opening crc fd, and poll for first CRC : 6 / 681 runs (0.9%)
2 months, 2 weeks ago 6 / 681 runs (0.9%)
  • CLOSED/FIXED
  • 2 months, 2 weeks ago
  • [CI][BAT] igt@kms_psr@cursor_plane_move - fail - Last errno: 25, Inappropriate ioctl for device
  • CNL: igt@kms_psr@cursor_plane_move - fail - Last errno: 25, Inappropriate ioctl for device : 87 / 435 runs (20.0%)
2 months, 2 weeks ago 87 / 435 runs (20.0%)
  • CLOSED/DUPLICATE
  • 3 months ago
  • [CI][BAT] igt@drv_selftest@live_hangcheck - dmesg-fail - *ERROR* MMIO: GuC action 0x501 failed with error -110 0x501
  • GUC: igt@drv_selftest@live_hangcheck - dmesg-fail - *ERROR* MMIO: GuC action 0x501 failed with error -110 0x501 : 1 / 337 runs (0.3%)
2 months, 2 weeks ago 1 / 337 runs (0.3%)
  • CLOSED/FIXED
  • 2 months, 2 weeks ago
  • [CI] igt@* - fail/dmesg-fail - *ERROR* GuC firmware xfer error -110
  • GUC: all tests - dmesg-warn - *ERROR* MMIO: GuC action 0x501 failed with error -110 0x501 : 1 / 124 runs (0.8%)
  • GUC: All tests - dmesg-fail/dmesg-warn - *ERROR* GuC firmware xfer error -110 : 19 / 1489 runs (1.3%)
  • SKL: igt@gem_eio@* - fail/dmesg-fail - Failed assertion: !wedged / GuC firmware xfer error -110 : 7 / 319 runs (2.2%)
2 months, 2 weeks ago 20 / 1738 runs (1.2%)
  • CLOSED/WORKSFORME
  • 2 months, 2 weeks ago
  • [CI][DRMTIP] igt@pm_rpm@gem-execbuf-stress(-extra-wait) - dmesg-fail - Failed assertion: __gem_execbuf(fd, execbuf) == 0
  • GUC: all tests - dmesg-fail - Failed assertion: __gem_execbuf(fd, execbuf) == 0, error: -5 != 0 : 0 / 207 runs (0.0%)
  • GUC: igt@pm_rpm@gem-idle - fail - Failed assertion: !is_wedged(i915), Last errno: 5, Input/output error : 0 / 20 runs (0.0%)
2 months, 2 weeks ago 0 / 214 runs (0.0%)
  • CLOSED/WORKSFORME
  • 2 months, 2 weeks ago
  • [CI] igt@gem_exec_schedule@wide-bsd1 - dmesg-fail - Failed assertion: __gem_context_create(fd, &ctx_id) == 0 / gem_exec_schedu: page allocation failure: order:0, mode:0x8402(__GFP_HIGHMEM|__GFP_RETRY_MAYFAIL|__GFP_ZERO), nodemask=(null)
  • SKL: all tests - dmesg-fail - Failed assertion: __gem_context_create(fd, &ctx_id) == 0 : 1 / 2003 runs (0.0%)
2 months, 2 weeks ago 1 / 2003 runs (0.0%)
  • CLOSED/WORKSFORME
  • 2 months, 2 weeks ago
  • [CI] igt@kms_frontbuffer_tracking@fbc-suspend - dmesg-warn - Power well 2 on.
  • GLK: igt@kms_frontbuffer_tracking@fbc-suspend - dmesg-warn - Power well 2 on. : 1 / 1029 runs (0.1%)
2 months, 2 weeks ago 1 / 1029 runs (0.1%)
  • CLOSED/WORKSFORME
  • 2 months, 2 weeks ago
  • [CI] [IVB only] igt@* - incomplete - timeout/system hang
  • fi-ivb-3520m: igt@drv_selftest@(random tests) - incomplete : 0 / 471 runs (0.0%)
  • IVB: igt@gem_tiled_blits@interruptible - incomplete : 0 / 76 runs (0.0%)
  • ivb: igt@*suspend* - incomplete : 2 / 2019 runs (0.1%)
2 months, 2 weeks ago 2 / 2019 runs (0.1%)
  • CLOSED/WORKSFORME
  • 3 weeks ago
  • [CI] igt@kms_chv_cursor_fail@* - fail - Test assertion failure function do_display_commit, Failed assertion: ret == 0
  • shard-kbl: all tests - fail - Test assertion failure function do_display_commit, Failed assertion: ret == 0 : 2 / 1200 runs (0.2%)
2 months, 2 weeks ago 2 / 1202 runs (0.2%)
  • CLOSED/WORKSFORME
  • 2 months, 2 weeks ago
  • [CI] igt@* - dmesg-warn - *ERROR* Timed out waiting for PSR Idle for re-enable
  • fi-cnl-psr: igt@* - dmesg-warn - *ERROR* Timed out waiting for PSR Idle for re-enable : 1 / 1054 runs (0.1%)
2 months, 2 weeks ago 1 / 1054 runs (0.1%)
  • CLOSED/WORKSFORME
  • 3 weeks ago
  • [CI] igt@kms_frontbuffer_tracking@ - dmesg-warn - *ERROR* vblank not available for FBC on pipe A
  • GLK: all tests - dmesg-warn - *ERROR* vblank not available for FBC on pipe A : 1 / 2727 runs (0.0%)
2 months, 2 weeks ago 1 / 2727 runs (0.0%)
  • CLOSED/WORKSFORME
  • 3 weeks ago
  • [CI] igt@pm_rpm@debugfs-read - dmesg-warn - Unclaimed read from register 0x1e1110
  • fi-byt-j1900: igt@*debugfs* - dmesg-warn - Unclaimed read from register 0x1e1110 : 1 / 1743 runs (0.1%)
2 months, 2 weeks ago 1 / 1743 runs (0.1%)
  • CLOSED/WORKSFORME
  • 2 months, 2 weeks ago
  • [CI] igt@kms_psr_sink_crc@psr_drrs - fail - Failed assertion: drrs_disabled(&data)
  • CNL: igt@kms_psr_sink_crc@(no|psr)_drrs - Failed assertion: drrs_disabled(&data) : 7 / 14 runs (50.0%)
2 months, 2 weeks ago 7 / 14 runs (50.0%)
  • CLOSED/WORKSFORME
  • 2 months, 2 weeks ago
  • [CI] igt@debugfs_test@read_all_entries* - fail - Timed out: reading sysfs entry
  • All machines: igt@debugfs_test@read_all_entries* - dmesg-fail - : 0 / 2415 runs (0.0%)
  • all machines: igt@debugfs_test@read_all_entries*- Reading file "i915_pipe_[ABC]_crc" Timed out: reading sysfs entry : 57 / 3307 runs (1.7%)
2 months, 2 weeks ago 62 / 3336 runs (1.9%)
  • CLOSED/WORKSFORME
  • 2 months, 2 weeks ago
  • [CI] igt@kms_rotation_crc@* - fail - Timed out: CRC reading
  • fi-cnl-psr/y3: igt@kms_rotation_crc@* - Timed out: CRC reading : 19 / 57 runs (33.3%)
2 months, 2 weeks ago 19 / 57 runs (33.3%)
  • CLOSED/FIXED
  • 2 months, 2 weeks ago
  • [CI] igt@kms_busy@extended-modeset-hang-newfb-with-reset-render-[a|b] - dmesg-warn - Unclaimed read from register 0x1f0050 - WARNING: CPU: 3 PID: 260 at drivers/gpu/drm/i915/intel_uncore.c:1070 __unclaimed_reg_debug+0x3b/0x50 [i915]
  • fi-byt-*: igt@kms_busy@extended-modeset-hang-newfb-with-reset-render-[a|b] - dmesg-warn - Unclaimed read from register 0x1f0050 : 14 / 106 runs (13.2%)
2 months, 2 weeks ago 28 / 120 runs (23.3%)
  • CLOSED/WORKSFORME
  • 2 months, 2 weeks ago
  • [CI] igt@kms_flip@*wf_vblank* - fail - Failed assertion: fabs((elapsed - expected) / expected) <= 0.005
  • CNL: igt@kms_flip@*wf_vblank* - fail - Failed assertion: fabs((elapsed - expected) / expected) <= 0.005 : 9 / 1114 runs (0.8%)
2 months, 2 weeks ago 9 / 1114 runs (0.8%)
  • CLOSED/WORKSFORME
  • 2 months, 2 weeks ago
  • [CI] igt@kms_sink_crc_basic - fail - Failed assertion: 0 == r
  • CFL CNL WHL: igt@kms_sink_crc_basic - fail - Failed assertion: 0 == r : 0 / 491 runs (0.0%)
2 months, 2 weeks ago 0 / 491 runs (0.0%)
  • CLOSED/WORKSFORME
  • 2 months, 2 weeks ago
  • [CI] [ELK only] igt@* - dmesg-fail - Failed assertion: drmWaitVBlank(drm_fd, &wait_vbl) == 0
  • ELK: igt@* - dmesg-fail - Failed assertion: drmWaitVBlank(drm_fd, &wait_vbl) == 0 / vblank wait timed out on crtc : 1 / 1679 runs (0.1%)
  • ELK: igt@* - dmesg-fail - Failed assertion: drmWaitVBlank(drm_fd, &wait_vbl) == 0 / flip_done : 4 / 1679 runs (0.2%)
2 months, 2 weeks ago 4 / 1679 runs (0.2%)
  • CLOSED/WORKSFORME
  • 2 months, 2 weeks ago
  • [CI] igt@debugfs_test@read_all_entries - dmesg-fail - *ERROR* Panel is unable to calculate any CRC after 6 vblanks
  • HSW PSR: igt@drv_suspend@debugfs-reader - dmesg-warn - *ERROR* Panel is unable to calculate any CRC after 6 vblanks : 21 / 938 runs (2.2%)
  • PSR PSR2: igt@debugfs_test@read_all_entries - dmesg-fail - *ERROR* Panel is unable to calculate any CRC after 6 vblanks : 0 / 1597 runs (0.0%)
2 months, 2 weeks ago 21 / 2326 runs (0.9%)
  • CLOSED/WORKSFORME
  • 2 months, 2 weeks ago
  • [CI] igt@kms_flip@flip-vs-panning-vs-hang[-interruptible] or igt@kms_vblank@pipe-[abc]-ts-continuation-modeset-hang - dmesg-warn - *ERROR* Potential atomic update failure on pipe [A|B]
  • IVB IVBm: igt@kms_flip@flip-vs-panning-vs-hang - dmesg-warn - *ERROR* Potential atomic update failure on pipe [ABC] : 0 / 40 runs (0.0%)
  • IVB IVBm: igt@kms_vblank@pipe-[abc]-ts-continuation-modeset-hang - dmesg-warn - : 1 / 84 runs (1.2%)
  • snb fi-ivb-3520m: igt@kms_flip@(2x-)flip-vs-panning-vs-hang(-interruptible) - *ERROR* Potential atomic update failure on pipe [ABC] : 16 / 1326 runs (1.2%)
2 months, 2 weeks ago 17 / 1326 runs (1.3%)
  • CLOSED/WORKSFORME
  • 2 months, 2 weeks ago
  • [CI] igt@gem_ctx_create@basic-files - dmesg-warn - gem_ctx_create: page allocation failure
  • all machines: igt@gem_ctx_create@basic-files - dmesg-warn - gem_ctx_create: page allocation failure : 40 / 2313 runs (1.7%)
2 months, 2 weeks ago 40 / 2313 runs (1.7%)
  • CLOSED/WORKSFORME
  • 2 months, 2 weeks ago
  • [CI] igt@gem_ctx_create@basic-files - incomplete - hang without useful logs
  • SKL: random tests - incomplete : 0 / 284 runs (0.0%)
  • All machines: igt@gem_ctx_create@basic-files - incomplete : 9 / 2291 runs (0.4%)
2 months, 2 weeks ago 9 / 2298 runs (0.4%)
  • CLOSED/WORKSFORME
  • 2 months, 2 weeks ago
  • [CI] suspend/hang tests - dmesg-warn - *ERROR* [CRTC:37:pipe A] flip_done timed out
  • fi-ctg-p8600, fi-elk-e7500: igt@kms_pipe_crc_basic@suspend-read-crc-pipe-[abc] - *ERROR* [CRTC:37:pipe A] flip_done timed out : 7 / 1984 runs (0.4%)
2 months, 2 weeks ago 9 / 2152 runs (0.4%)
  • CLOSED/WORKSFORME
  • 2 months, 2 weeks ago
  • [CI] igt@kms_pipe_crc_basic@nonblocking-crc-pipe-* - fail - Failed assertion: 3 <= n_crcs
  • BSW GLK CNL: igt@kms_pipe_crc_basic@nonblocking-crc-pipe-* - fail - Failed assertion: 3 <= n_crcs : 1 / 2234 runs (0.0%)
2 months, 2 weeks ago 1 / 2234 runs (0.0%)
  • CLOSED/WORKSFORME
  • 2 months, 2 weeks ago
  • [CI] igt@kms_pipe_crc_basic@[nonblocking|read]-crc-pipe-[b|c]-frame-sequence - Failed assertion: crcs[j].frame + 1 == crcs[j + 1].frame / Last errno: 9, Bad file descriptor
  • all machines: Failed assertion: crcs[j].frame + 1 == crcs[j + 1].frame : 76 / 3307 runs (2.3%)
2 months, 2 weeks ago 77 / 3357 runs (2.3%)
  • CLOSED/FIXED
  • 3 months, 3 weeks ago
  • [CI] igt@i915_query@query-topology-matches-eu-total - fail - Test assertion failure function test_query_topology_matches_eu_total - Failed assertion: subslice_available(topo_info, s, ss)
  • fi-cnl-y3: igt@i915_query@query-topology-matches-eu-total - Failed assertion: subslice_available(topo_info, s, ss) : 0 / 0 runs (0.0%)
2 months, 2 weeks ago 48 / 48 runs (100.0%)
  • CLOSED/FIXED
  • 2 months, 2 weeks ago
  • [CI] igt@gem_linear_blits@normal - fail - Failed assertion: linear[i] == val
  • GLK: igt@gem_linear_blits@* - fail - Failed assertion: linear[i] == (start_val|val) : 0 / 2702 runs (0.0%)
2 months, 2 weeks ago 0 / 2702 runs (0.0%)
  • CLOSED/FIXED
  • 2 months, 2 weeks ago
  • [CI] fi-kbl-r: igt@kms_pipe_crc_basic@hang-read-crc-pipe-a - fail - Failed assertion: !wedged
  • fi-kbl-r: igt@kms_pipe_crc_basic@hang-read-crc-pipe-a - Failed assertion: !wedged : 0 / 1625 runs (0.0%)
2 months, 2 weeks ago 0 / 1625 runs (0.0%)
  • CLOSED/FIXED
  • 2 months, 2 weeks ago
  • [CI] igt@testdisplay - warn - WARNING: failed to set mode (3840x2160@30Hz): Invalid argument
  • KBL: igt@testdisplay - warn - WARNING: failed to set mode \(.*\): Invalid argument : 0 / 955 runs (0.0%)
2 months, 2 weeks ago 0 / 955 runs (0.0%)
  • CLOSED/WORKSFORME
  • 3 weeks ago
  • [CI] igt@kms_setmode@basic - fail - Failed assertion: (drmWaitVBlank(drm_fd, &wait)) == 0
  • CFL: igt@kms_setmode@basic - fail - Failed assertion: (drmWaitVBlank(drm_fd, &wait)) == 0 : 0 / 76 runs (0.0%)
2 months, 2 weeks ago 0 / 76 runs (0.0%)
  • CLOSED/WORKSFORME
  • 2 months, 2 weeks ago
  • [CI] igt@perf_pmu@semaphore-wait-idle-vecs0 - fail - Failed assertion: (double)(val[1] - val[0]) <= (1.0 + (tolerance)) * (double)(slept) && (double)(val[1] - val[0]) >= (1.0 - (tolerance)) * (double)(slept)
  • GLK: igt@perf_pmu@semaphore-* - fail - Failed assertion: (double)(val[1] - val[0]) <= (1.0 + (tolerance)) * ... : 0 / 1064 runs (0.0%)
2 months, 2 weeks ago 0 / 1064 runs (0.0%)
  • CLOSED/FIXED
  • 2 months, 2 weeks ago
  • [CI] igt@pm_rpm@modeset-pc8-residency-stress - incomplete
  • fi-skl-6700k2: igt@pm_rpm@modeset-pc8-residency-stress - incomplete : 0 / 73 runs (0.0%)
2 months, 2 weeks ago 0 / 73 runs (0.0%)
  • NEW
  • 3 months, 2 weeks ago
  • igt@perf_pmu@cpu-hotplug - WARNING: CPU: 0 PID: 0 at arch/x86/kernel/apic/apic.c:1457 setup_local_APIC
  • BSW: igt@perf_pmu@cpu-hotplug - dmesg-warn - WARNING: CPU: 0 PID: 0 at arch/x86/kernel/apic/apic.c:1457 setup_local_APIC : 0 / 73 runs (0.0%)
2 months, 2 weeks ago 0 / 73 runs (0.0%)
  • CLOSED/WORKSFORME
  • 2 months, 2 weeks ago
  • [CI] igt@kms_flip@2x-*-flip-* - fail - Failed assertion: (do_page_flip(o, new_fb_id, !(o->flags & (1 << 16)))) == 0
  • HSW: igt@kms_flip@2x-*flip* - fail - Failed assertion: do_page_flip(o, o->fb_ids[1], 1) == 0 : 0 / 1046 runs (0.0%)
2 months, 2 weeks ago 0 / 1046 runs (0.0%)
  • RESOLVED/FIXED
  • 3 weeks ago
  • [CI] [Intel-GFX-CI] shards may get killed early, creating more incompletes
  • random list of tests and machines : 0 / 106 runs (0.0%)
2 months, 2 weeks ago 0 / 106 runs (0.0%)
  • CLOSED/FIXED
  • 2 months, 2 weeks ago
  • [CI] igt@kms_rotation_crc@primary-rotation-90 - Test assertion failure function wait_for_pageflip, file kms_rotation_crc.c:300 - CRITICAL: Failed assertion: ret == 1
  • shard-apl cnl: igt@kms_rotation_crc@primary*-90 - CRITICAL: Failed assertion: ret == 1 : 0 / 1276 runs (0.0%)
2 months, 2 weeks ago 0 / 1276 runs (0.0%)
  • CLOSED/DUPLICATE
  • 2 months, 2 weeks ago
  • [CI][BAT] igt@(drv_module_reload@basic-no-display|drv_selftest@live_sanitycheck) - dmesg-warn - *ERROR* power well DDI C IO state mismatch (refcount 1/enabled 0)
  • ICL: igt@(drv_module_reload@basic-no-display|drv_selftest@live_sanitycheck) - dmesg-warn - *ERROR* power well DDI C IO state mismatch (refcount 1/enabled 0) : 0 / 153 runs (0.0%)
  • ICL: igt@(drv_module_reload@basic-no-display|drv_selftest@live_sanitycheck) - dmesg-warn - *ERROR* power well DDI C IO state mismatch (refcount 1/enabled 0) : 0 / 153 runs (0.0%)
2 months, 2 weeks ago 14 / 177 runs (7.9%)
  • CLOSED/DUPLICATE
  • 2 months, 2 weeks ago
  • [CI][SHARDS] igt@kms_frontbuffer_tracking@fbc-[12]p* - dmesg-fail - WARN_ON((dev_priv->uncore.funcs.mmio_readl(dev_priv, (((const i915_reg_t){ .reg = (((engine)->mmio_base) + 0x9c) })), true) & (1 << 9)) == 0)
  • SNB: igt@kms_frontbuffer_tracking@fbc-[12]p-* - dmesg fail - WARN_ON((dev_priv->uncore.funcs.mmio_readl(dev_priv, (((const i915_reg_t){ .reg = (((engine)->m : 0 / 193 runs (0.0%)
2 months, 2 weeks ago 1 / 262 runs (0.4%)
  • CLOSED/DUPLICATE
  • 3 months ago
  • [CI] igt@debugfs_test@read_all_entries - dmesg-warn - WARN_ON((val & (1 << ((port) == PORT_F ? 23 : (port) + 10))) == 0)
  • ICL: igt@debugfs_test@read_all_entries - dmesg-warn - WARN_ON((val & (1 << ((port) == PORT_F ? 23 : (port) + 10))) == 0) : 1 / 213 runs (0.5%)
2 months, 2 weeks ago 1 / 213 runs (0.5%)
  • CLOSED/FIXED
  • 2 months, 2 weeks ago
  • [CI][DRMTIP] igt@gem_eio@wait-wedge-1us - dmesg-warn - GEM_BUG_ON(!intel_engine_is_idle(engine))
  • BSW: igt@gem_eio@wait-wedge-1us - dmesg-warn - GEM_BUG_ON(!intel_engine_is_idle(engine)) : 0 / 13 runs (0.0%)
2 months, 2 weeks ago 0 / 13 runs (0.0%)
  • CLOSED/FIXED
  • 2 months, 2 weeks ago
  • [CI][SHARDS] igt@kms_plane_alpha_blend@pipe-[bc]-(alpha|coverage)-7efc - fail - Failed assertion: pipe_crc->crc_fd != -1
  • BXT BDW APL SKL GLK KBL CFL WHL CNL ICL: igt@kms_plane_alpha_blend@pipe-[bc]-(alpha|coverage)-7efc - fail - Failed assertion: pipe_crc->crc_fd != -1 : 122 / 138 runs (88.4%)
2 months, 2 weeks ago 122 / 138 runs (88.4%)
  • CLOSED/FIXED
  • 2 months, 2 weeks ago
  • [CI][BAT] igt@kms_flip@basic-flip-vs-modeset - dmesg-warn - RPM wakelock ref not held during HW access
  • ICL: igt@kms_flip@basic-flip-vs-modeset - dmesg-warn - RPM wakelock ref not held during HW access : 0 / 204 runs (0.0%)
2 months, 2 weeks ago 0 / 204 runs (0.0%)
  • CLOSED/FIXED
  • 2 months, 2 weeks ago
  • [CI][BAT] igt@gem_busy@close-race - dmesg-fail - general protection fault: 0000 [#1] PREEMPT SMP PTI
  • All machines: igt@gem_busy@close-race - dmesg-fail - general protection fault: 0000 [#1] PREEMPT SMP : 0 / 11 runs (0.0%)
2 months, 2 weeks ago 0 / 11 runs (0.0%)
  • CLOSED/FIXED
  • 2 months, 1 week ago
  • [CI][SHARDS] igt@syncobj_wait@wait(-all)?-for-submit-*- incomplete
  • All machines: igt@syncobj_wait@wait(-all)?-for-submit-*- incomplete : 0 / 44 runs (0.0%)
2 months, 2 weeks ago 0 / 44 runs (0.0%)
  • CLOSED/WORKSFORME
  • 2 months, 3 weeks ago
  • [CI][SHARDS] igt@perf@blocking - fail - Failed assertion: kernel_ns <= (test_duration_ns / 100ull)
  • HSW: igt@perf@blocking - fail - Failed assertion: kernel_ns <= (test_duration_ns / 100ull) : 0 / 316 runs (0.0%)
2 months, 3 weeks ago 0 / 316 runs (0.0%)
  • CLOSED/DUPLICATE
  • 2 months, 1 week ago
  • [CI][BAT] igt@gem_partial_pwrite_pread@write - dmesg-fail - GT thread status wait timed out
  • SNB: igt@gem_partial_pwrite_pread@write - dmesg-fail - GT thread status wait timed out : 0 / 0 runs (0.0%)
2 months, 3 weeks ago 0 / 0 runs (0.0%)
  • CLOSED/FIXED
  • 2 months, 3 weeks ago
  • [CI][DRMTIP] igt@kms_chamelium@hdmi-crc-bgr565 - fail - Last errno: 113, No route to host
  • CHAMELIUM: igt@kms_chamelium@hdmi-crc-bgr565 - fail - Last errno: 113, No route to host : 0 / 7 runs (0.0%)
2 months, 3 weeks ago 0 / 7 runs (0.0%)
  • CLOSED/WONTFIX
  • 2 months, 3 weeks ago
  • [CI] igt@gem_exec_schedule@pi-ringfull-[blt|bsd*|default|render|vebox] - Test assertion failure function test_pi_ringfull
  • Last errno: 4, Interrupted system call : 1827 / 1828 runs (99.9%)
2 months, 3 weeks ago 1827 / 1828 runs (99.9%)
  • CLOSED/FIXED
  • 3 months ago
  • BSW - igt@drv_selftest@live_* - dmesg-warn - WARN_ON(intel_gpu_reset(i915, (~0)))
  • BSW: igt@drv_selftest@live_hangcheck - dmesg-fail - *ERROR* bcs0: reset request timeout : 0 / 480 runs (0.0%)
  • BSW - igt@drv_selftest@live_* - dmesg-warn - WARN_ON(intel_gpu_reset(i915, (~0))) : 0 / 516 runs (0.0%)
3 months ago 0 / 516 runs (0.0%)
  • CLOSED/FIXED
  • 3 months ago
  • [CI] igt@* - Incomplete - INFO: task modprobe:260 blocked for more than 60 seconds.
  • fi-bsw-n3050: igt@* - incomplete - INFO: task modprobe:260 blocked for more than 60 seconds. : 0 / 65 runs (0.0%)
3 months ago 0 / 65 runs (0.0%)
  • CLOSED/WORKSFORME
  • 3 months ago
  • [CI] igt@* - crash - An internal exception that should have been handled was not: UnicodeDecodeError
  • CNL: all tests - crash - An internal exception that should have been handled was not: UnicodeDecodeError : 0 / 986 runs (0.0%)
3 months ago 0 / 986 runs (0.0%)
  • CLOSED/FIXED
  • 3 months ago
  • [CI] igt@drv_suspend@sysfs-reader - dmesg-warn - *ERROR* bcs0: reset request timeout
  • SKL: igt@drv_suspend@sysfs-reader - dmesg-warn - bcs0: reset request timeout : 1 / 1801 runs (0.1%)
3 months ago 1 / 1801 runs (0.1%)
  • CLOSED/FIXED
  • 3 months ago
  • [CI] igt@syncobj_wait@reset-during-wait-for-submit - fail - Test assertion failure function syncobj_wait, file ../lib/igt_syncobj.c:229 - Last errno: 62, Timer expired
  • CFL: igt@syncobj_wait@reset-during-wait-for-submit - fail - Last errno: 62, Timer expired : 0 / 70 runs (0.0%)
3 months ago 0 / 70 runs (0.0%)
  • CLOSED/FIXED
  • 3 months ago
  • [CI][BAT] [byt full-ppgtt] igt@gem_exec* - fail - Failed assertion: !"GPU hung"
  • BYT: some igt@gem_exec* tests - fail - Failed assertion: !"GPU hung" : 2 / 255 runs (0.8%)
3 months ago 2 / 255 runs (0.8%)
  • CLOSED/DUPLICATE
  • 3 months ago
  • [CI][DRMTIP] igt@gem_bad_reloc@negative-reloc-render - dmesg-warn - GEM_BUG_ON(!intel_engine_is_idle(engine))
  • ICL: igt@gem_bad_reloc@negative-reloc-render - dmesg-warn - GEM_BUG_ON(!intel_engine_is_idle(engine)) : 0 / 0 runs (0.0%)
3 months ago 0 / 0 runs (0.0%)
  • CLOSED/FIXED
  • 3 months, 2 weeks ago
  • [CI][BAT] igt@drv_selftest@live_contexts - dmesg-warn - RPM wakelock ref not held during HW access
  • BSW: igt@drv_selftest@live_contexts - dmesg-warn - RPM wakelock ref not held during HW access : 0 / 154 runs (0.0%)
3 months ago 0 / 154 runs (0.0%)
  • CLOSED/FIXED
  • 3 months ago
  • [CI][DRMTIP] igt@gem_persistent_relocs@forked-faulting-reloc-thrashing - fail - Failed assertion: test == 0xdeadbeef
  • BYT IVB: igt@gem_persistent_relocs@* - fail - Failed assertion: test == 0xdeadbeef : 0 / 28 runs (0.0%)
3 months ago 0 / 28 runs (0.0%)
  • CLOSED/FIXED
  • 3 months ago
  • [CI][DRMTIP] igt@gem_exec_await@wide-context - fail - __gem_context_create(fd, &ctx_id) == 0
  • ICL: igt@gem_exec_await@wide-context - fail - __gem_context_create(fd, &ctx_id) == 0 : 1 / 16 runs (6.2%)
3 months ago 1 / 16 runs (6.2%)
  • CLOSED/FIXED
  • 3 months, 1 week ago
  • [BAT] igt@drv_selftest@live_hangcheck - dmesg-fail - Failed to idle other inactive engines after device reset
  • CFL GUC: igt@drv_selftest@live_hangcheck - dmesg-fail - Failed to idle other inactive engines after device reset : 8 / 320 runs (2.5%)
3 months, 1 week ago 8 / 320 runs (2.5%)
  • CLOSED/FIXED
  • 3 months, 1 week ago
  • [CI][DRMTIP] igt@* - timeout - Unknown subtest
  • All machines: all tests - timeout - igt_core-WARNING: Unknown subtest : 19 / 101 runs (18.8%)
3 months, 1 week ago 19 / 101 runs (18.8%)
  • CLOSED/WORKSFORME
  • 3 months, 1 week ago
  • [CI][BAT] igt@drm_mm@insert - incomplete - nothing after "drm_mm: Testing DRM range manger (struct drm_mm), with random_seed=0x54c375d max_iterations=8192 max_prime=128"
  • SKL: igt@drm_mm@insert - incomplete - last line "drm_mm: Testing DRM range manger (struct drm_mm), with random_seed=0x... max_iterations=8192 max_prime=128" : 0 / 85 runs (0.0%)
3 months, 1 week ago 0 / 85 runs (0.0%)
  • CLOSED/FIXED
  • 3 months, 2 weeks ago
  • [CI][CI SETUP] fi-skl-6700k2 does not have the right libdrm
  • fi-skl-6700k2: igt@amdgpu* - fail : 0 / 177 runs (0.0%)
3 months, 2 weeks ago 0 / 177 runs (0.0%)
  • CLOSED/WORKSFORME
  • 7 months, 1 week ago
  • [CI] [SNB only] igt@* - dmesg-warn - *ERROR* uncleared pch fifo underrun on pch transcoder A |& *ERROR* PCH transcoder A FIFO underrun
  • fi-snb-2600: dmesg-warn - uncleared pch fifo underrun on pch transcoder A : 0 / 0 runs (0.0%)
3 months, 2 weeks ago 40 / 53 runs (75.5%)
  • CLOSED/DUPLICATE
  • 3 months, 2 weeks ago
  • [CI][BAT] igt@gem_exec_suspend@basic-s3 - incomplete
  • fi-icl-u: igt@gem_exec_suspend@basic-s3 - incomplete : 6 / 116 runs (5.2%)
3 months, 2 weeks ago 6 / 116 runs (5.2%)
  • CLOSED/FIXED
  • 3 months, 3 weeks ago
  • [CI] igt@testdisplay - WARNING: CPU: 1 PID: 1684 at drivers/gpu/drm/i915/intel_display.c:11621 - pipe state doesn't match!
  • fi-cnl-y3: igt@testdisplay - pipe state doesn't match! : 0 / 0 runs (0.0%)
3 months, 2 weeks ago 47 / 47 runs (100.0%)
  • CLOSED/FIXED
  • 4 months, 1 week ago
  • ThinkPad T450 - Broadwell-U: [drm:hsw_disable_ips [i915]] *ERROR* Timed out waiting for IPS disable
  • BDW: all tests - dmesg-warn - *ERROR* Timed out waiting for IPS disable : 1 / 236 runs (0.4%)
3 months, 2 weeks ago 1 / 236 runs (0.4%)
  • CLOSED/WONTFIX
  • 6 months, 3 weeks ago
  • [CI] igt@drm_vma_limiter - dmesg-fail - oom-killer
  • BWR GDG PNV: igt@drm_vma_limiter - oom-killer : 20 / 20 runs (100.0%)
3 months, 2 weeks ago 20 / 20 runs (100.0%)
  • CLOSED/FIXED
  • 3 months, 3 weeks ago
  • [CI] igt@.* - dmesg-warn/dmesg-fail - *ERROR* rcs0: reset request timeout
  • KBL: all tests - dmesg-warn/dmesg-fail - *ERROR* rcs0: reset request timeout : 4 / 1578 runs (0.3%)
3 months, 3 weeks ago 4 / 1578 runs (0.3%)
  • CLOSED/FIXED
  • 3 months, 3 weeks ago
  • [CI][BAT] igt@* - dmesg-warn - Missing case (encoder->hpd_pin == 9)
  • ICL: all tests - dmesg-warn/dmesg-fail - Missing case (encoder->hpd_pin == 9) : 1 / 320 runs (0.3%)
3 months, 3 weeks ago 1 / 320 runs (0.3%)
  • CLOSED/WORKSFORME
  • 3 months, 3 weeks ago
  • [CI] piglit: error: waffle_display_connect failed due to WAFFLE_ERROR_UNKNOWN: open drm file for gbm failed
  • all machines: all tests - fail - waffle_display_connect failed due to WAFFLE_ERROR_UNKNOWN: open drm file for gbm failed : 0 / 2353 runs (0.0%)
3 months, 3 weeks ago 0 / 2353 runs (0.0%)
  • CLOSED/DUPLICATE
  • 3 months ago
  • [CI][BAT] igt@pm_rpm@module-reload - fail - general protection fault: 0000 [#1] PREEMPT SMP PTI
  • BXT: igt@pm_rpm@module-reload - fail / dmesg-fail - general protection fault: 0000 [#1] PREEMPT SMP PTI : 0 / 1 runs (0.0%)
3 months, 3 weeks ago 0 / 1 runs (0.0%)
  • CLOSED/FIXED
  • 3 months, 3 weeks ago
  • [CI] igt@*(suspend|hibernate)* | igt@kms_cursor_crc@* - vblank wait timed out on crtc 0
  • all machines: igt@*(hibernate|suspend)* - vblank wait timed out on crtc [0-2] : 7 / 2741 runs (0.3%)
3 months, 3 weeks ago 7 / 2741 runs (0.3%)
  • CLOSED/FIXED
  • 3 months, 3 weeks ago
  • [CI] igt@drv_module_reload@basic-reload - dmesg-warn - WARNING: CPU: 3 PID: 2670 at sound/hda/hdac_i915.c:429 snd_hdac_i915_exit+0x54/0x80 [snd_hda_core]
  • SKL: igt@drv_module_reload@* - dmesg-warn - WARNING: CPU: 3 PID: 2670 at sound/hda/hdac_i915.c:429 snd_hdac_i915_exit : 4 / 1492 runs (0.3%)
3 months, 3 weeks ago 4 / 1492 runs (0.3%)
  • CLOSED/WORKSFORME
  • 3 months, 4 weeks ago
  • [BAT] igt@gem_sync@basic-many-each - incomplete - softdog
  • BDW: igt@gem_sync@basic-many-each - incomplete : 0 / 965 runs (0.0%)
3 months, 4 weeks ago 0 / 965 runs (0.0%)
  • CLOSED/WORKSFORME
  • 3 months, 4 weeks ago
  • [CI] igt@testdisplay - incomplete - softdog
  • GLK: igt@testdisplay - softdog incomplete : 220 / 420 runs (52.4%)
3 months, 4 weeks ago 220 / 420 runs (52.4%)
  • CLOSED/FIXED
  • 3 months, 4 weeks ago
  • [CI] igt@gem_linear_blits@normal - fail - Failed assertion: linear[i] == val
  • GDG: igt@gem_linear_blits@normal - fail - Failed assertion: linear[i] == val : 0 / 51 runs (0.0%)
3 months, 4 weeks ago 0 / 51 runs (0.0%)
  • CLOSED/WORKSFORME
  • 3 months, 4 weeks ago
  • [CI] igt@gem_* - dmesg-warn - ODEBUG: free active (active state 0) object type: hrtimer hint: hrtimer_wakeup
  • BXT SKL KBL CFL CNL: all test - dmesg-warn - ODEBUG: free active (active state 0) object type: hrtimer hint : 3 / 2049 runs (0.1%)
3 months, 4 weeks ago 3 / 2049 runs (0.1%)
  • CLOSED/FIXED
  • 3 months, 4 weeks ago
  • [CI][DRMTIP] igt@kms_psr@cursor_plane_onoff - fail - Failed assertion: psr_active(data->drm_fd, false), Last errno: 25, Inappropriate ioctl for device
  • CNL PSR2: igt@kms_psr@{suspend|cursor_plane_onoff) - fail - Failed assertion: psr_active(data->drm_fd, false), Last errno: 25, Inappropriate ioctl for device : 5 / 10 runs (50.0%)
3 months, 4 weeks ago 5 / 10 runs (50.0%)
  • CLOSED/FIXED
  • 4 months ago
  • [CI][BAT] igt@* - fail / dmesg-fail - RIP: 0010:drm_debugfs_init
  • All machines: random tests - fail / dmesg-fail - RIP: 0010:drm_debugfs_init : 0 / 3 runs (0.0%)
4 months ago 0 / 3 runs (0.0%)
  • CLOSED/FIXED
  • 4 months ago
  • [CI] igt@pm_rps@min-max-config-idle - fail - Failed assertion: igt_wait_helper(&lh.igt_proc) == 0
  • HSW: igt@pm_rps@min-max-config-idle - fail - Failed assertion: igt_wait_helper(&lh.igt_proc) == 0 : 0 / 791 runs (0.0%)
4 months ago 0 / 791 runs (0.0%)
  • CLOSED/INVALID
  • 4 months ago
  • [BAT] igt@gem_eio@(reset-stress|wait-10ms|wait-1us) - fail - Failed assertion: elapsed < 250e6
  • All machines: igt@gem_eio@(reset-stress|wait-10ms|wait-1us) - fail - Failed assertion: elapsed < 250e6 : 0 / 167 runs (0.0%)
4 months ago 0 / 167 runs (0.0%)
  • CLOSED/WORKSFORME
  • 4 months ago
  • [CI] igt@gem_eio@suspend - dmesg-fail - Failed to idle engines, declaring wedged!
  • GLK: igt@gem_eio@suspend - dmesg-fail - Failed to idle engines, declaring wedged! : 0 / 743 runs (0.0%)
4 months ago 0 / 743 runs (0.0%)
  • CLOSED/INVALID
  • 5 months, 2 weeks ago
  • [CI] igt@kms_frontbuffer_tracking@basic - softdog
  • BSW: igt@kms_frontbuffer_tracking@basic - incomplete : 0 / 1442 runs (0.0%)
4 months ago 0 / 1442 runs (0.0%)
  • CLOSED/FIXED
  • 4 months ago
  • [CI][DRMTIP] igt@kms_vblank@pipe-a-wait-busy-hang - fail - Failed assertion: __gem_execbuf_wr(fd, execbuf) == 0 / error: -5 != 0
  • GVT-d: igt@kms_vblank@pipe-a-wait-busy-hang - fail - Failed assertion: __gem_execbuf_wr\(fd, execbuf\) == 0 / error: -5 != 0 : 0 / 14 runs (0.0%)
4 months ago 0 / 14 runs (0.0%)
  • CLOSED/WORKSFORME
  • 3 months, 1 week ago
  • [CI][SKL+] kms_draw_crc, kms_flip,tiling,... - igt_debugfs-DEBUG: CRC mismatch at index 0:
  • SKL+: igt@kms_draw_crc@draw-method-xrgb*-render-* kms_flip_tiling_flip-* kms_plane@pixel-format-pipe-* kms_pwrite_crc - fail - Failed assertion: !mismatch : 0 / 126 runs (0.0%)
4 months ago 0 / 126 runs (0.0%)
  • CLOSED/DUPLICATE
  • 4 months, 1 week ago
  • [CI][BAT] igt@gem_exec_suspend@basic-s3 - dmesg-warn - WARN_ON(!intel_pstate->base.fb)
  • ICL: igt@gem_exec_suspend@basic-s3 - dmesg-warn - WARN_ON(!intel_pstate->base.fb) : 4 / 99 runs (4.0%)
4 months, 1 week ago 4 / 99 runs (4.0%)
  • CLOSED/DUPLICATE
  • 4 months, 1 week ago
  • [CI] [BLB only] igt@* - incomplete - Shard took too long
  • BLB: igt@* - incomplete - Build timed out (after 19 minutes). Marking the build as aborted. : 0 / 0 runs (0.0%)
4 months, 1 week ago 0 / 32 runs (0.0%)
  • CLOSED/DUPLICATE
  • 3 months ago
  • [CI][DRMTIP] igt@pm_backlight@fade_with_suspend - fail - Failed assertion: result >= max(0, val - tolerance) && result <= min(context->max, val + tolerance)
  • ALL: igt@pm_backlight@fade_with_suspend - fail - Failed assertion: result >= max(0, val - tolerance) && result <= min(context->max, val + tolerance) : 0 / 2 runs (0.0%)
4 months, 1 week ago 0 / 2 runs (0.0%)
  • CLOSED/WORKSFORME
  • 2 months, 2 weeks ago
  • [CI][DRMTIP] igt@kms_chv_cursor_fail@pipe-[abc]-* - dmesg-warn - *ERROR* Overflow of CRC buffer, userspace reads too slow.
  • CFL: igt@kms_chv_cursor_fail@pipe-[abc]-* - dmesg-warn - *ERROR* Overflow of CRC buffer, userspace reads too slow. : 0 / 0 runs (0.0%)
4 months, 1 week ago 0 / 0 runs (0.0%)
  • CLOSED/FIXED
  • 4 months, 1 week ago
  • [CI]gem_mmap_gtt/coherency failing assertion cpu[x] == i
  • igt@gem_mmap_gtt@coherency - Failed assertion: cpu[x] == i : 685 / 1027 runs (66.7%)
  • igt@prime_vgem@coherency-gtt - Failed assertion: gtt[1024*i] == ~i : 699 / 1027 runs (68.1%)
4 months, 1 week ago 699 / 1027 runs (68.1%)
  • CLOSED/FIXED
  • 4 months, 1 week ago
  • [CI] igt@perf_pmu@busy-accuracy-* - fail - Failed assertion: (double)(busy_r) <= (1.0 + (0.15)) * (double)((double)target_busy_pct / 100.0) && (double)(busy_r) >= (1.0 - (0.15)) * (double)((double)target_busy_pct / 100.0)
  • BSW BXT APL KBL GLK CFL CNL: igt@perf_pmu@* - Failed assertion: (double)(100.0 * busy_r) <= ((double)(100.0 * expected) + (2)) && ... : 2 / 95 runs (2.1%)
  • shard-(apl|glk): igt@perf_pmu@busy-accuracy-* - Failed assertion: (double)(busy_r) <= (1.0 + (0.15)) * (double)((double)target_busy_pct / 100.0) &&... : 0 / 913 runs (0.0%)
  • shard-(apl|glk): igt@perf_pmu@busy-accuracy-.* - Failed assertion: (double)(1 - busy_r) <= (1.0 + (0.15)) * ... : 0 / 913 runs (0.0%)
  • shard-(apl|glk): igt@perf_pmu@busy-accuracy-.* - Failed assertion: (double)(busy_r) <= (1.0 + (0.15)) * ... : 0 / 913 runs (0.0%)
  • shard-(kbl|glk) skl glk bsw kbl: igt@perf_pmu@busy-accuracy-*: Failed assertion: (double)(100.0 * busy_r) <= ((double)(100.0 * expected)... : 73 / 995 runs (7.3%)
4 months, 1 week ago 87 / 1061 runs (8.2%)
  • CLOSED/WORKSFORME
  • 4 months, 1 week ago
  • [CI] igt@perf_pmu@busy-vcs0 - fail - Failed assertion: (double)(val) <= (1.0 + (tolerance)) * (double)(flags & (1) ? slept : 0.f) && (double)(val) >= (1.0 - (tolerance)) * (double)(flags & (1) ? slept : 0.f)
  • snb fi-ivb-*: igt@perf_pmu@.* - Failed assertion: (double)(val) <= (1.0 + (tolerance)) * (double)(flags & (1) ? slept : 0.f) &&... : 34 / 995 runs (3.4%)
4 months, 1 week ago 41 / 1010 runs (4.1%)
  • CLOSED/INVALID
  • 4 months, 1 week ago
  • [CI] igt@gem_exec_* - fail - Failed assertion: !"GPU hung"
  • SNB+: igt@gem_exec_* - Failed assertion: !"GPU hung" : 47 / 1874 runs (2.5%)
4 months, 1 week ago 47 / 1875 runs (2.5%)
  • CLOSED/FIXED
  • 4 months, 1 week ago
  • [CI][BAT] igt@drv_selftest@live_hangcheck - igt_reset_engines failed with error
4 months, 1 week ago 0 / 1 runs (0.0%)
  • CLOSED/DUPLICATE
  • 7 months ago
  • [CI][CFL only] igt@kms_*@*suspend* - dmesg-warn - Delta way too big! 18446743856563626466 ts=18446744054496180323 write stamp = 197932553857 - WARNING: CPU: 0 PID: 1596 at kernel/trace/ring_buffer.c:2640 rb_handle_timestamp.isra.33+0x6c/0x70
  • fi-cfl-s3: all tests - Delta way too big! : 78 / 1686 runs (4.6%)
4 months, 1 week ago 87 / 1718 runs (5.1%)
  • CLOSED/FIXED
  • 4 months, 1 week ago
  • [CI] igt@* - dmesg-warn - RPM wakelock ref not held during HW access - drivers/gpu/drm/i915/intel_drv.h:1926 fwtable_read32
  • fi-skl-guc: all tests - dmesg-warn - RPM wakelock ref not held during HW access : 48 / 1563 runs (3.1%)
4 months, 1 week ago 55 / 1588 runs (3.5%)
  • CLOSED/DUPLICATE
  • 7 months ago
  • [CI guc] incomplete - Softdog - kernel BUG at drivers/gpu/drm/i915/intel_breadcrumbs.c:219!
  • fi-skl-guc: igt@gem_(eio|exec_reloc)@* - incomplete - Softdog - kernel BUG at drivers/gpu/drm/i915/intel_breadcrumbs.c:219! : 66 / 1563 runs (4.2%)
4 months, 1 week ago 80 / 1588 runs (5.0%)
  • CLOSED/WORKSFORME
  • 3 months, 2 weeks ago
  • [CI] igt@pm_rpm@* - Failed assertion: wait_for_suspended()
  • fi-bsw-n3050: igt@pm_rpm@.* - Failed assertion: wait_for_suspended() : 1 / 1679 runs (0.1%)
4 months, 1 week ago 3 / 1696 runs (0.2%)
  • CLOSED/DUPLICATE
  • 9 months ago
  • [CI] igt@gem_tiled_partial_pwrite_pread@writes-* - Failed assertion: compare_tmp[j] == tmp[0]
  • fi-gdg-551: igt@gem_tiled_partial_pwrite_pread@writes-after-reads - Failed assertion: compare_tmp[j] == tmp[0] : 18 / 81 runs (22.2%)
4 months, 1 week ago 22 / 88 runs (25.0%)
  • CLOSED/FIXED
  • 5 months, 2 weeks ago
  • [CI] igt@kms_frontbuffer_tracking@* - Test assertion failure function get_sink_crc, Failed assertion: rc != -1
  • fi-skl-6700hq: all tests - Test assertion failure function get_sink_crc, Failed assertion: rc != -1 : 18 / 1638 runs (1.1%)
4 months, 1 week ago 20 / 1651 runs (1.2%)
  • CLOSED/DUPLICATE
  • 6 months, 4 weeks ago
  • [CI] igt@kms_frontbuffer_tracking@psr* - fail - Test assertion failure function intel_batchbuffer_flush_on_ring - Failed assertion: (drm_intel_gem_bo_context_exec(batch->bo, ctx, used, ring)) == 0
  • SKL KBL: igt@(kms_frontbuffer_tracking@*|gem_unfence_active_buffers) - fail - Failed assertion: (drm_intel_gem_bo_context_exec(batch->bo, ctx, used, ring)) == 0 : 23 / 1559 runs (1.5%)
4 months, 1 week ago 23 / 1559 runs (1.5%)
  • CLOSED/DUPLICATE
  • 9 months ago
  • [CI] igt@kms_vblank@pipe-[b|c]-wait-forked-hang | igt@gem_eio@in-flight-suspend - fail - Test assertion failure function gem_execbuf - Failed assertion: __gem_execbuf(fd, execbuf) == 0
  • SKL KBL: igt@* - fail - Failed assertion: __gem_execbuf(fd, execbuf) == 0 : 246 / 2044 runs (12.0%)
4 months, 1 week ago 246 / 2044 runs (12.0%)
  • CLOSED/DUPLICATE
  • 7 months ago
  • [CI] igt@gem_eio@in-flight-internal-10ms - fail - Test assertion failure function igt_force_gpu_reset - Failed assertion: !wedged
  • SKL KBL: igt@gem_eio@in-flight-* - dmesg-fail - "Failed to reset chip" and "Failed assertion: !wedged" : 1 / 586 runs (0.2%)
4 months, 1 week ago 1 / 586 runs (0.2%)
  • CLOSED/INVALID
  • 4 months, 1 week ago
  • [CI] igt@kms_* - fail - Timed out: Opening crc fd, which waits for first CRC.
  • all machines : all tests - Timed out: Opening crc fd, which waits for first CRC. : 44 / 676 runs (6.5%)
4 months, 1 week ago 44 / 676 runs (6.5%)
  • CLOSED/WORKSFORME
  • 4 months, 1 week ago
  • [CI] igt@* - fail - perf: ../lib/rendercopy_gen9.c:178: gen6_render_flush: Assertion `ret == 0' failed. Received signal SIGABRT.
  • SKL KBL: igt@* - fail / dmesg-fail - gen6_render_flush: Assertion `ret == 0' failed. : 4 / 635 runs (0.6%)
  • SKL KBL: igt@perf@invalid-oa-metric-set-id - fail - Last errno: 5, Input/output error : 3 / 573 runs (0.5%)
4 months, 1 week ago 7 / 887 runs (0.8%)
  • CLOSED/WORKSFORME
  • 4 months, 3 weeks ago
  • [CI] igt@pm_rpm@universal-planes-dpms - dmesg-fail - Failed assertion: drmModeConnectorSetProperty(fd, connector->connector_id, dpms, mode) == 0 && *ERROR* Link Training Unsuccessful
  • LSPCON: all - Failed assertion: drmModeConnectorSetProperty(...) && *ERROR* Link Training Unsuccessful : 0 / 1461 runs (0.0%)
4 months, 1 week ago 0 / 1461 runs (0.0%)
  • CLOSED/DUPLICATE
  • 7 months ago
  • [CI] igt@pm_rpm@system-suspend - incomplete - task modprobe blocked for more than 60 seconds.
  • fi-bsw-n3050: igt@pm_rpm@system-suspend - incomplete - task modprobe blocked for more than 60 seconds. : 0 / 72 runs (0.0%)
4 months, 1 week ago 0 / 72 runs (0.0%)
  • CLOSED/FIXED
  • 8 months ago
  • [CI] igt@drv_selftest@live_gtt - dmesg-fail - drv_selftest invoked oom-killer
  • APL: igt@drv_selftest@live_gtt - dmesg-fail - drv_selftest invoked oom-killer : 1 / 447 runs (0.2%)
4 months, 1 week ago 1 / 454 runs (0.2%)
  • CLOSED/FIXED
  • 5 months, 2 weeks ago
  • [CI] igt@* - dmesg-warn - RPM wakelock ref not held during HW access
  • GUC: all tests - dmesg-warn - RPM wakelock ref not held during HW access : 32 / 1409 runs (2.3%)
4 months, 1 week ago 32 / 1409 runs (2.3%)
  • CLOSED/DUPLICATE
  • 7 months ago
  • [CI] ODEBUG: free active (active state 0) object type: timer_list hint: process_timeout+0x0/0x10
  • fi-bsw-n3050: random tests - incomplete : 0 / 48 runs (0.0%)
4 months, 1 week ago 0 / 48 runs (0.0%)
  • CLOSED/WORKSFORME
  • 4 months, 1 week ago
  • [CI] igt@drv_suspend@debugfs-reader - dmesg-warn - WARN_ON(!intel_guc_log_relay_enabled(log))
  • GUC: igt@drv_suspend@debugfs-reader* - dmesg-warn - WARN_ON(!intel_guc_log_relay_enabled(log)) : 0 / 46 runs (0.0%)
4 months, 1 week ago 0 / 46 runs (0.0%)
  • CLOSED/WORKSFORME
  • 4 months, 1 week ago
  • [CI] igt@gem_persistent_relocs@forked-faulting-reloc-thrashing - fail - Failed assertion: __gem_execbuf(fd, execbuf) == 0
  • BYT BSW: igt@gem_persistent_relocs@forked-faulting-reloc-thrashing - fail - Failed assertion: __gem_execbuf(fd, execbuf) == 0 : 64 / 1129 runs (5.7%)
4 months, 1 week ago 64 / 1129 runs (5.7%)
  • RESOLVED/INSUFFICIENT_DATA
  • 4 months, 1 week ago
  • include/trace/events/timer.h:290 suspicious rcu_dereference_check() usage!
  • CNL: igt@.*(s3|suspend).* - dmesg-warn - include/trace/events/timer.h:290 suspicious rcu_dereference_check() usage! : 0 / 564 runs (0.0%)
4 months, 1 week ago 0 / 564 runs (0.0%)
  • CLOSED/FIXED
  • 4 months, 1 week ago
  • [CI] igt@drv_selftest@live_hangcheck - igt_reset_engines failed with error
  • KBL APL GLK: igt@drv_selftest@live_hangcheck - dmesg-fail - Failed to switch back to kernel context; declaring wedged : 80 / 847 runs (9.4%)
4 months, 1 week ago 80 / 847 runs (9.4%)
  • CLOSED/WORKSFORME
  • 6 months ago
  • [CI][SNB,BYT,HSW] intel_hangcheck_live_selftests: igt_wait_reset failed with error -5
  • SNB,BYT,HSW: IGT igt@drv_selftest@live_hangcheck - igt_wait_reset failed with error -5 : 2 / 810 runs (0.2%)
4 months, 1 week ago 2 / 810 runs (0.2%)
  • CLOSED/DUPLICATE
  • 6 months ago
  • [CI][SKL][IOMMU] drv_selftests fail with i915: probe of 0000:00:02.0 failed with error -5
  • SKL-IOMMU: igt@drv_selftests@live_ - igt_kmod-WARNING: probe of 0000:00:02.0 failed with error -5 : 95 / 371 runs (25.6%)
  • SKL-IOMMU: igt@drv_selftests@live_ - i915: probe of 0000:00:02.0 failed with error -5 : 85 / 371 runs (22.9%)
4 months, 1 week ago 109 / 371 runs (29.4%)
  • CLOSED/DUPLICATE
  • 6 months ago
  • [CI][SHARDS] igt@drv_selftest@live_gtt - dmesg-fail - list_add corruption. prev->next should be next (ffff88026a788a90), but was 6b6b6b6b6b6b6b6b.
  • KBL: igt@drv_selftest@live_gtt - dmesg-fail - list_add corruption. prev->next should be next (ffff88026a788a90), but was 6b6b6b6b6b6b6b6b. : 0 / 749 runs (0.0%)
4 months, 1 week ago 0 / 749 runs (0.0%)
  • CLOSED/DUPLICATE
  • 5 months, 4 weeks ago
  • [CI][BAT] igt@drv_selftest@live_workarounds - incomplete - softdog
  • All machines: igt@drv_selftest@live_workarounds - incomplete : 7 / 733 runs (1.0%)
4 months, 1 week ago 7 / 733 runs (1.0%)
  • CLOSED/FIXED
  • 3 months ago
  • [CI][DRMTIP] igt@drv_suspend@sysfs-reader - incomplete - killed by softdog
  • KBL CFL WHL: igt@drv_suspend@sysfs-reader - incomplete : 9 / 328 runs (2.7%)
4 months, 1 week ago 9 / 328 runs (2.7%)
  • CLOSED/FIXED
  • 4 months, 1 week ago
  • [CI][BAT] igt@pm_rpm@basic - fail - Failed assertion: wait_for_suspended()
  • BYT: igt@pm_rpm@basic-* - fail - Failed assertion: wait_for_suspended() : 88 / 328 runs (26.8%)
4 months, 1 week ago 88 / 328 runs (26.8%)
  • CLOSED/FIXED
  • 5 months, 2 weeks ago
  • [CI][DRMTIP] igt@drv_suspend@debugfs-reader - dmesg-warn - *ERROR* dpcd read failed (-110)
  • SKL: igt@*debugfs-read* - dmesg-warn - *ERROR* dpcd read (15 bytes at 0) failed (-110) : 0 / 11 runs (0.0%)
4 months, 1 week ago 0 / 11 runs (0.0%)
  • CLOSED/FIXED
  • 4 months, 1 week ago
  • [CI][BAT] igt@drv_selftest@live_coherency - dmesg-fail - Value[9/31] mismatch, (overwrite with gtt) wrote [gpu] fcf5ab91 read [cpu] 30a546e (inverse 30a546e), at offset cc
  • BYT: igt@drv_selftest@live_coherency - : 0 / 206 runs (0.0%)
4 months, 1 week ago 0 / 206 runs (0.0%)
  • CLOSED/WORKSFORME
  • 4 months, 1 week ago
  • [CI][BAT] igt@pm_rpm@module-reload - fail - Could not unload i915
  • HSW+ igt@pm_rpm@module-reload - fail - Failed assertion: igt_i915_driver_load("disable_display=1") == 0 : 0 / 144 runs (0.0%)
  • HSW+ igt@pm_rpm@module-reload - fail - igt_kmod-WARNING: Could not unload i915 : 0 / 144 runs (0.0%)
4 months, 1 week ago 0 / 144 runs (0.0%)
  • CLOSED/WORKSFORME
  • 4 months, 1 week ago
  • [CI][BAT] igt@pm_rpm@module-reload igt_pm-WARNING: Failed to enable audio runtime PM!
  • ALL igt@pm_rpm@module-reload - warn - igt_pm-WARNING: Failed to enable audio runtime PM! : 95 / 130 runs (73.1%)
4 months, 1 week ago 95 / 130 runs (73.1%)
  • CLOSED/WORKSFORME
  • 4 months, 1 week ago
  • [BAT] PM tests - fail/warn - Failed to enable audio runtime PM!
  • All machines: PM tests - Failed to enable audio runtime PM! : 61 / 198 runs (30.8%)
4 months, 1 week ago 61 / 198 runs (30.8%)
  • CLOSED/FIXED
  • 4 months, 1 week ago
  • [CI][DRMTIP] igt@kms_* - dmesg-warn - mismatch in pixel_rate (expected 297000, found 594000)
  • ICL: igt@kms_hdmi_inject@|kms_3d)* - dmesg-warn / dmesg-fail - mismatch in pixel_rate : 5 / 6 runs (83.3%)
4 months, 1 week ago 5 / 6 runs (83.3%)
  • CLOSED/FIXED
  • 4 months, 1 week ago
  • [CI][DRMTIP] igt@gem_exec_parallel@blt-fds - fail - Failed assertion: map[i] == i
  • BYT: igt@gem_exec_parallel@blt-fds - fail - Failed assertion: map[i] == i : 0 / 63 runs (0.0%)
4 months, 1 week ago 0 / 63 runs (0.0%)
  • CLOSED/FIXED
  • 4 months, 1 week ago
  • [CI][DRMTIP] igt@pm_backlight@fade_with_dpms - fail - Failed assertion: igt_wait_for_pm_status(IGT_RUNTIME_PM_STATUS_SUSPENDED)
  • ICL: igt@pm_backlight@fade_with_dpms - fail - Failed assertion: igt_wait_for_pm_status(IGT_RUNTIME_PM_STATUS_SUSPENDED) : 0 / 2 runs (0.0%)
4 months, 1 week ago 0 / 2 runs (0.0%)
  • CLOSED/FIXED
  • 4 months, 1 week ago
  • [CI][DRMTIP] igt@pm_backlight@fade_with_suspend - fail - Failed assertion: n_read >= 0
  • All machines: igt@pm_backlight@fade_with_suspend - fail - Failed assertion: n_read >= 0 : 2 / 51 runs (3.9%)
4 months, 1 week ago 2 / 51 runs (3.9%)
  • CLOSED/FIXED
  • 4 months, 1 week ago
  • [CI][DRMTIP] igt@kms_frontbuffer_tracking@ - incomplete - BUG: unable to handle kernel NULL pointer dereference at 0000000000000080 in intel_psr_set_debugfs_mode
  • PSR2 ICL: random psr/fbc tests - incomplete : 0 / 4 runs (0.0%)
4 months, 1 week ago 0 / 4 runs (0.0%)
  • CLOSED/FIXED
  • 4 months, 1 week ago
  • [CI][DRMTIP] igt@pm_backlight@fade_with_dpms - fail - Failed assertion: has_runtime_pm
  • IVBm SNBm: igt@pm_backlight@fade_with_dpms - fail - Failed assertion: has_runtime_pm : 4 / 5 runs (80.0%)
4 months, 1 week ago 4 / 5 runs (80.0%)
  • RESOLVED/UNREPRODUCIBLE
  • 4 months, 1 week ago
  • BUG: sleeping function called from invalid context at arch/x86/mm/fault.c:1342
  • All machines: all tests - BUG: sleeping function called from invalid context at arch/x86/mm/fault.c:1342 : 0 / 1868 runs (0.0%)
4 months, 1 week ago 0 / 1867 runs (0.0%)
  • CLOSED/DUPLICATE
  • 3 months, 2 weeks ago
  • [CI] igt@perf@short-reads - fail - Test assertion failure function test_short_reads, Failed assertion: ret == -1
  • GUC: igt@perf@short-reads - fail - Test assertion failure function test_short_reads, Failed assertion: ret == -1 : 0 / 38 runs (0.0%)
4 months, 1 week ago 0 / 38 runs (0.0%)
  • CLOSED/FIXED
  • 4 months, 2 weeks ago
  • [CI][BAT] igt@pm_rpm@module-reload - fail - Failed assertion: is_i915_device(fd)
  • VEGA M: igt@pm_rpm@module-reload - fail - Failed assertion: is_i915_device(fd) : 0 / 25 runs (0.0%)
4 months, 2 weeks ago 0 / 25 runs (0.0%)
  • CLOSED/WORKSFORME
  • 4 months, 2 weeks ago
  • [BAT] igt@pm_rpm@(debugfs-read|module-reload) - dmesg-fail / dmesg-warn - Unclaimed access detected prior to suspending
  • BSW: igt@pm_rpm@(debugfs-read|module-reload) - dmesg-fail / dmesg-warn - Unclaimed access detected prior to suspending : 0 / 1 runs (0.0%)
4 months, 2 weeks ago 0 / 1 runs (0.0%)
  • CLOSED/DUPLICATE
  • 2 months, 3 weeks ago
  • [CI][BAT] igt@drv_selftest@live_coherency - dmesg-warn - Unclaimed read from register 0x44018
  • BYT: igt@drv_selftest@live_coherency - dmesg-warn - Unclaimed read from register 0x44018 : 0 / 0 runs (0.0%)
4 months, 2 weeks ago 0 / 0 runs (0.0%)
  • CLOSED/DUPLICATE
  • 3 months ago
  • [CI][DRMTIP] igt@gem_exec_await@wide-contexts - fail - Failed assertion: !"GPU hung"
  • WHL: igt@gem_exec_await@wide-contexts - fail - Failed assertion: !"GPU hung" : 0 / 0 runs (0.0%)
4 months, 2 weeks ago 0 / 0 runs (0.0%)
  • CLOSED/FIXED
  • 4 months, 1 week ago
  • [CI] igt@drv_selftest@live_hangcheck - igt_reset_engines failed with error
  • All machines: igt@drv_selftest@live_hangcheck - dmesg-fail - i915/intel_hangcheck_live_selftests: igt_reset_engines failed with error -5 : 115 / 669 runs (17.2%)
4 months, 2 weeks ago 115 / 669 runs (17.2%)
  • CLOSED/FIXED
  • 6 months ago
  • [CI][GUC] drv_selftest@live_guc RIP: 0010:destroy_doorbell
  • GUC: igt@drv_selftest@live_guc - RIP: 0010:destroy_doorbell+ : 6 / 721 runs (0.8%)
4 months, 2 weeks ago 6 / 721 runs (0.8%)
  • CLOSED/FIXED
  • 6 months ago
  • [CI][GUC][SKL,KBL] drv_selftests@live_sanity
  • SKL|KBL-GUC: drv_selftests@live_sanitycheck - dmesg-fail RIP: 0010:plist_check_prev_next : 22 / 801 runs (2.7%)
4 months, 2 weeks ago 22 / 801 runs (2.7%)
  • CLOSED/FIXED
  • 6 months ago
  • [CI][GDG] i915 drv_selftest@live_contexts fail with igt_ctx_exec failed with error -19
  • GDG: igt@drv_selftest@live_contexts - i915/i915_gem_context_live_selftests: igt_ctx_exec failed with error -19 : 1 / 790 runs (0.1%)
4 months, 2 weeks ago 1 / 790 runs (0.1%)
  • CLOSED/WORKSFORME
  • 4 months, 2 weeks ago
  • [CI] igt@kms_chamelium@dp-frame-dump - Chamelium frame dump didn't match reference image
  • fi-kbl-7500u: igt@kms_chamelium@dp-frame-dump - Chamelium frame dump didn't match reference image : 0 / 58 runs (0.0%)
4 months, 2 weeks ago 0 / 58 runs (0.0%)
  • CLOSED/WORKSFORME
  • 4 months, 2 weeks ago
  • [CI][GLK] Ubuntu 18.04 (pre-release) fails piglit variable-indexing tests
  • pig-glk-j4005: piglit's *variable-indexing* + extra - fail : 56 / 56 runs (100.0%)
4 months, 2 weeks ago 52 / 52 runs (100.0%)
  • CLOSED/FIXED
  • 5 months, 2 weeks ago
  • [CI][BAT] igt@drv_selftest@live_hangcheck - dmesg-fail - GEM_BUG_ON(!execlists_is_active(execlists, 0))
  • CFL WHL: igt@drv_selftest@live_hangcheck - dmesg-fail - GEM_BUG_ON(!execlists_is_active(execlists, 0)) : 0 / 279 runs (0.0%)
4 months, 2 weeks ago 0 / 279 runs (0.0%)
  • CLOSED/WORKSFORME
  • 4 months, 2 weeks ago
  • [CI] igt@kms_cursor_crc@* - Failed CRC mismatch
  • shard-(apl|glk): igt@kms_cursor_crc@* - Failed CRC mismatch : 6 / 878 runs (0.7%)
4 months, 2 weeks ago 6 / 930 runs (0.6%)
  • CLOSED/WORKSFORME
  • 4 months, 2 weeks ago
  • [CI][SNB] glsl-1.40 and 1.50 texturesize / geometry tests failing
  • Piglit-snb: spec@glsl-1.40@execution@texturesize, spec@glsl-1.50@execution@geometry : 0 / 0 runs (0.0%)
4 months, 2 weeks ago 0 / 0 runs (0.0%)
  • CLOSED/FIXED
  • 4 months, 2 weeks ago
  • [BAT] [CFL only]igt@kms_* - dmesg-warn - *ERROR* Link Training Unsuccessful | *ERROR* LSPCON mode hasn't settled | *ERROR* Error reading LSPCON mode
  • fi-cfl-s2/3: all tests - "LSPCON mode hasn't settled" then "failed to enable link training" : 3 / 1648 runs (0.2%)
  • fi-cfl-s2/3: all tests - *ERROR* Link Training Unsuccessful : 5 / 1648 runs (0.3%)
  • fi-cfl-s3: igt@kms_flip@(2x-)flip-vs-absolute-wf_vblank(-interruptible) - dmesg-warn - *ERROR* LSPCON mode hasn't settled : 0 / 78 runs (0.0%)
  • fi-cfl-s2/3: all tests - *ERROR* LSPCON resume failed : 3 / 1648 runs (0.2%)
4 months, 2 weeks ago 8 / 1680 runs (0.5%)
  • CLOSED/WORKSFORME
  • 6 months, 3 weeks ago
  • [BAT][PNV,BLB] i915_reset_device timed out, cancelling all in-flight rendering. provokes a dmesg-warn
  • [BLB,PNV,CTG] i915_reset_device timed out, cancelling all in-flight rendering. : 1160 / 1797 runs (64.6%)
4 months, 2 weeks ago 1160 / 1797 runs (64.6%)
  • CLOSED/FIXED
  • 5 months, 2 weeks ago
  • [CI] igt@kms_psr_sink_crc@* - fail - Test assertion failure function assert_or_manual - Failed assertion: igt_interactive_debug || condition
  • PSR PSR2: igt@kms_psr_sink_crc@* - Failed assertion: igt_interactive_debug || condition : 18 / 684 runs (2.6%)
4 months, 2 weeks ago 18 / 684 runs (2.6%)
  • CLOSED/FIXED
  • 5 months, 2 weeks ago
  • [CI] igt@kms_frontbuffer_tracking@*psr* - fail - Failed assertion: !psr_is_enabled() - PSR still enabled
  • PSR PSR2: igt@kms_frontbuffer_tracking@(fbc)?psr-* - Failed assertion: !psr_is_enabled\(\)\n[^\n]*PSR still enabled : 1 / 15 runs (6.7%)
4 months, 2 weeks ago 1 / 15 runs (6.7%)
  • CLOSED/FIXED
  • 6 months ago
  • [CI] igt@drv_selftest@live_gtt - fail
  • BXT SKL KBL APL GLK: igt@drv_selftest@live_gtt - fail : 0 / 641 runs (0.0%)
4 months, 2 weeks ago 0 / 641 runs (0.0%)
  • CLOSED/NOTABUG
  • 4 months, 4 weeks ago
  • [CI][SKL][IOMMU] i915: probe of 0000:00:02.0 failed with error -25
  • SKL-IOMMU: igt@drv_selftest@live_ - i915: probe of 0000:00:02.0 failed with error -25 : 299 / 340 runs (87.9%)
4 months, 2 weeks ago 299 / 340 runs (87.9%)
  • CLOSED/DUPLICATE
  • 4 months, 3 weeks ago
  • [CI] igt@kms_frontbuffer_tracking@* - fail - FBC disabled: FIFO underrun
  • All machines: all tests - FBC disabled: FIFO underrun : 41 / 2513 runs (1.6%)
4 months, 2 weeks ago 50 / 2562 runs (2.0%)
  • CLOSED/FIXED
  • 4 months, 3 weeks ago
  • [CI][BAT] igt@drv_selftest@live_hugepages - dmesg-fail - igt_ppgtt_internal_huge failed with error -22
  • BYT: igt@drv_selftest@live_hugepages - dmesg-fail - igt_ppgtt_internal_huge failed with error -22 : 0 / 171 runs (0.0%)
4 months, 2 weeks ago 0 / 171 runs (0.0%)
  • CLOSED/FIXED
  • 4 months, 3 weeks ago
  • [CI] igt@gem_exec_schedule@deep-* - fail - Failed assertion: __vgem_fence_signal(fd, fence) == 0
  • BSW BXT SKL GLK: igt@gem_exec_schedule@deep-* - fail - Failed assertion: __vgem_fence_signal(fd, fence) == 0 : 0 / 285 runs (0.0%)
4 months, 2 weeks ago 0 / 285 runs (0.0%)
  • CLOSED/FIXED
  • 4 months, 3 weeks ago
  • [CI][CFL] Occasional hang in drv_selftest@live_workarounds
  • CFL-8109u: igt@drv_selftests@live_workarounds - incomplete : 5 / 302 runs (1.7%)
4 months, 2 weeks ago 5 / 302 runs (1.7%)
  • CLOSED/FIXED
  • 4 months, 3 weeks ago
  • [BAT] igt@drv_selftest@live_hangcheck - incomplete - kernel BUG at drivers/gpu/drm/i915/intel_lrc.c:1040
  • SKL KBL GLK: igt@drv_selftest@live_hangcheck - incomplete : 1 / 665 runs (0.2%)
4 months, 2 weeks ago 1 / 665 runs (0.2%)
  • CLOSED/FIXED
  • 4 months, 3 weeks ago
  • [BAT] igt@drv_selftest@live_workarounds - WARN_ON(i915->gt.awake)
  • BSW SKL KBL CFL WHL: igt@drv_selftest@live_workarounds - dmesg-fail - WARN_ON(i915->gt.awake) : 0 / 590 runs (0.0%)
4 months, 2 weeks ago 0 / 590 runs (0.0%)
  • CLOSED/FIXED
  • 5 months, 2 weeks ago
  • [CI][SHARDS] igt@gem_exec_schedule@preempt-hang-* - dmesg-fail - Failed assertion: ptr[0] == n + 1
  • SKL KBL BXT APL GLK CFL WHL: igt@gem_exec_schedule@preempt-hang-* - dmesg-fail - Failed assertion: ptr[0] == n + 1 : 1 / 325 runs (0.3%)
4 months, 2 weeks ago 1 / 325 runs (0.3%)
  • CLOSED/FIXED
  • 5 months, 2 weeks ago
  • [CI][SHARDS] igt@gem_exec_nop@basic-parallel - incomplete - GEM_BUG_ON(!engine->i915->gt.awake)
  • CFL: igt@gem_fenced_exec_thrash@2-spare-fences - incomplete : 0 / 9 runs (0.0%)
  • SKL: igt@gem_exec_nop@basic-parallel - incomplete - GEM_BUG_ON(!engine->i915->gt.awake) : 0 / 803 runs (0.0%)
4 months, 2 weeks ago 0 / 803 runs (0.0%)
  • CLOSED/DUPLICATE
  • 5 months, 2 weeks ago
  • [CI][BAT] igt@drv_selftest@live_workarounds - dmesg-fail - check_whitelist timed out, cancelling test.
  • All machines: igt@drv_selftest@live_workarounds - dmesg-fail - check_whitelist timed out, cancelling test. : 134 / 578 runs (23.2%)
4 months, 2 weeks ago 134 / 578 runs (23.2%)
  • REOPENED
  • 1 week, 1 day ago
  • [CI][BAT] igt@gem_workarounds@basic-read - fail - Failed assertion: workaround_fail_count(fd, ctx) == 0
  • ICL: igt@gem_workarounds@basic-read* - fail - Failed assertion: workaround_fail_count(fd, ctx) == 0 : 0 / 110 runs (0.0%)
4 months, 2 weeks ago 0 / 110 runs (0.0%)
  • CLOSED/FIXED
  • 5 months, 2 weeks ago
  • [CI][BAT] kernel BUG at drivers/gpu/drm/i915/i915_gem_object.h:444! , invalid opcode: 0000
  • CNL ICL: igt@drv_selftest@live_objects - dmesg-fail - kernel BUG at drivers/gpu/drm/i915/i915_gem_object.h : 0 / 236 runs (0.0%)
4 months, 2 weeks ago 0 / 236 runs (0.0%)
  • CLOSED/FIXED
  • 5 months, 2 weeks ago
  • [CI][DRMTIP] igt@drv_missed_irq - incomplete - killed by softdog
  • SKL KBL CFL WHL: igt@drv_missed_irq - incomplete : 0 / 276 runs (0.0%)
4 months, 2 weeks ago 0 / 276 runs (0.0%)
  • CLOSED/FIXED
  • 4 months, 2 weeks ago
  • [CI][BAT] igt@debugfs_test@read_all_entries - dmesg-warn - Unclaimed read from register 0x70278
  • ICL: igt@debugfs_test@read_all_entries - dmesg-warn - Unclaimed read from register 0x70278 : 21 / 145 runs (14.5%)
4 months, 2 weeks ago 21 / 145 runs (14.5%)
  • CLOSED/FIXED
  • 5 months ago
  • [CI][BAT] igt@drv_selftest@live_objects - dmesg-fail - igt_partial_tiling failed with error -22
  • CNL ICL: igt@drv_selftest@live_objects - dmesg-fail - igt_partial_tiling failed with error -22 : 44 / 237 runs (18.6%)
4 months, 2 weeks ago 44 / 237 runs (18.6%)
  • CLOSED/FIXED
  • 4 months, 4 weeks ago
  • [CI][BAT] igt@drv_selftest@live_hangcheck - incomplete, hangs during others-priority
  • ICL: igt@drv_selftest@live_hangcheck - incomplete : 47 / 140 runs (33.6%)
4 months, 2 weeks ago 47 / 140 runs (33.6%)
  • CLOSED/FIXED
  • 5 months ago
  • [CI][BAT] igt@drv_selftest@live_coherency - dmesg-fail - Value[0/7] mismatch, (overwrite with cpu) wrote [gtt] a3b52fe8 read [cpu] 5c4ad017 (inverse 5c4ad017), at offset 5dc
  • ICL: igt@drv_selftest@live_coherency - dmesg-fail - Value[9/31] mismatch, (overwrite with cpu) : 1 / 139 runs (0.7%)
4 months, 2 weeks ago 1 / 139 runs (0.7%)
  • CLOSED/WORKSFORME
  • 4 months, 2 weeks ago
  • [CI][SHARDS] igt@kms_draw_crc@draw-method-xrgb8888-pwrite-ytiled - fail - Failed assertion: !mismatch
  • GLK: igt@kms_draw_crc@draw-method-xrgb8888-pwrite-ytiled - fail - Failed assertion: !mismatch : 2 / 237 runs (0.8%)
4 months, 2 weeks ago 2 / 237 runs (0.8%)
  • CLOSED/DUPLICATE
  • 5 months, 2 weeks ago
  • [CI][BAT] igt@gem_eio@in-flight-(contexts-)10ms - fail - Failed assertion: __check_wait(fd, obj[1].handle, wait) == 0, error: -62 != 0
  • SNB: igt@gem_eio@in-flight-(contexts-)10ms - fail - Failed assertion: __check_wait(fd, obj[1].handle, wait) == 0, error: -62 != 0 : 2 / 241 runs (0.8%)
4 months, 2 weeks ago 2 / 241 runs (0.8%)
  • CLOSED/FIXED
  • 3 months, 2 weeks ago
  • [CI] igt@gem_eio@* - fail - Failed assertion: __check_wait(fd, obj.handle, 100e3) == 0
  • bsw skl kbl glk: igt@gem_eio@* - Failed assertion: __check_wait(fd, obj[1].handle, wait) == 0 : 0 / 350 runs (0.0%)
4 months, 2 weeks ago 2 / 718 runs (0.3%)
  • CLOSED/FIXED
  • 5 months, 2 weeks ago
  • [CI][BAT] igt@drv_module_reload@basic-reload-inject - incomplete
  • BLB GDG BWR: igt@drv_module_reload@basic-reload-inject - incomplete : 0 / 237 runs (0.0%)
4 months, 2 weeks ago 0 / 237 runs (0.0%)
  • CLOSED/FIXED
  • 5 months ago
  • [CI][BAT] Value[0/2] mismatch, (overwrite with wc) wrote [gtt] 7b87261d read [cpu] 8478d9e2
  • ICL igt@drv_selftest@live_coherency - dmesg-fail - Value mismatch, (overwrite with wc) wrote [gtt] : 0 / 125 runs (0.0%)
4 months, 2 weeks ago 0 / 125 runs (0.0%)
  • CLOSED/DUPLICATE
  • 4 months, 2 weeks ago
  • [CI][BAT] ICL *ERROR* power well DC off state mismatch
  • ICL igt@drv_module_reload@basic-no-display|igt@drv_selftest dmesg-warn *ERROR* power well DC off state mismatch (refcount 0/enabled 1) : 2 / 75 runs (2.7%)
4 months, 2 weeks ago 2 / 75 runs (2.7%)
  • CLOSED/FIXED
  • 4 months, 2 weeks ago
  • [CI][BAT] igt@*(s3|suspend|s4|hibernate)* - dmesg-warn - *ERROR* power well DC off state mismatch (refcount 0/enabled 1)
  • ICL: igt@*(s3|suspend|s4|hibernate)* - dmesg-warn - *ERROR* power well DC off state mismatch (refcount 0/enabled 1) : 80 / 158 runs (50.6%)
4 months, 2 weeks ago 80 / 158 runs (50.6%)
  • CLOSED/FIXED
  • 4 months, 2 weeks ago
  • [BAT] igt@kms_psr@* - dmesg-fail/warn - PSR idle timed out 0x3000011[23], atomic update may fail
  • CNL PSR2: igt@kms_psr@* - dmesg-fail/warn - PSR idle timed out 0x3000011[23], atomic update may fail : 0 / 57 runs (0.0%)
4 months, 2 weeks ago 0 / 57 runs (0.0%)
  • CLOSED/FIXED
  • 4 months, 2 weeks ago
  • [CI][DRMTIP] igt@gem_exec_schedule@* - incomplete - no logs
  • ICL: igt@gem_exec_schedule@* - incomplete : 0 / 5 runs (0.0%)
4 months, 2 weeks ago 0 / 5 runs (0.0%)
  • CLOSED/FIXED
  • 4 months, 2 weeks ago
  • [CI][DRMTIP] igt@kms_vblank@pipe-[abc]-ts-continuation-(modeset|dpms)-rpm - fail - Failed assertion: igt_wait_for_pm_status(IGT_RUNTIME_PM_STATUS_SUSPENDED)
  • ICL: igt@kms_vblank@pipe-[abc]-ts-continuation-(modeset|dpms)-rpm - fail - Failed assertion: igt_wait_for_pm_status(IGT_RUNTIME_PM_STATUS_SUSPENDED) : 1 / 4 runs (25.0%)
4 months, 2 weeks ago 1 / 4 runs (25.0%)
  • CLOSED/WORKSFORME
  • 3 months, 1 week ago
  • [CI] IGT suspend issue: CRITICAL: Failed assertion: wait_for_suspended() | igt_wait_for_pm_status(IGT_RUNTIME_PM_STATUS_SUSPENDED)
  • HSW SKL APL KBL GLK CNL: igt@*rpm* - CRITICAL: Failed assertion: (wait_for_suspended\(\) | igt_wait_for_pm_status\(IGT_RUNTIME_PM_STATUS_SUSPENDED\)) : 28 / 445 runs (6.3%)
4 months, 2 weeks ago 28 / 445 runs (6.3%)
  • CLOSED/FIXED
  • 4 months, 2 weeks ago
  • [CI] igt@kms_ccs@pipe-[a|b|c]-crc-sprite-planes-basic - Fail - CRC mismatch
  • fi-cnl-y3, shard-apl: igt@kms_ccs@.* - Failed assertion: !mismatch : 0 / 389 runs (0.0%)
  • fi-cnl-y3, shard-apl: igt@kms_ccs@.* - Failed assertion: !mismatch : 0 / 389 runs (0.0%)
4 months, 2 weeks ago 0 / 389 runs (0.0%)
  • CLOSED/WORKSFORME
  • 4 months, 2 weeks ago
  • [CI] igt@kms_flip_tiling@* - fail - CRC mismatch
  • shard-(glk|apl) fi-cnl-*: igt@kms_flip_tiling@* - fail - CRC mismatch : 323 / 902 runs (35.8%)
4 months, 2 weeks ago 332 / 933 runs (35.6%)
  • CLOSED/NOTOURBUG
  • 5 months, 2 weeks ago
  • [CI] SKL-IOMMU igt@drv_module_reload tests fail
  • IOMMU: all tests - fail/dmesg-fail - error: -5 != 0 : 133 / 413 runs (32.2%)
  • IOMMU: All tests - fail - Input/output error : 19 / 413 runs (4.6%)
  • IOMMU: all tests - fail/warn - gen6_render_flush: Assertion `ret == 0' failed. : 3 / 413 runs (0.7%)
4 months, 3 weeks ago 133 / 413 runs (32.2%)
  • CLOSED/FIXED
  • 4 months, 3 weeks ago
  • [CI][DRMTIP] igt@gem_gpgpu_fill - fail - Test assertion failure function gen7_render_flush, Failed assertion: ret == 0, Last errno: 5, Input/output error
  • KBL: igt@pm_rpm@gem-idle - fail - Failed assertion: !is_wedged(i915) - Last errno: 5, Input/output error : 0 / 0 runs (0.0%)
  • KBL: igt@gem_gpgpu_fill - fail - Test assertion failure function gen7_render_flush, Failed assertion: ret == 0, Last errno: 5, Input/output error : 0 / 233 runs (0.0%)
4 months, 3 weeks ago 0 / 233 runs (0.0%)
  • CLOSED/WORKSFORME
  • 5 months, 2 weeks ago
  • [CI] igt@gvt_basic@invalid-placeholder-test - incomplete - no useful logs
  • BWR: igt@gvt_basic@invalid-placeholder-test - incomplete : 0 / 680 runs (0.0%)
4 months, 3 weeks ago 0 / 680 runs (0.0%)
  • CLOSED/WORKSFORME
  • 4 months, 3 weeks ago
  • [CI] igt@kms_cursor_legacy@basic-.* - fail - Timed out: Stuck page flip
  • SKL BXT APL: kms_cursor_legacy@basic-*: Stuck page flip : 0 / 1944 runs (0.0%)
4 months, 3 weeks ago 0 / 1944 runs (0.0%)
  • CLOSED/FIXED
  • 5 months, 2 weeks ago
  • [CI][BAT] igt@drv_module_reload@basic-reload-inject - dmesg-fail - general protection fault: 0000 [#1] PREEMPT SMP PTI
  • GUC: igt@drv_module_reload@basic-reload-inject - dmesg-fail - general protection fault: 0000 [#1] PREEMPT SMP PTI : 0 / 212 runs (0.0%)
4 months, 3 weeks ago 0 / 212 runs (0.0%)
  • CLOSED/WORKSFORME
  • 4 months, 3 weeks ago
  • [CI] igt@gem_mmap_gtt@*bo-tiled* - fail - Failed assertion: memcmp(ptr , linear_pattern, PAGE_SIZE) == 0
  • ILK: igt@gem_mmap_gtt@*bo-tiled* - fail - Failed assertion: memcmp(ptr , linear_pattern, PAGE_SIZE) == 0 : 0 / 1376 runs (0.0%)
4 months, 3 weeks ago 0 / 1376 runs (0.0%)
  • CLOSED/FIXED
  • 4 months, 3 weeks ago
  • [CI][BAT] igt@kms_psr@* - dmesg-warn / dmesg-fail - PSR idle timed out, atomic update may fail
  • CNL: all tests - dmesg-warn / dmesg-fail - PSR idle timed out, atomic update may fail : 0 / 0 runs (0.0%)
  • PSR2: igt@kms_psr@* - dmesg-warn / dmesg-fail - PSR idle timed out, atomic update may fail : 0 / 0 runs (0.0%)
4 months, 3 weeks ago 189 / 222 runs (85.1%)
  • CLOSED/FIXED
  • 3 months, 2 weeks ago
  • [CI][SHARDS] igt@gem_eio@reset-stress - fail - Failed assertion: elapsed < 250e6
  • HSW: igt@gem_eio@reset-stress - fail - Failed assertion: elapsed < 250e6 : 12 / 119 runs (10.1%)
4 months, 3 weeks ago 11 / 118 runs (9.3%)
  • CLOSED/WORKSFORME
  • 2 days, 7 hours ago
  • [CI][BAT] igt@drv_selftest@live_requests - incomplete - GEM_BUG_ON(!i915_request_completed(rq))
  • CFL: igt@drv_selftest@live_requests - incomplete : 0 / 0 runs (0.0%)
5 months, 2 weeks ago 0 / 0 runs (0.0%)
  • CLOSED/WORKSFORME
  • 3 months, 2 weeks ago
  • [CI] igt@kms_flip@(2x-)absolute-wf_vblank-interruptible - Failed assertion: timercmp(&es->last_received_ts, &es->current_ts, <)
  • all machines: igt@kms_flip@(2x-|blocking-)absolute-wf_vblank(-ts-check)(-interruptible) - vblank ts before the vblank was issued! : 1 / 438 runs (0.2%)
5 months, 2 weeks ago 1 / 438 runs (0.2%)
  • CLOSED/DUPLICATE
  • 4 months, 2 weeks ago
  • [CI][BAT] igt@drv_selftest@live_hangcheck - dmesg-fail - *ERROR* bcs0: reset request timeout
  • BSW: igt@drv_selftest@live_hangcheck - dmesg-fail - *ERROR* bcs0: reset request timeout : 0 / 0 runs (0.0%)
5 months, 2 weeks ago 0 / 0 runs (0.0%)
  • CLOSED/FIXED
  • 5 months ago
  • [CI] BSW KBL igt@kms_pipe_crc_basic@bad-source fail - Test assertion failure function test_bad_source
  • BSW KBL igt@kms_pipe_crc_basic@bad-source fail - Test assertion failure function test_bad_source : 0 / 1 runs (0.0%)
5 months, 2 weeks ago 0 / 1 runs (0.0%)
  • CLOSED/FIXED
  • 5 months ago
  • [CI] GLK igt@pm_rpm@min-max-config-loaded - fail - Failed assertion: freqs[MAX] <= freqs[CUR]
  • GLK igt@pm_rpm@min-max-config-loaded - fail - Failed assertion: freqs[MAX] <= freqs[CUR] : 0 / 1 runs (0.0%)
5 months, 2 weeks ago 0 / 1 runs (0.0%)
  • CLOSED/FIXED
  • 4 months, 3 weeks ago
  • [CI] - igt@drv_selftest@mock_scatterlist - dmesg-warn - i915_sg_trim timed out
  • ALL: selftest@mock_scatterlist - i915_sg_trim timed out : 133 / 389 runs (34.2%)
5 months, 2 weeks ago 133 / 389 runs (34.2%)
  • CLOSED/FIXED
  • 5 months, 2 weeks ago
  • [BAT] igt@drv_selftest@mock_hugepages - dmesg-fail - Failed assertion: err == 0
  • BWR: igt@drv_selftest@mock_hugepages - dmesg-fail - Failed assertion: err == 0 / Cannot allocate memory [12] : 1 / 103 runs (1.0%)
5 months, 2 weeks ago 1 / 103 runs (1.0%)
  • CLOSED/WORKSFORME
  • 6 months, 1 week ago
  • [CI][SHARDS] Shard-glk9 - igt@kms_cursor_legacy@2x-nonblocking-modeset-vs-cursor-atomic - fail - Failed assertion: vblank_matches
  • KBL CFL GLK: igt@kms_cursor_legacy@2x-nonblocking-modeset-vs-cursor-atomic - fail - Failed assertion: vblank_matches : 0 / 0 runs (0.0%)
5 months, 3 weeks ago 0 / 0 runs (0.0%)
  • CLOSED/FIXED
  • 6 months ago
  • [CI][CTG,GDG] igt@drv_selftest@live_objects: igt_partial_tiling failed with error
  • CTG GDG: igt@drv_selftest@live_objects - igt_partial_tiling failed with error : 18 / 243 runs (7.4%)
5 months, 3 weeks ago 18 / 243 runs (7.4%)
  • CLOSED/NOTOURBUG
  • 5 months, 3 weeks ago
  • [BAT] igt@drv_module_reload@* - dmesg-warn - *ERROR* Gen9 Plane WM* latency not provided
  • CNL: igt@drv_selftest@live_(requests|sanitycheck|uncore|workarounds) - dmesg-warn / dmesg-fail - *ERROR* Gen9 Plane WM\d latency not provided : 0 / 0 runs (0.0%)
5 months, 3 weeks ago 0 / 0 runs (0.0%)
  • CLOSED/FIXED
  • 5 months, 2 weeks ago
  • [CI] igt@* - dmesg-warn/fail - *ERROR* Potential atomic update failure on pipe [ABC]
  • KBL CFL WHL: all tests - dmesg-warn/fail - *ERROR* Potential atomic update failure on pipe [ABC] : 10 / 979 runs (1.0%)
5 months, 4 weeks ago 10 / 979 runs (1.0%)
  • CLOSED/FIXED
  • 5 months, 4 weeks ago
  • [BAT] igt@drv_selftest@mock_gtt - fail - no logs
  • GVT-d: igt@drv_selftest@mock_gtt - fail - no logs : 0 / 43 runs (0.0%)
5 months, 4 weeks ago 0 / 43 runs (0.0%)
  • REOPENED
  • 1 month, 3 weeks ago
  • [CI][BAT] Memory performance issue
  • All machines: igt@gem_mmap_gtt@basic-wc - fail - Failed assertion: gtt_writes > cpu_writes/2 : 0 / 0 runs (0.0%)
  • All machines: igt@gem_mmap_gtt@basic-wc - fail - Failed assertion: gtt_writes > 2*gtt_reads : 0 / 0 runs (0.0%)
6 months ago 0 / 0 runs (0.0%)
  • CLOSED/INVALID
  • 3 months, 3 weeks ago
  • [CI][BAT] igt@gem_exec_suspend@basic-s4-devices - fail - fstrim prevents the machines from hibernating
  • All machines: igt@gem_exec_suspend@basic-s4-devices - fail - Last errno: 16, Device or resource busy : 0 / 0 runs (0.0%)
6 months ago 0 / 0 runs (0.0%)
  • CLOSED/FIXED
  • 6 months ago
  • [CI] igt@drv_selftest@mock_scatterlist - dmesg-warn - sg_alloc_table timed out (leading to an incomplete)
  • shard-glk9: igt@drv_selftest@mock_scatterlist - dmesg-warn - sg_alloc_table timed out : 0 / 3 runs (0.0%)
  • shard-glk9: igt@drv_selftest@live_gtt - incomplete : 0 / 3 runs (0.0%)
6 months ago 0 / 3 runs (0.0%)
  • CLOSED/FIXED
  • 6 months ago
  • [CI] igt@* - dmesg-warn/fail - WARN_ON(dev_priv->uncore.funcs.mmio_readl(dev_priv, (((const i915_reg_t){ .reg = (0x6f900) })), true) & (1<<31))
  • PSR PSR2: all tests - dmesg-warn/fail - WARN_ON(dev_priv->uncore.funcs.mmio_readl(dev_priv, (((const i915_reg_t){ .reg = (0x6f900) })), true) & (1 << 31)) : 2 / 216 runs (0.9%)
  • PSR PSR2: all tests - dmesm-warn - WARN_ON(dev_priv->uncore.funcs.mmio_readl(dev_priv, (((const i915_reg_t){ .reg = (dev_priv->psr_mmio_base + 0) }))... : 5 / 216 runs (2.3%)
  • PSR PSR2: all tests - WARN_ON(dev_priv->uncore.funcs.mmio_readl(dev_priv, (((const i915_reg_t){ .reg = (dev_priv->psr_mmio_base + 0) })), true) & (1<<31)) : 1 / 235 runs (0.4%)
  • PSR PSR2: all tests - dmesg-warn/fail - WARN_ON(dev_priv->uncore.funcs.mmio_readl(dev_priv, (((const i915_reg_t){ .reg = (0x6f900) })), true) & (1<<31)) : 1 / 236 runs (0.4%)
6 months ago 6 / 236 runs (2.5%)
  • NEEDINFO
  • 6 months ago
  • [CI] igt@* - incomplete - Softdog on gvtdvm machines, pi_lock lockdep in boot.log
  • BDW: all tests - dmesg-warn - ERROR. Fault errors on pipe A: 0x00000100 : 232 / 512 runs (45.3%)
6 months ago 232 / 512 runs (45.3%)
  • CLOSED/FIXED
  • 6 months, 1 week ago
  • [CI][GD,BL,PNV] drv_selftest@live_requests: live_all_engines failed with error -5
  • GD BL PNV: igt@drv_selftest@live_requests - live_all_engines failed with error -5 : 1 / 54 runs (1.9%)
6 months, 1 week ago 1 / 54 runs (1.9%)
  • CLOSED/FIXED
  • 6 months, 1 week ago
  • [CI] SKL-IOMMU igt@drv_selftest@live_coherency failed with error -5
  • SKL-IOMMU: igt@drv_selftest@live_coherency - igt_gem_coherency failed with error -5 : 2 / 21 runs (9.5%)
6 months, 1 week ago 2 / 21 runs (9.5%)
  • CLOSED/FIXED
  • 6 months, 1 week ago
  • [CI] igt@drv_selftest@live_gtt - incomplete
  • BDW SKL KBL CFL WHL: igt@drv_selftest@live_gtt - incomplete/fail : 0 / 20 runs (0.0%)
6 months, 1 week ago 0 / 20 runs (0.0%)
  • CLOSED/FIXED
  • 6 months, 1 week ago
  • [CI] [PNV,BLB] igt@drv_selftest@live_hangcheck - dmesg-fail - Failed to switch back to kernel context; declaring wedged
  • BLB PNV : igt@drv_selftest@live_hangcheck - Failed to switch back to kernel context; declaring wedged : 5 / 21 runs (23.8%)
6 months, 1 week ago 5 / 21 runs (23.8%)
  • CLOSED/FIXED
  • 6 months, 1 week ago
  • [CI][SKL] IOMMU-enabled host fails drv_selftest@live_workarounds
  • SKL-IOMMU: IGT igt@drv_selftest@live_workaround - Invalid whitelist *before* engine reset! : 1 / 20 runs (5.0%)
6 months, 1 week ago 1 / 20 runs (5.0%)
  • CLOSED/FIXED
  • 6 months, 1 week ago
  • [CI][GLK,APL,SKL] igt@drv_selftest@live_objects hangs
  • GLK,SKL: igt@drv_selftest@live_objects - incomplete : 1 / 54 runs (1.9%)
6 months, 1 week ago 1 / 54 runs (1.9%)
  • CLOSED/FIXED
  • 6 months, 1 week ago
  • [CI] drv_selftest@mock_requests triggers lockdep correctness validator
  • igt@drv_selftest@mock_requests: the code is fine but needs lockdep annotation : 1 / 59 runs (1.7%)
6 months, 1 week ago 1 / 59 runs (1.7%)
  • CLOSED/FIXED
  • 1 month, 4 weeks ago
  • [CI] drv_selftests fail with: list_del corruption. next->prev should be ...
  • igt@drv_selftest@live_gtt: list_del corruption. next->prev should be : 1 / 58 runs (1.7%)
6 months, 1 week ago 1 / 58 runs (1.7%)
  • CLOSED/WORKSFORME
  • 6 months, 3 weeks ago
  • [CI] Commit "ALSA: hda - Handle error from snd_hda_power_up*()" broke pm_rpm|kms|drv_module_reload|...
  • ALSA: hda - Handle error from snd_hda_power_up*() : 10 / 15 runs (66.7%)
6 months, 3 weeks ago 10 / 15 runs (66.7%)
  • CLOSED/WORKSFORME
  • 7 months ago
  • [CI][BYT only] igt@drv_suspend@forcewake - dmesg-warn - Expected 00000005 fw_domains to be active, but 00000005 are off
  • BYT: igt@drv_suspend@forcewake - dmesg-warn - Expected 00000005 fw_domains to be active, but 00000005 are off : 4 / 9 runs (44.4%)
6 months, 3 weeks ago 4 / 9 runs (44.4%)
  • CLOSED/FIXED
  • 6 months, 3 weeks ago
  • [CI] igt@gem_exec_schedule@preempt-* - dmesg-warn - WARN_ON_ONCE((1) && !(preempt_count() != 0))
  • GUC: igt@gem_exec_schedule@preempt-* - dmesg-warn - WARN_ON_ONCE((1) && !(preempt_count() != 0)) : 0 / 4 runs (0.0%)
6 months, 3 weeks ago 0 / 4 runs (0.0%)
  • CLOSED/FIXED
  • 7 months ago
  • [CI] igt@gem_exec_gttfill@basic - skip - not enough free RAM to execute the test
  • fi-pnv-d510: igt@gem_exec_gttfill@basic - skip - not enough RAM : 0 / 553 runs (0.0%)
7 months ago 0 / 588 runs (0.0%)
  • CLOSED/FIXED
  • 7 months ago
  • [CI] igt@gem_eio@(hibernate|suspend) - incomplete - WARNING execlists_submission_tasklet
  • gen9+: igt@gem_eio@(hibernate|suspend) - incomplete : 1 / 15 runs (6.7%)
7 months ago 1 / 15 runs (6.7%)
  • CLOSED/FIXED
  • 8 months, 4 weeks ago
  • [CI] igt@kms-* - fail - Failed assertion: __gem_create(fd, size, &handle) == 0 - igt_kms-WARNING: connector 52/VGA-1 has no modes - random machines, random shards but only one at a time
  • shard-snb: igt@* - Failed assertion: __gem_create(fd, size, &handle) == 0 : 0 / 0 runs (0.0%)
  • shard-snb fi-ivb-3770 fi-bsw-n3050: all tests - Failed assertion: igt_ioctl((fd), ((((2U|1U) << (((0+8)+8)+14)) | ((('d')) << (0+8)) | (((0xB2)) << 0) | ... : 0 / 0 runs (0.0%)
  • shard-snb: igt@* - Failed assertion: __gem_create(fd, size, &handle) == 0 : 0 / 0 runs (0.0%)
  • shard-snb fi-ivb-3770 fi-bsw-n3050: all tests - Failed assertion: igt_ioctl((fd), ((((2U|1U) << (((0+8)+8)+14)) | ((('d')) << (0+8)) | (((0xB2)) << 0) | ... : 0 / 0 runs (0.0%)
  • shard-snb: igt@testdisplay - igt_kms-WARNING: connector 52/VGA-1 has no modes : 0 / 0 runs (0.0%)
  • shard-snb: igt@testdisplay - igt_kms-WARNING: connector 52/VGA-1 has no modes : 0 / 0 runs (0.0%)
  • fi-ivb-3770: Failed assertion: __gem_create(fd, size, &handle) == 0 : 0 / 0 runs (0.0%)
  • fi-ivb-3770: Failed assertion: __gem_create(fd, size, &handle) == 0 : 0 / 0 runs (0.0%)
7 months ago 7 / 136 runs (5.1%)
  • CLOSED/WORKSFORME
  • 7 months ago
  • [CI] igt@drv_suspend@debugfs-reader - dmesg-warn - *ERROR* Panel is unable to calculate any CRC after 6 vblanks TIMEOUT: Sink CRC counter is not zeroed after calculation is stopped
  • fi-cfl-u fi-glk-1: igt@drv_suspend@debugfs-reader - Panel is unable to calculate any CRC after 6 vblanks : 32 / 33 runs (97.0%)
7 months ago 42 / 48 runs (87.5%)
  • CLOSED/WORKSFORME
  • 7 months ago
  • [CI] igt@kms_frontbuffer_tracking@*psr* - fail - PSR still disabled
  • fi-hsw-4200u: igt@kms_frontbuffer_tracking@*psr* - PSR still disabled : 20 / 32 runs (62.5%)
7 months ago 20 / 32 runs (62.5%)
  • CLOSED/WORKSFORME
  • 7 months ago
  • [CI] igt@kms_psr_sink_crc@* - fail - Failed assertion: wait_psr_entry(&data) - Last errno: 25, Inappropriate ioctl
  • fi-hsw-4200u: igt@kms_psr_sink_crc@* - fail - Failed assertion: wait_psr_entry(&data) - Last errno: 25, Inappropriate ioctl : 172 / 504 runs (34.1%)
7 months ago 172 / 504 runs (34.1%)
  • CLOSED/WORKSFORME
  • 6 months, 2 weeks ago
  • [CI] igt@* - dmesg-warn/fail - BUG: Bad page state in process kms_frontbuffer pfn:1ff512
  • fi-cnl-y3: all tests - BUG: Bad page state in process : 0 / 268 runs (0.0%)
7 months ago 0 / 268 runs (0.0%)
  • CLOSED/WORKSFORME
  • 7 months ago
  • [CI] igt@kms_flip@wf_vblank-ts-check(-interruptible) - fail - Failed assertion: crtc_count > 1 || crtc_idxs[0] < 2
  • shard-kbl: igt@kms_flip@wf_vblank-ts-check(-interruptible) - fail - Failed assertion: crtc_count > 1 || crtc_idxs[0] < 2 : 0 / 365 runs (0.0%)
7 months ago 0 / 389 runs (0.0%)
  • CLOSED/WORKSFORME
  • 7 months ago
  • [CI] igt@kms_psr_sink_crc@psr_basic - fail - Failed assertion: wait_psr_entry(&data)
  • fi-hsw-4200u: igt@kms_psr_sink_crc@psr_basic - Failed assertion: wait_psr_entry(&data) : 142 / 142 runs (100.0%)
7 months ago 142 / 142 runs (100.0%)
  • CLOSED/WORKSFORME
  • 7 months ago
  • [CI] igt@pm_rpm@*pc8-* - fail - Failed assertion: pc8_plus_residency_changed(120)
  • fi-bdw-5557u: igt@pm_rpm@*pc8-* - fail - Failed assertion: pc8_plus_residency_changed(120) : 17 / 43 runs (39.5%)
7 months ago 32 / 58 runs (55.2%)
  • CLOSED/WORKSFORME
  • 7 months ago
  • [CI] igt@kms_atomic_transition@1x-modeset-transitions* - Fail - CRC mismatch
  • shard-glk: kms_atomic_transition@1x-modeset* - Failed assertion: !mismatch : 0 / 356 runs (0.0%)
  • shard-apl: 1x-modeset-transitions* - Failed assertion: !mismatch : 6 / 365 runs (1.6%)
7 months ago 20 / 944 runs (2.1%)
  • CLOSED/WORKSFORME
  • 7 months ago
  • [CI] igt@perf_pmu@interrupts-sync -fail - Test assertion failure function test_interrupts_sync -Failed assertion: poll(&pfd, 1, 2 * timeout_ms) == 1
  • APL BSW GLK KBL: igt@perf_pmu@interrupts-sync - Test assertion failure function test_interrupts_sync -Failed assertion: poll(&pfd, 1, 2 * timeout_ms) == 1 : 0 / 173 runs (0.0%)
7 months ago 0 / 173 runs (0.0%)
  • CLOSED/WORKSFORME
  • 7 months ago
  • [BAT guc] igt@gem_exec_suspend@basic-s3 - fail - Failed assertion: !"GPU hung" Subtest basic-S3 failed
  • fi-skl-nuc: gem_exec_suspend@basic-s[34] - Failed assertion: !"GPU hung" : 26 / 451 runs (5.8%)
7 months ago 29 / 561 runs (5.2%)
  • NEW
  • 7 months, 3 weeks ago
  • [CI] igt@kms_cursor_legacy@2x-long-flip-vs-cursor-* - fail - Test assertion failure function two_screens_flip_vs_cursor - Failed assertion: vbl.sequence == vblank_start + 1
  • shard-hsw: igt@kms_cursor_legacy@2x-long-flip-vs-cursor-legacy - Failed assertion: vbl.sequence == vblank_start + 1 : 5 / 365 runs (1.4%)
7 months ago 15 / 892 runs (1.7%)
  • CLOSED/FIXED
  • 1 week, 6 days ago
  • [CI] igt@kms_* - incomplete - softdog - backtrace in dmesg indicates: NULL deref in intel_psr_flush
  • fi-cfl-s3: igt@kms_frontbuffer_tracking@psr-1p-pri-indfb-multidraw - incomplete : 0 / 42 runs (0.0%)
7 months ago 1 / 49 runs (2.0%)
  • CLOSED/WORKSFORME
  • 7 months ago
  • [CI][GLK only] igt@kms_frontbuffer_tracking@*psr* - Test assertion failure function do_status_assertions - PSR disabled
  • shard-glk: Failed assertion: psr_is_enabled() : 59 / 357 runs (16.5%)
  • shard-glk: Failed assertion: wait_psr_entry(&data) : 118 / 416 runs (28.4%)
7 months ago 118 / 416 runs (28.4%)
  • CLOSED/WORKSFORME
  • 7 months ago
  • [CI] igt@kms_pipe_crc_basic@suspend-read-crc-pipe-[abc] - owatch: TIMEOUT!
  • fi-hsw-4770, fi-skl-guc: igt@kms_pipe_crc_basic@suspend-read-crc-pipe-[abc] - incomplete : 2 / 611 runs (0.3%)
7 months ago 6 / 854 runs (0.7%)
  • CLOSED/WORKSFORME
  • 7 months ago
  • [CI] [ELK only] igt@kms_busy@basic-flip-[abc] - fail - Failed assertion: nanosleep(&tv, NULL) == -1
  • fi-elk-e7500: igt@kms_busy@basic-flip-[abc] - Failed assertion: nanosleep(&tv, NULL) == -1 : 0 / 585 runs (0.0%)
7 months ago 0 / 802 runs (0.0%)
  • CLOSED/WORKSFORME
  • 7 months ago
  • [CI] igt@kms_vblank@pipe-[ab]-*-hang - fail - Failed assertion: wait_vblank\(fd, &vbl\) == 0
  • blb bwr gdg pnv: igt@kms_vblank@pipe-[ab]-*-hang - Failed assertion: wait_vblank(fd, &vbl) == 0 : 8 / 43 runs (18.6%)
7 months ago 22 / 57 runs (38.6%)
  • CLOSED/WORKSFORME
  • 7 months ago
  • [CI] [GLK only] suspend tests - dmesg-warn - *ERROR* PLL 1 not locked
  • shard-glk: all tests - *ERROR* PLL 1 not locked : 0 / 349 runs (0.0%)
7 months ago 0 / 349 runs (0.0%)
  • CLOSED/WORKSFORME
  • 7 months ago
  • [CI][ELK] RIP: 0010:drm_wait_one_vblank+0x175/0x180 on igt@kms_pipe_crc_basic@nonblocking-crc-pipe-b
  • elk:igt@kms_pipe_crc_basic@nonblocking-crc-pipe-b RIP:drm_wait_one_vblank : 0 / 480 runs (0.0%)
7 months ago 0 / 480 runs (0.0%)
  • CLOSED/WORKSFORME
  • 7 months ago
  • [CI] igt@kms_flip_event_leak - dmesg-fail - Test assertion failure function test, Failed assertion: ret == 0
  • fi-ctg-p8600: igt@kms_flip_event_leak - dmesg-fail - Test assertion failure function test, Failed assertion: ret == 0 : 0 / 1 runs (0.0%)
7 months ago 0 / 5 runs (0.0%)
  • CLOSED/WORKSFORME
  • 7 months ago
  • [CI] igt@kms_frontbuffer_tracking@fbcpsr-modesetfrombusy - Failed assertion: sink_crc_equal(&crc.sink, &wanted_crc->sink)
  • shard-glk: igt@kms_frontbuffer_tracking@fbcpsr-modesetfrombusy - Failed assertion: sink_crc_equal(&crc.sink, &wanted_crc->sink) : 0 / 355 runs (0.0%)
7 months ago 0 / 355 runs (0.0%)
  • CLOSED/WORKSFORME
  • 7 months ago
  • [CI][GLK only] igt@kms_frontbuffer_tracking@*psr* - Test assertion failure function do_status_assertions - PSR disabled
  • shard-glk*: Failed assertion: psr_is_enabled() : 59 / 357 runs (16.5%)
7 months ago 59 / 357 runs (16.5%)
  • CLOSED/WORKSFORME
  • 7 months ago
  • [CI] [BXT only] igt@kms_color@pipe-b-gamma - fail - Failed assertion: !mismatch
  • shard-apl: igt@kms_color@pipe-b-gamma - Failed assertion: !mismatch : 0 / 364 runs (0.0%)
7 months ago 0 / 588 runs (0.0%)
  • CLOSED/FIXED
  • 3 months, 3 weeks ago
  • [CI] igt@gem_workarounds@suspend-resume-fd - dmesg-warn - Delta way too big!
  • shard-glk: all tests - Delta way too big! : 0 / 357 runs (0.0%)
7 months ago 0 / 357 runs (0.0%)
  • CLOSED/WORKSFORME
  • 7 months ago
  • [CI] [KBL only] igt@gem_busy@close-race - fail - Failed assertion: handles != MAP_FAILED
  • shard-kbl: igt@gem_busy@close-race - Failed assertion: handles != MAP_FAILED : 0 / 364 runs (0.0%)
7 months ago 0 / 589 runs (0.0%)
  • CLOSED/WORKSFORME
  • 7 months ago
  • [CI] igt@kms_flip@blocking-wf_vblank - fail - Test assertion failure function check_final_state - Failed assertion: elapsed >= min && elapsed <= max
  • shard-all: igt@kms_flip@.*wf_vblank.* - Failed assertion: elapsed >= min && elapsed <= max : 8 / 365 runs (2.2%)
7 months ago 8 / 417 runs (1.9%)
  • CLOSED/FIXED
  • 7 months ago
  • [CI] igt@* - dmesg-warn - WARNING: CPU: 3 PID: 38 at sound/hda/hdac_i915.c:92 snd_hdac_display_power+0xd3/0xf0 [snd_hda_core] -> WARN_ON(!bus->i915_power_refcount)
  • shard-kbl fi-glk-1 fi-cfl-* fi-kbl-* skl cnl: all tests - WARNING: at sound/hda/hdac_i915.c:92 snd_hdac_display_power : 0 / 790 runs (0.0%)
7 months ago 0 / 790 runs (0.0%)
  • CLOSED/WORKSFORME
  • 7 months ago
  • [CI] igt@*@*suspend* - dmesg-warn - *ERROR* DPLL 1 not locked
  • fi-skl-6700k2: all tests - DPLL 1 not locked : 1 / 611 runs (0.2%)
7 months ago 13 / 1112 runs (1.2%)
  • CLOSED/WORKSFORME
  • 7 months ago
  • [BAT] igt@drv_module_reload@basic-no-display - incomplete - system hang?
  • fi-bwr-2160: igt@drv_module_reload@basic-* - incomplete : 1 / 610 runs (0.2%)
7 months ago 3 / 914 runs (0.3%)
  • CLOSED/FIXED
  • 7 months ago
  • [CI] igt@pm_backlight@fade - Failed assertion: ({ typeof(0) _a = (0); typeof(val - tolerance) _b = (val - tolerance); _a > _b ? _a : _b; }) <= result
  • fi-ctg-p8600: igt@pm_backlight@fade - Failed assertion: ({ typeof(0) _a = (0); typeof(val - tolerance) _b = (val - tolerance); _a > _b ? _a : _b; }) <= result : 1 / 1 runs (100.0%)
7 months ago 2 / 2 runs (100.0%)
  • CLOSED/FIXED
  • 7 months ago
  • [CI] igt@gem_eio@reset-stress - fail - Failed assertion: __gem_context_create(fd, &ctx_id) == 0
  • SNB HSW KBL APL GLK: igt@gem_eio@reset-stress - fail - Failed assertion: __gem_context_create(fd, &ctx_id) == 0 : 0 / 15 runs (0.0%)
7 months ago 0 / 15 runs (0.0%)
  • CLOSED/DUPLICATE
  • 10 months, 3 weeks ago
  • [BAT] [CNL only] igt@kms_pipe_crc_basic@suspend-read-crc-pipe-a - Incomplete - system hang
  • fi-cnl-y3: igt@kms_pipe_crc_basic@suspend-read-crc-pipe-a - incomplete : 1 / 404 runs (0.2%)
7 months ago 1 / 724 runs (0.1%)
  • CLOSED/DUPLICATE
  • 10 months, 3 weeks ago
  • [BAT][CNL only] igt@kms_flip@basic-plain-flip - incomplete
  • fi-cnl-y3: igt@kms_flip@basic-plain-flip - incomplete : 1 / 406 runs (0.2%)
7 months ago 1 / 762 runs (0.1%)
  • CLOSED/DUPLICATE
  • 8 months, 3 weeks ago
  • [CI] igt@*suspend* - dmesg-warn - *ERROR* timeout during PHY[01]
  • shard-glk: All tests - *ERROR* timeout during PHY[0-9] power on : 0 / 354 runs (0.0%)
7 months ago 0 / 354 runs (0.0%)
  • CLOSED/FIXED
  • 7 months ago
  • [CI] igt@kms_flip@2x-*-flip-* - dmesg-fail - Failed assertion: do_page_flip(o, o->fb_ids[1], 1) == 0 (with flip_done timed out in dmesg)
  • CTG BWR ELK: igt@kms_flip@ Failed assertion: do_page_flip(o, o->fb_ids[1], 1) == 0 with flip_done timed out in dmesg : 1 / 330 runs (0.3%)
7 months ago 1 / 330 runs (0.3%)
  • CLOSED/FIXED
  • 4 months, 3 weeks ago
  • [CI] igt@.* - dmesg-warn - flip_done timed out
  • BLB CTG: igt@.* - dmesg-warn/fail - flip_done timed out : 0 / 36 runs (0.0%)
7 months ago 0 / 36 runs (0.0%)
  • CLOSED/FIXED
  • 7 months ago
  • [CI] igt@kms_vblank@pipe-b-wait-busy-hang - dmesg-fail - Failed assertion: __gem_execbuf(fd, execbuf) == 0 & *ERROR* GuC firmware xfer error -110 GuC: Failed to load firmware i915/skl_guc_ver9_33.bin (error -110)
  • fi-skl-guc: igt@.* - fail/dmesg-fail - Failed assertion: __gem_execbuf(fd, execbuf) == 0 : 0 / 42 runs (0.0%)
  • fi-skl-guc: igt@.* - fail - gen6_render_flush: Assertion `ret == 0' failed. : 0 / 40 runs (0.0%)
7 months ago 0 / 54 runs (0.0%)
  • CLOSED/WORKSFORME
  • 7 months ago
  • [CI] [SNB only] igt@gem_eio@in-flight-contexts - dmesg-fail - Failed assertion: !wedged
  • shard-snb: igt@gem_eio@in-flight-contexts - Failed assertion: !wedged : 0 / 0 runs (0.0%)
7 months ago 0 / 369 runs (0.0%)
  • CLOSED/WORKSFORME
  • 3 months, 2 weeks ago
  • [CI] igt@kms_flip@2x-modeset-vs-vblank-race - dmesg-fail - BUG: unable to handle kernel NULL pointer dereference -IP: snd_hda_spdif_ctls_unassign+0x30/0x40 [snd_hda_codec]
  • fi-skl-6260u: igt@kms_pipe_crc_basic@read-crc-pipe-[abc]-frame-sequence - incomplete - BUG: unable to handle kernel NULL pointer dereference, snd_hda_spdif_... : 0 / 605 runs (0.0%)
7 months ago 0 / 617 runs (0.0%)
  • CLOSED/WORKSFORME
  • 7 months, 2 weeks ago
  • [CI]igt@kms_* - incomplete - last line i dmesg :[drm:i915_fifo_underrun_reset_write [i915]] Re-arming FIFO underruns on pipe A
  • kbl: igt@kms_* - incomplete - last line i dmesg :[drm:i915_fifo_underrun_reset_write [i915]] Re-arming FIFO underruns on pipe A : 2 / 404 runs (0.5%)
7 months ago 2 / 405 runs (0.5%)
  • CLOSED/WORKSFORME
  • 7 months ago
  • [CI] igt@drv_selftest@live_hangcheck - dmesg-fail - stack segment: 0000 [#1]
  • GLK: igt@drv_selftest@live_hangcheck - dmesg-fail - stack segment: 0000 [#1] : 0 / 102 runs (0.0%)
7 months ago 0 / 102 runs (0.0%)
  • CLOSED/WORKSFORME
  • 7 months, 2 weeks ago
  • [CI] [ILK only] igt@kms_panel_fitting@legacy - dmesg-warn - *ERROR* CPU pipe B FIFO underrun
  • fi-ilk-m540: igt@kms_panel_fitting@legacy - *ERROR* CPU pipe B FIFO underrun : 0 / 4 runs (0.0%)
7 months ago 4 / 18 runs (22.2%)
  • NEW
  • 7 months ago
  • [CI] igt@kms_frontbuffer_tracking@drrs-modesetfrombusy - fail - Test assertion failure function do_status_assertions - Failed assertion: false - DRRS HIGH
  • fi-cnl-y3: igt@kms_frontbuffer_tracking@drrs - fail - DRRS HIGH : 0 / 0 runs (0.0%)
7 months ago 5 / 5 runs (100.0%)
  • CLOSED/WORKSFORME
  • 7 months ago
  • [CI] igt@* - dmesg-warn - i915 0000:00:02.0: i915_reset_device timed out, cancelling all in-flight rendering.
  • shard-snb fi-pnv-d510: i915_reset_device timed out, cancelling all in-flight rendering. : 0 / 401 runs (0.0%)
7 months ago 1 / 431 runs (0.2%)
  • CLOSED/WORKSFORME
  • 7 months ago
  • [CI] [BXT only] igt@* - dmesg-warn: *ERROR* CPU pipe [A|B|C] FIFO underrun
  • shard-apl: igt@testdisplay - *ERROR* CPU pipe A FIFO underrun : 0 / 361 runs (0.0%)
7 months ago 2 / 940 runs (0.2%)
  • CLOSED/WORKSFORME
  • 7 months ago
  • [CI] igt@pm_lpsp@screens-disabled - fail - Test assertion failure function screens_disabled_subtest - Failed assertion: lpsp_is_enabled(drm_fd)
  • shard-hsw: igt@pm_lpsp@screens-disabled - Failed assertion: lpsp_is_enabled(drm_fd) : 0 / 334 runs (0.0%)
7 months ago 47 / 844 runs (5.6%)
  • CLOSED/WORKSFORME
  • 7 months, 1 week ago
  • [CI] [GLK only] igt@* - Link Training failed at link rate = 540000, lane count = 4
  • shard-glk: All tests - Link Training failed at link rate = \d+, lane count = \d+ : 0 / 354 runs (0.0%)
7 months ago 0 / 354 runs (0.0%)
  • CLOSED/DUPLICATE
  • 7 months ago
  • [CI] igt@kms_addfb_basic@size-max - dmesg-warn - *ERROR* Atomic update failure on pipe A
  • fi-cfl-u: igt@kms_addfb_basic@size-max - dmesg-warn - *ERROR* Atomic update failure on pipe [ABC] : 0 / 315 runs (0.0%)
7 months ago 0 / 328 runs (0.0%)
  • CLOSED/WORKSFORME
  • 7 months ago
  • [CI] igt@drv_module_reload@basic-reload - dmesg-warn - WARN_ON(fbc->crtc->active) and WARNING: possible circular locking dependency detected
  • fi-cnl-y3: igt@drv_module_reload@basic-reload - dmesg-warn - WARN_ON(fbc->crtc->active) : 0 / 404 runs (0.0%)
7 months ago 0 / 418 runs (0.0%)
  • CLOSED/WORKSFORME
  • 7 months ago
  • [CI] igt@kms_frontbuffer_tracking@fbc-1p-primscrn-indfb-pgflip-blt - fail - Test assertion failure function wait_flip_event - Failed assertion: false - Poll timeout
  • fi-skl-guc: all tests - fail - Test assertion failure function wait_flip_event - Failed assertion: false - Poll timeout : 0 / 529 runs (0.0%)
7 months ago 0 / 545 runs (0.0%)
  • CLOSED/FIXED
  • 7 months ago
  • [CI] igt@kms_vblank@pipe-b-wait-busy-hang - dmesg-fail - Failed assertion: __gem_execbuf(fd, execbuf) == 0 & *ERROR* GuC firmware xfer error -110 GuC: Failed to load firmware i915/skl_guc_ver9_33.bin (error -110)
  • fi-skl-guc: *ERROR* GuC firmware xfer error -110 : 1 / 38 runs (2.6%)
7 months ago 1 / 39 runs (2.6%)
  • CLOSED/WORKSFORME
  • 7 months ago
  • [CI] igt@kms_flip@(2x-)modeset-vs-vblank-race(*) - dmesg-fail - Failed assertion: __wait_for_vblank(TEST_VBLANK_BLOCK, o->pipe, 2, 0, &reply) == 0
  • fi-ctg-p8600: igt@kms_flip@(2x-)modeset-vs-vblank-race(*) - dmesg-fail - Failed assertion: __wait_for_vblank(TEST_VBLANK_BLOCK, o->pipe, 2, 0, &reply) == 0 : 0 / 3 runs (0.0%)
7 months ago 0 / 8 runs (0.0%)
  • CLOSED/WORKSFORME
  • 7 months ago
  • [CI] [GDG only] igt@* - incomplete - timout/system hang
  • fi-gdg-551: igt@drm_vma_limiter_gtt - incomplete : 0 / 29 runs (0.0%)
7 months ago 0 / 29 runs (0.0%)
  • CLOSED/FIXED
  • 1 week, 2 days ago
  • [CI] igt@gem_eio@in-flight-suspend - fail - Failed assertion: !wedged
  • fi-kbl-r: igt@gem_eio@in-flight-suspend - fail - Failed assertion: !wedged : 0 / 32 runs (0.0%)
7 months, 1 week ago 0 / 32 runs (0.0%)
  • CLOSED/WORKSFORME
  • 7 months ago
  • [CI] igt@sw_sync@sync_multi_consumer_producer - fail - Failed assertion: counter == MULTI_CONSUMER_PRODUCER_THREADS * MULTI_CONSUMER_PRODUCER_ITERATIONS
  • all machines: igt@sw_sync@sync_multi_consumer_producer - Failed assertion: counter == MULTI_CONSUMER_PRODUCER_THREADS * MULTI_CONSUMER_PRODUCER_ITERATIONS : 0 / 298 runs (0.0%)
7 months, 1 week ago 0 / 298 runs (0.0%)
  • CLOSED/WORKSFORME
  • 7 months ago
  • [CI][GLK] igt@drv_suspend@fence-restore-untiled failure with azx_get_response_timeout
  • glk: igt@drv_suspend@fence-restore-untiled - azx_get_response timeout : 0 / 168 runs (0.0%)
7 months, 1 week ago 0 / 168 runs (0.0%)
  • CLOSED/WORKSFORME
  • 4 months, 3 weeks ago
  • [CI]igt@frontbuffer_tracking@.*fbc - fail - FBC disabled: incompatible mode
  • all machines: igt@frontbuffer_tracking@.*fbc - fail - FBC disabled: incompatible mode : 0 / 323 runs (0.0%)
7 months, 1 week ago 0 / 323 runs (0.0%)
  • CLOSED/WORKSFORME
  • 7 months ago
  • [CI] igt@gem_ctx_param@basic-default - fail - corrupted double-linked list
  • fi-cnl-y3: igt@gem_ctx_param@basic-default - fail - corrupted double-linked list : 0 / 430 runs (0.0%)
7 months, 1 week ago 0 / 430 runs (0.0%)
  • CLOSED/WORKSFORME
  • 7 months ago
  • [CI] igt@syncobj_wait@wait-* - fail - Failed assertion: __syncobj_wait(wait->fd, &wait->wait) == 0
  • cfl,glk: igt@syncobj_wait@wait-* - fail - Failed assertion: __syncobj_wait(wait->fd, &wait->wait) == 0 : 0 / 212 runs (0.0%)
7 months, 1 week ago 0 / 212 runs (0.0%)
  • CLOSED/WORKSFORME
  • 7 months ago
  • [CI] igt@drv_module_reload@basic - list_del corruption. prev->next should be ...
  • snb: igt@drv_module_reload@basic* - list_del corruption. prev->next should be : 0 / 865 runs (0.0%)
7 months, 1 week ago 0 / 865 runs (0.0%)
  • CLOSED/WORKSFORME
  • 7 months ago
  • [CI] igt@gem_exec_schedule@promotion-vebox - fail - Test assertion failure function promotion - Failed assertion: ptr[0] == ctx[2]
  • fi-bsw-n3050: igt@gem_exec_schedule@promotion-vebox - fail - Failed assertion: ptr[0] == ctx[2] : 0 / 40 runs (0.0%)
7 months, 1 week ago 0 / 41 runs (0.0%)
  • CLOSED/WORKSFORME
  • 7 months ago
  • [CI] igt@kms_frontbuffer_tracking@* - dmesg-warn - Panel is unable to calculate any CRC after 6 vblanks
  • fi-skl-6700hq: igt@kms_frontbuffer_tracking@* - dmesg-warn - Panel is unable to calculate any CRC after 6 vblanks : 0 / 6 runs (0.0%)
7 months, 1 week ago 0 / 6 runs (0.0%)
  • CLOSED/WORKSFORME
  • 3 months, 2 weeks ago
  • [CI] igt@kms_flip@2x-modeset-vs-vblank-race - dmesg-fail - BUG: unable to handle kernel NULL pointer dereference -IP: snd_hda_spdif_ctls_unassign+0x30/0x40 [snd_hda_codec]
  • fi-kbl-7500u: igt@kms_flip@2x-modeset-vs-vblank-race - BUG: unable to handle kernel NULL pointer dereference : 0 / 40 runs (0.0%)
7 months, 1 week ago 0 / 54 runs (0.0%)
  • CLOSED/WORKSFORME
  • 7 months ago
  • [CI] igt@gem_eio@hibernate - fail - Failed assertion: igt_sysfs_set(power_dir, "state", suspend_state_name[state])
  • shard-glk: igt@gem_eio@hibernate - Failed assertion: igt_sysfs_set(power_dir, "state", suspend_state_name[state]) : 0 / 321 runs (0.0%)
  • shard-snb: igt@gem_eio@suspend - Failed assertion: igt_sysfs_set(power_dir, "state", suspend_state_name[state]) : 0 / 338 runs (0.0%)
7 months, 1 week ago 0 / 501 runs (0.0%)
  • CLOSED/WORKSFORME
  • 7 months ago
  • [CI] [GLK only] igt@kms_frontbuffer_tracking@fbcpsr-shrfb-scaledprimary - fail - Failed assertion: sink_crc_equal(&crc.sink, &wanted_crc->sink)
  • shard-(apl|glk): igt@kms_frontbuffer_tracking@fbcpsr-shrfb-scaledprimary - Failed assertion: sink_crc_equal(&crc.sink, &wanted_crc->sink) : 0 / 339 runs (0.0%)
7 months, 1 week ago 0 / 391 runs (0.0%)
  • CLOSED/WORKSFORME
  • 7 months ago
  • [CI] [CTG only] igt@kms_pipe_crc_basic@hang-read-crc-pipe-[ab] - dmesg-fail - Failed assertion: !wedged
  • fi-ctg-p8600: igt@kms_pipe_crc_basic@hang-read-crc-pipe-[ab] - dmesg-fail - Failed assertion: !wedged : 0 / 426 runs (0.0%)
7 months, 1 week ago 0 / 677 runs (0.0%)
  • CLOSED/WORKSFORME
  • 7 months ago
  • [CI] [BXT only] igt@* - dmesg-warn: *ERROR* CPU pipe [A|B|C] FIFO underrun
  • shard-apl: all tests - *ERROR* CPU pipe [ABC] FIFO underrun : 0 / 339 runs (0.0%)
7 months, 1 week ago 0 / 363 runs (0.0%)
  • CLOSED/WORKSFORME
  • 7 months ago
  • [CI] [KBL only] igt@kms_frontbuffer_tracking@fbc-rgb565-draw-mmap-gtt - fail - Failed assertion: rc == 0
  • shard-kbl: igt@kms_frontbuffer_tracking@fbc-rgb565-draw-mmap-gtt - Failed assertion: rc == 0 : 0 / 338 runs (0.0%)
7 months, 1 week ago 0 / 818 runs (0.0%)
  • CLOSED/WORKSFORME
  • 7 months ago
  • [CI] [KBL only] igt@kms_frontbuffer_tracking@fbc-farfromfence - Failed assertion: pipe_crc->crc_fd != -1
  • shard-kbl: igt@kms_frontbuffer_tracking@fbc-farfromfence - Failed assertion: pipe_crc->crc_fd != -1 : 0 / 339 runs (0.0%)
7 months, 1 week ago 0 / 815 runs (0.0%)
  • CLOSED/WORKSFORME
  • 7 months ago
  • [CI] [KBL only] igt@kms_plane_multiple@legacy-pipe-a-tiling-y - fail - Failed assertion: ret == 0
  • shard-kbl: igt@kms_plane_multiple@legacy-pipe-[abc]-tiling-yf? - Failed assertion: ret == 0 : 0 / 0 runs (0.0%)
7 months, 1 week ago 0 / 281 runs (0.0%)
  • CLOSED/WORKSFORME
  • 7 months ago
  • [CI] [PNV only] igt@gem_ringfill@basic-default-hang - incomplete
  • fi-pnv-d510: igt@gem_ringfill@basic-default-hang - incomplete : 0 / 511 runs (0.0%)
7 months, 1 week ago 0 / 842 runs (0.0%)
  • CLOSED/WORKSFORME
  • 7 months ago
  • [CI] [KBL only] igt@kms_flip@flip-vs-modeset-vs-hang - fail - Failed assertion: set_mode(o, o->fb_ids[o->current_fb_id], 0, 0) == 0
  • shard-kbl: igt@kms_flip@flip-vs-modeset-vs-hang - Failed assertion: set_mode(o, o->fb_ids[o->current_fb_id], 0, 0) == 0 : 0 / 339 runs (0.0%)
7 months, 1 week ago 0 / 820 runs (0.0%)
  • CLOSED/WORKSFORME
  • 7 months ago
  • [CI] [GLK only] igt@kms_flip@*wf_vblank* - Failed assertion: (drmWaitVBlank(drm_fd, &wait)) == 0
  • shard-glkb: igt@kms_flip@*wf_vblank* - Failed assertion: (drmWaitVBlank(drm_fd, &wait)) == 0 : 0 / 331 runs (0.0%)
7 months, 1 week ago 0 / 331 runs (0.0%)
  • CLOSED/WORKSFORME
  • 7 months ago
  • [CI] igt@gem_cpu_reloc@full - incomplete
  • fi-skl-6770hq: igt@gem_cpu_reloc@full - incomplete : 0 / 39 runs (0.0%)
7 months, 1 week ago 0 / 40 runs (0.0%)
  • CLOSED/WORKSFORME
  • 7 months ago
  • [CI] [CTG only] igt@kms_* - CPU pipe [AB] FIFO underrun
  • fi-ctg-p8600: all tests - dmesg-warn - *ERROR* CPU pipe [AB] FIFO underrun : 0 / 407 runs (0.0%)
7 months, 1 week ago 0 / 407 runs (0.0%)
  • CLOSED/WORKSFORME
  • 7 months ago
  • [CI] igt@kms_setmode@basic - vblank interval differs from modeline!
  • ilk: igt@kms_setmode@basic - dmesg-fail - vblank interval differs from modeline! : 0 / 36 runs (0.0%)
7 months, 1 week ago 0 / 36 runs (0.0%)
  • CLOSED/WORKSFORME
  • 7 months ago
  • [CI] [SNB Only] igt@kms_flip@flip-vs-wf_vblank-interruptible
  • shard-snb: igt@kms_flip@flip-vs-wf_vblank-interruptible - incomplete : 0 / 339 runs (0.0%)
7 months, 1 week ago 0 / 882 runs (0.0%)
  • CLOSED/WORKSFORME
  • 7 months ago
  • [BAT] igt@kms_pipe_crc_basic@nonblocking-crc-pipe-a - fail:drmWaitVBlank(drm_fd, &wait_vbl) == 0 or dmesg-warn: vblank wait timed out on crtc 1
  • fi-ctg-p8600: nonblocking-crc-pipe* - WARNING: CPU: 0 PID: 24 at drivers/gpu/drm/drm_vblank.c:1073 drm_wait_one_vblank : 0 / 414 runs (0.0%)
7 months, 1 week ago 0 / 803 runs (0.0%)
  • CLOSED/WORKSFORME
  • 7 months ago
  • [CI] [KBL only] igt@kms_cursor_crc@.*-suspend - dmesg-fail - Failed assertion: pipe_crc->crc_fd != -1
  • shard-kbl: igt@kms_cursor_crc@.*-suspend - Failed assertion: pipe_crc->crc_fd != -1 : 0 / 339 runs (0.0%)
7 months, 1 week ago 0 / 918 runs (0.0%)
  • CLOSED/WORKSFORME
  • 7 months ago
  • [CI] [CTG only] *ERROR* CPU pipe [AB] FIFO underrun
  • fi-ctg-p8600: igt@kms_flip@*wf_vblank* - CPU pipe [AB] FIFO underrun : 0 / 431 runs (0.0%)
7 months, 1 week ago 0 / 432 runs (0.0%)
  • CLOSED/WORKSFORME
  • 7 months ago
  • [CI] [GLK] igt@kms_rotation_crc@sprite-rotation-180-flip - fail - Inappropriate ioctl for device
  • GLK: Last errno: 25, Inappropriate ioctl for device : 0 / 0 runs (0.0%)
7 months, 1 week ago 0 / 147 runs (0.0%)
  • CLOSED/WORKSFORME
  • 7 months ago
  • [BAT] igt@drv_module_reload@basic-reload - dmesg-warn - BUG: unable to handle kernel paging request at ffffffffa00b4440 -
  • fi-bsw-n3050: igt@drv_module_reload@basic-reload - BUG: unable to handle kernel paging request : 0 / 578 runs (0.0%)
7 months, 1 week ago 0 / 784 runs (0.0%)
  • CLOSED/WORKSFORME
  • 7 months ago
  • [CI] [GLK only] igt@gem_exec_suspend@basic-s3 - incomplete - Failed to resume
  • fi-glk-j4005: suspend tests - incomplete : 0 / 566 runs (0.0%)
7 months, 1 week ago 0 / 709 runs (0.0%)
  • CLOSED/WORKSFORME
  • 7 months ago
  • [CI] igt@gem_ctx_switch@basic-all-heavy - Failed assertion: !"GPU hung"
  • shard-apl: igt@gem_ctx_switch@basic-all-heavy - Failed assertion: !"GPU hung" : 0 / 338 runs (0.0%)
7 months, 1 week ago 0 / 434 runs (0.0%)
  • CLOSED/WORKSFORME
  • 7 months ago
  • [CI] igt@gem_exec_parallel@vebox-contexts - fail - Failed assertion: !"GPU hung"
  • shard-apl: igt@gem_exec_parallel@vebox-contexts - Failed assertion: !"GPU hung" : 0 / 331 runs (0.0%)
7 months, 1 week ago 0 / 388 runs (0.0%)
  • CLOSED/FIXED
  • 7 months ago
  • [CI][IGT]igt@perf@gen8-unprivileged-single-ctx-counters test assertion failure function gen8_test_single_ctx_render_target_writes_a_counter
  • GUC: igt@perf@gen8-unprivileged-single-ctx-counters - Failed assertion: accumulator.deltas[2 + 26] == width * height : 4 / 10 runs (40.0%)
7 months, 1 week ago 4 / 10 runs (40.0%)
  • CLOSED/FIXED
  • 7 months ago
  • [CI][IGT] Hang with test sequence: gem_tiled_swapping@non-threaded drv_suspend@sysfs-reader
  • SNB+:igt@drv_suspend@sysfs-reader hang after igt@gem_tiled_swapping@non-threaded : 1 / 121 runs (0.8%)
7 months, 1 week ago 1 / 121 runs (0.8%)
  • CLOSED/FIXED
  • 7 months ago
  • [CI] igt@gem_ringfill@basic-default - fail - Failed assertion: __execbuf(fd, &execbuf) == -4
  • BSW: igt@gem_ringfill@basic-default - fail - Failed assertion: __execbuf(fd, &execbuf) == -4 : 0 / 296 runs (0.0%)
7 months, 1 week ago 0 / 296 runs (0.0%)
  • CLOSED/WORKSFORME
  • 7 months, 1 week ago
  • [CI] [SNB only] igt@* - dmesg-warn - *ERROR* uncleared pch fifo underrun on pch transcoder A |& *ERROR* PCH transcoder A FIFO underrun
  • fi-snb-2600: dmesg-warn - *ERROR* pch fifo underrun on pch transcoder [ABC] : 1 / 40 runs (2.5%)
7 months, 1 week ago 1 / 47 runs (2.1%)
  • CLOSED/WORKSFORME
  • 7 months ago
  • [CI] igt@gem_sync@basic-many-each - dmesg-warn - BUG kmalloc-32 (Tainted: G U ): Wrong object count. Counter is 19 but counted were -1
  • fi-hsw-4770: igt@gem_sync@basic-many-each - BUG kmalloc-32 (Tainted: G U ): Wrong object count. Counter is 19 but counted were -1 : 0 / 574 runs (0.0%)
7 months, 1 week ago 0 / 578 runs (0.0%)
  • CLOSED/WORKSFORME
  • 7 months, 2 weeks ago
  • [CI] igt@drv_suspend@debugfs-reader - WARNING: CPU: 0 PID: 191 at lib/debugobjects.c:339 debug_print_object
  • bsw: igt@drv_suspend@debugfs-reader - incomplete - WARNING: CPU: 0 PID: 191 at lib/debugobjects.c:339 debug_print_object : 0 / 36 runs (0.0%)
7 months, 1 week ago 0 / 36 runs (0.0%)
  • CLOSED/FIXED
  • 7 months, 1 week ago
  • [CI] igt@kms_color@pipe-a-ctm-green-to-red - fail - Failed assertion: test_pipe_ctm(data, primary, red_green_blue, red_red_blue, ctm)
  • shard-(kbl|apl): igt@kms_color@pipe-[abc]-ctm-green-to-red - Failed assertion: test_pipe_ctm(data, primary, red_green_blue, red_red_blue, ctm) : 0 / 329 runs (0.0%)
7 months, 1 week ago 0 / 540 runs (0.0%)
  • NEW
  • 2 months, 2 weeks ago
  • [CI][SHARDS] igt@drv_hangman@error-state-* - fail - Failed assertion: found
  • SNB: igt@drv_hangman@error-state-capture-render - fail - Failed assertion: found : 0 / 0 runs (0.0%)
7 months, 2 weeks ago 0 / 0 runs (0.0%)
  • CLOSED/FIXED
  • 7 months, 4 weeks ago
  • spec@!opengl 3.0@dlist-uint-uniforms fails on all SNB, HSW, SKL, GLK
  • pig-*: spec@!opengl 3.0@dlist-uint-uniforms - fail : 6 / 6 runs (100.0%)
7 months, 4 weeks ago 6 / 6 runs (100.0%)
  • CLOSED/FIXED
  • 7 months, 4 weeks ago
  • [CI][Intel-GFX-CI] large amount of @execution@build-in-functions@ tests crash
  • piglit: @execution@build-in-functions@ - incomplete : 0 / 0 runs (0.0%)
  • piglit: @execution@build-in-functions@ - framebuffer status is incomplete : 0 / 0 runs (0.0%)
7 months, 4 weeks ago 0 / 0 runs (0.0%)
  • CLOSED/FIXED
  • 7 months ago
  • [BAT] [BSW only] igt@gem_sync@basic-each - GPU hung -> wedged -> WARN_ON(intel_gpu_reset(i915, (~0)))
  • fi-bsw-n3050: igt@kms_pipe_crc_basic@suspend-read-crc-pipe-c - WARN_ON(intel_gpu_reset(i915, (~0))) : 0 / 174 runs (0.0%)
  • fi-bsw-n3050: igt@kms_pipe_crc_basic@suspend-read-crc-pipe-c - WARN_ON(intel_gpu_reset(i915, (~0))) : 0 / 174 runs (0.0%)
  • fi-bsw-n3050: igt@kms_pipe_crc_basic@hang-read-crc-pipe-c - Failed assertion: !wedged : 0 / 174 runs (0.0%)
  • fi-bsw-n3050: igt@kms_pipe_crc_basic@hang-read-crc-pipe-c - Failed assertion: !wedged : 0 / 174 runs (0.0%)
  • fi-bsw-n3050: igt@gem_sync@basic-each - Failed assertion: !"GPU hung" : 0 / 174 runs (0.0%)
  • fi-bsw-n3050: igt@gem_sync@basic-each - Failed assertion: !"GPU hung" : 0 / 174 runs (0.0%)
8 months ago 0 / 496 runs (0.0%)
  • CLOSED/FIXED
  • 9 months ago
  • [CI] [CNL only] igt@debugfs_test@read_all_entries - fail - Timed out: reading sysfs entry (file "data")
  • fi-cnl-psr: igt@debugfs_test@read_all_entries - fail - Timed out: reading sysfs entry (file "data") : 1 / 110 runs (0.9%)
8 months ago 17 / 196 runs (8.7%)
  • CLOSED/WORKSFORME
  • 8 months ago
  • [CI] igt@gem_eio@in-flight-immediate - fail - Failed assertion: __igt_device_drop_master(fd) == 0
  • shard-glkb?: igt@gem_eio@in-flight-immediate - Failed assertion: __igt_device_drop_master\(fd\) == 0 : 0 / 201 runs (0.0%)
8 months ago 0 / 201 runs (0.0%)
  • CLOSED/FIXED
  • 8 months ago
  • [CI] igt@gem_eio@in-flight-suspend - dmesg-warn - *ERROR* timeout waiting for GT wells to go off
  • fi-bsw-n3050 fi-byt-*: igt@gem_eio@in-flight-suspend - timeout waiting for GT wells to go off : 8 / 24 runs (33.3%)
8 months ago 22 / 38 runs (57.9%)
  • CLOSED/WORKSFORME
  • 8 months ago
  • [CI] igt@kms_cursor_legacy@2x-(long-)nonblocking-modeset-vs-cursor-atomic - incomplete
  • fi-skl-6770hq: igt@kms_cursor_legacy@2x-(long-)nonblocking-modeset-vs-cursor-atomic - incomplete : 8 / 24 runs (33.3%)
8 months ago 9 / 25 runs (36.0%)
  • CLOSED/WORKSFORME
  • 8 months ago
  • [CI] igt@gem_wait@wait-default - fail - Failed assertion: wait.timeout_ns > 0
  • all machines: igt@gem_wait@* - Failed assertion: wait.timeout_ns > 0 : 0 / 292 runs (0.0%)
8 months ago 0 / 292 runs (0.0%)
  • CLOSED/FIXED
  • 8 months ago
  • [CI] igt@gem_wait@basic-wait-all - fail - Failed assertion: !"GPU hung"
  • fi-bxt-dsi: igt@gem_wait@basic-wait-all - fail - Failed assertion: !"GPU hung" : 0 / 176 runs (0.0%)
8 months ago 0 / 176 runs (0.0%)
  • CLOSED/FIXED
  • 8 months ago
  • [CI] igt@drv_module_reload@basic-reload - dmesg-fail - Failed assertion: __gem_execbuf(fd, execbuf) == 0 && Failed to idle engines, declaring wedged!
  • bsw glk: igt@drv_module_reload@basic-* - dmesg-fail - Failed assertion: __gem_execbuf(fd, execbuf) == 0 && Failed to idle engines, declaring wedged! : 7 / 256 runs (2.7%)
  • glk: all tests - fail - gen6_render_flush: Assertion `ret == 0' failed. : 0 / 257 runs (0.0%)
8 months ago 7 / 261 runs (2.7%)
  • CLOSED/FIXED
  • 7 months, 2 weeks ago
  • [CI] igt@perf@oa-formats - dmesg-warn - BUG: sleeping function called from invalid context at arch/x86/mm/fault.c:1342
  • fi-hsw-4770: igt@perf@oa-formats - dmesg-warn - BUG: sleeping function called from invalid context at arch/x86/mm/fault.c:1342 : 0 / 16 runs (0.0%)
8 months ago 0 / 16 runs (0.0%)
  • CLOSED/FIXED
  • 8 months ago
  • [CI][IGT] DRM-Tip 4.17-rc5 pull made igt@gem_eio@ tests unstable
  • all: gem_eio - 915_gem_reset_prepare_engine : 1 / 37 runs (2.7%)
8 months ago 1 / 37 runs (2.7%)
  • CLOSED/FIXED
  • 8 months ago
  • [CI] igt@.* - BUG kmalloc-2048 (Tainted: G U W ): Poison overwritten
  • fi-ivb-3520m: all tests - BUG kmalloc-2048 (*): Poison overwritten : 0 / 0 runs (0.0%)
8 months ago 65 / 223 runs (29.1%)
  • CLOSED/NOTOURBUG
  • 7 months, 2 weeks ago
  • [CI] igt@gem_exec_suspend@basic-s4-devices - dmesg-warn - list_del corruption, ffffea0004070420->next is LIST_POISON1 (dead000000000100)
  • fi-ivb-3520m: igt@*(s4|hibernate)* - dmesg-warn - list_del corruption, ffffea0004070420->next is LIST_POISON1 (dead000000000100) : 0 / 122 runs (0.0%)
8 months ago 0 / 122 runs (0.0%)
  • CLOSED/FIXED
  • 8 months, 2 weeks ago
  • [CI] igt@* - crash / dmesg-fail - kernel BUG at drivers/dma-buf/dma-fence.c:569!
  • shard-apl: igt@* - fail : 0 / 50 runs (0.0%)
  • all machines: all tests - kernel BUG at drivers/dma-buf/dma-fence.c:569! : 0 / 105 runs (0.0%)
  • all machines: igt@kms_atomic_interruptible@* - crash : 0 / 56 runs (0.0%)
8 months ago 1 / 153 runs (0.7%)
  • CLOSED/FIXED
  • 8 months, 1 week ago
  • [CI][drv_selftest] WARN_ON(debug_locks && !lock_is_held(&(&i915->drm.struct_mutex)->dep_map))
  • drv_selftest: WARN_ON(debug_locks && !lock_is_held(&(&i915->drm.struct_mutex)->dep_map)) : 0 / 0 runs (0.0%)
8 months, 1 week ago 0 / 33 runs (0.0%)
  • CLOSED/WORKSFORME
  • 8 months, 2 weeks ago
  • [BAT] [BDW only] igt@* -incomplete timeout/system hang?
  • fi-bdw-5557u: incomplete in suspend tests : 0 / 143 runs (0.0%)
8 months, 1 week ago 8 / 723 runs (1.1%)
  • NEW
  • 4 months ago
  • [CI] igt@* - incomplete - ext4 issue
  • fi-kbl-7567u: igt@kms_cursor_legacy@pipe-b-single-move - incomplete : 0 / 10 runs (0.0%)
8 months, 2 weeks ago 0 / 10 runs (0.0%)
  • CLOSED/WORKSFORME
  • 5 months, 2 weeks ago
  • [CI] igt@kms_flip@flip-vs-panning-vs-hang - incomplete
  • fi-pnv-d510: igt@kms_flip@flip-vs-panning-vs-hang - incomplete : 0 / 5 runs (0.0%)
8 months, 2 weeks ago 0 / 16 runs (0.0%)
  • REOPENED
  • 4 months ago
  • [BAT] igt@* incomplete - system hang ?
  • fi-cfl-s3: all tests - incomplete : 0 / 124 runs (0.0%)
8 months, 2 weeks ago 1 / 224 runs (0.4%)
  • CLOSED/FIXED
  • 8 months, 2 weeks ago
  • [CI] igt@kms_pipe_crc_basic@suspend-read-crc-pipe-a - dmesg-warn - *ERROR* timeout during PHY0 power on
  • fi-glk-j4005: igt@*suspend* - *ERROR* timeout during PHY\d power on : 2 / 100 runs (2.0%)
8 months, 2 weeks ago 2 / 104 runs (1.9%)
  • CLOSED/FIXED
  • 8 months, 2 weeks ago
  • [CI] spec@glsl-1.40-compat@execution@built-in-constants failing
  • piglit:spec@glsl-1.40-compat@execution@built-in-constants : 28 / 28 runs (100.0%)
8 months, 2 weeks ago 27 / 27 runs (100.0%)
  • CLOSED/FIXED
  • 8 months, 2 weeks ago
  • [CI] igt@drv_selftest@mock_breadcrumbs - breadcrumbs returned 10000, conflicting with selftest's magic values!
  • all machines: igt@drv_selftest@mock_breadcrumbs - breadcrumbs returned (9124|10000), conflicting with selftest's magic values! : 58 / 73 runs (79.5%)
8 months, 2 weeks ago 58 / 73 runs (79.5%)
  • CLOSED/DUPLICATE
  • 7 months ago
  • [CI] igt@gem_exec_reloc@basic-wc-(gtt)-noreloc - fail - Failed assertion: reloc.presumed_offset == offset
  • fi-gdg-551: igt@gem_exec_reloc@basic-wc-(gtt)-noreloc - fail - Failed assertion: reloc.presumed_offset == offset : 0 / 0 runs (0.0%)
8 months, 2 weeks ago 0 / 0 runs (0.0%)
  • CLOSED/FIXED
  • 8 months, 3 weeks ago
  • [CI] igt@prime_mmap@test_userptr - fail - Failed assertion: __gem_userptr(fd, ptr, size, read_only, flags, handle) == 0
  • fi-bwr-2160: igt@prime_mmap@test_userptr - Failed assertion: __gem_userptr(fd, ptr, size, read_only, flags, handle) == 0 : 0 / 4 runs (0.0%)
8 months, 3 weeks ago 15 / 19 runs (78.9%)
  • CLOSED/NOTOURBUG
  • 8 months, 3 weeks ago
  • [CI][ILK] Monitor-side issue with fi-ilk-650
  • ilk-650:[drm:intel_dp_get_link_train_fallback_values [i915]] *ERROR* Link Training Unsuccessful : 0 / 0 runs (0.0%)
8 months, 3 weeks ago 0 / 0 runs (0.0%)
  • CLOSED/FIXED
  • 9 months ago
  • [IGT] kms_frontbuffer_tracking@fbc-*draw* has inconsistent results - FBC disabled | Failed assertion: !fbc_wait_until_enabled()
  • shard-all: all tests - Failed assertion: !fbc_wait_until_enabled() : 0 / 0 runs (0.0%)
  • [shards] Failed assertion: fbc_is_enabled(IGT_LOG_WARN) : 0 / 0 runs (0.0%)
8 months, 3 weeks ago 251 / 251 runs (100.0%)
  • NEW
  • 1 month, 4 weeks ago
  • [CI][GLK] [drm:drm_add_edid_modes] *ERROR* Unknown HDMI VIC: 0
  • GLK:[drm:drm_add_edid_modes] *ERROR* Unknown HDMI VIC: 0 : 0 / 0 runs (0.0%)
8 months, 3 weeks ago 0 / 0 runs (0.0%)
  • CLOSED/FIXED
  • 9 months ago
  • [CI] igt@kms_plane_scaling@* - fail - Test assertion failure function do_display_commit, Last errno: 13, Permission denied
  • shard-glkb: igt@kms_plane_scaling@* - fail - do_display_commit, Last errno: 13, Permission denied : 0 / 30 runs (0.0%)
8 months, 4 weeks ago 0 / 48 runs (0.0%)
  • CLOSED/FIXED
  • 9 months ago
  • [CI] igt@drv_module_reload@basic-no-display - fail - igt_kmod-WARNING: Could not unload i915 -Failed assertion: reload("disable_display=1") == 0
  • shard-glk: igt@drv_module_reload@basic-no-display - Failed assertion: reload\("disable_display=1"\) == 0 : 0 / 21 runs (0.0%)
8 months, 4 weeks ago 0 / 21 runs (0.0%)
  • CLOSED/FIXED
  • 4 months, 3 weeks ago
  • [CI] igt@kms_frontbuffer_tracking@* - fail - FBC disabled: mode too large for compression
  • All machines: all tests - FBC disabled: mode too large for compression : 0 / 67 runs (0.0%)
8 months, 4 weeks ago 16 / 294 runs (5.4%)
  • CLOSED/FIXED
  • 9 months ago
  • [CI] igt@drv_module_reload@basic-no-display - i915: unknown parameter 'enable_guc_loading' ignored && WARNING: CPU: 7 PID: 1530 at lib/plist.c:42 plist_check_prev_next+0x2d/0x40
  • fi-skl-guc: igt@drv_module_reload@basic-no-display - dmesg-fail - WARNING at lib/plist.c:42 plist_check_prev_next : 0 / 22 runs (0.0%)
  • fi-skl-guc: igt@drv_module_reload@* - dmesg-fail - BUG: unable to handle kernel paging request : 0 / 22 runs (0.0%)
  • fi-skl-guc: igt@kms_cursor_crc@cursor-128x128-sliding - incomplete : 0 / 3 runs (0.0%)
9 months ago 0 / 25 runs (0.0%)
  • CLOSED/WORKSFORME
  • 9 months ago
  • [CI] [KBL only] igt@drv_module_reload@basic-reload - dmesg-warn - WARN_ON(!intel_irqs_enabled(dev_priv))